{"text_format":"1","workbook":"xlsx","n_sheets":17,"sheets":["Preamble","Change Log","Instructions","Logic Flowchart","Strain Pole 1 Input","Strain Pole 2 Input","Strain Pole 3 Input","Strain Pole 4 Input","Strain Pole 5 Input","Strain Pole 6 Input","Strain Pole 7 Input","Strain Pole 8 Input","Strain Pole 9 Input","Strain Pole 10 Input","RESULTS","Equipment Loading","Lists"],"not_rendered":{"charts":0,"images":4,"macros":1,"external_links":3,"defined_names":43,"comments":0,"pivot_tables":0},"unopened":[],"bounds":{"document_bytes":16777216,"sheet_cells":100000,"rows_first":2000,"rows_last":500,"rows_between":2000,"halvings":0,"cell_chars":16384,"cell_head_chars":4096},"cells_cut":0,"cells_raw":0,"read":"whole","date_system":"1900"}

{"sheet":"Preamble","index":0,"n_rows":11,"n_cols":4,"rows_kept":11,"cut":false,"hidden":false,"merged":[[8,2,8,15],[9,2,9,15],[10,2,10,15],[1,1,1,15],[4,1,4,15],[5,2,5,15],[6,2,6,15],[7,2,7,15],[2,1,2,2],[2,3,2,15],[3,1,3,15]]}
[]
[null,"Engineering Manual Preamble"]
[null,"Revised",null,"2023-December"]
[]
[null,"This tool provides guidance to administrative, engineering, and technical staff. Engineering practice requires that professionals use a combination of technical skills and judgment in decision making. Engineering judgment is necessary to allow decisions to account for unique site-specific conditions and considerations to provide high quality products, within budget, and to protect the public health, safety, and welfare. This tool provides the general operational guidelines; however, it is understood that adaptation, adjustments, and deviations are sometimes necessary. Innovation is a key foundational element to advance the state of engineering practice and develop more effective and efficient engineering solutions and materials. As such, it is essential that our engineering manuals provide a vehicle to promote, pilot, or implement technologies or practices that provide efficiencies and quality products, while maintaining the safety, health, and welfare of the public. It is expected when making significant or impactful deviations from the technical information from these guidance materials, that reasonable consultations with experts, technical committees, and/or policy setting bodies occur prior to actions within the timeframes allowed. It is also expected that these consultations will eliminate any potential conflicts of interest, perceived or otherwise. MDOT Leadership is committed to a culture of innovation to optimize engineering solutions. The National Society of Professional Engineers Code of Ethics for Engineering is founded on six fundamental canons. Those canons are provided below. Engineers, in the fulfillment of their professional duties, shall:"]
[null,null,"1. Hold paramount the safety, health, and welfare of the public."]
[null,null,"2. Perform Services only in areas of their competence."]
[null,null,"3. Issue public statement only in an objective and truthful manner."]
[null,null,"4. Act for each employer or client as faithful agents or trustees."]
[null,null,"5. Avoid deceptive acts."]
{"$rows_left_out":2}
{"sheet":"Change Log","index":1,"n_rows":13,"n_cols":3,"rows_kept":13,"cut":false,"hidden":false,"merged":[[1,1,1,15],[3,2,3,15],[10,2,10,11]]}
[]
[null,"Strain Pole Scoping Tool Change Log"]
[]
[null,"v0.5","ALPHA VERSION"]
[null,null,"• Initial release"]
[]
[null,"v0.6","BETA VERSION"]
[null,null,"• Addressing user comments"]
[]
[null,"v1.0","INITIAL RELEASE"]
{"$rows_left_out":4}
{"sheet":"Instructions","index":2,"n_rows":78,"n_cols":10,"rows_kept":78,"cut":false,"hidden":false,"merged":[[41,1,41,15],[38,1,38,15],[39,1,39,15],[40,1,40,15],[16,1,17,15],[1,1,1,15],[2,1,2,15],[3,1,3,15],[4,1,4,15],[5,1,5,15],[6,1,6,15],[13,1,13,15],[14,1,14,15],[15,1,15,15],[8,1,8,15],[50,9,50,12],[43,3,43,4],[43,5,43,8],[43,9,43,12],[44,3,44,4],[45,3,45,4],[46,3,46,4],[44,5,44,8],[45,5,45,8],[46,5,46,8],[44,9,44,12],[47,3,47,4],[47,5,47,8],[47,9,47,12],[48,3,48,4],[48,5,48,8],[48,9,48,12],[46,9,46,12],[45,9,45,12],[43,1,43,2],[44,1,46,2],[47,1,51,2],[52,1,56,2],[55,3,55,4],[55,5,55,8],[55,9,55,12],[51,3,51,4],[51,5,51,8],[51,9,51,12],[52,3,52,4],[52,5,52,8],[52,9,52,12],[53,3,53,4],[53,5,53,8],[53,9,53,12],[54,3,54,4],[54,5,54,8],[54,9,54,12],[49,3,49,4],[49,5,49,8],[49,9,49,12],[50,3,50,4],[50,5,50,8],[58,1,58,15],[60,1,60,15],[62,1,62,2],[62,3,62,4],[62,5,62,8],[62,9,62,12],[56,3,56,4],[56,5,56,8],[56,9,56,12],[63,1,65,2],[63,3,63,4],[63,5,63,8],[63,9,63,12],[64,3,64,4],[64,5,64,8],[64,9,64,12],[65,3,65,4],[65,5,65,8],[65,9,65,12],[67,5,67,8],[67,9,67,12],[68,3,68,4],[68,5,68,8],[68,9,68,12],[69,3,69,4],[69,5,69,8],[69,9,69,12],[70,3,70,4],[70,5,70,8],[70,9,70,12],[77,1,77,15],[76,1,76,15],[57,1,57,15],[71,1,75,2],[71,3,71,4],[71,5,71,8],[71,9,71,12],[72,3,72,4],[72,5,72,8],[72,9,72,12],[73,3,73,4],[73,5,73,8],[73,9,73,12],[74,3,74,4],[74,5,74,8],[74,9,74,12],[75,3,75,4],[75,5,75,8],[75,9,75,12],[66,1,70,2],[66,3,66,4],[66,5,66,8],[66,9,66,12],[67,3,67,4]]}
[]
[null,"STRAIN POLE EVALUATION TOOL AND LOGIC FLOWCHART"]
[null,"MDOT Traffic and Safety Support Area"]
[]
[null,"PURPOSE"]
[]
[null,"This tool is intended to assist in scoping intersections with steel or wood strain poles where the proposed work would change the configuration of signs or signals carried by the span wire and therefore have an impact on the structural adequacy of the poles and their foundations.  For example, this tool should be used to inform projects intending to add backplates and/or tethering to existing strain poles."]
[]
[null,"Training Tutorial Video Links"]
[null,"Part 1:","https://youtu.be/DQEAKf36vX0"]
{"$rows_left_out":69}
{"sheet":"Logic Flowchart","index":3,"n_rows":35,"n_cols":2,"rows_kept":35,"cut":false,"hidden":false,"merged":[[34,1,62,11]]}
[null,"Strain Pole Scoping Tool"]
[null,"FLOWCHART SHOWING THE LOGIC OF HOW USER INPUTS LEAD TO RECOMMENDATIONS."]
[]
[]
[]
[]
[]
[]
[]
[]
{"$rows_left_out":26}
{"sheet":"Strain Pole 1 Input","index":4,"n_rows":48,"n_cols":9,"rows_kept":48,"cut":false,"hidden":false,"merged":[[20,1,20,9],[1,1,1,2],[1,3,1,6],[2,3,2,6],[3,3,3,6],[3,8,3,9],[11,1,11,9],[13,1,13,9],[18,1,18,9],[5,2,5,6],[5,8,5,9],[7,1,7,9],[16,1,16,9],[47,1,47,9],[27,1,27,9],[30,1,30,9],[41,1,41,9],[44,3,44,9],[43,1,43,9],[32,3,32,9],[33,3,33,9],[36,3,36,9],[37,3,37,9]]}
[]
[null,"Intersection Description: ",null,null,null,null,null,"Pole #:",1]
[]
[null,null,null,null,null,null,null,"Structure ID:"]
[]
[null,"Pole Location:",null,null,null,null,null,"CS Spot Location:"]
[]
[null,"INITIAL CHECK"]
[]
[null,null,"Is additional equipment (or heavier equipment) being added to the intersection?"]
{"$rows_left_out":39}
{"sheet":"Strain Pole 2 Input","index":5,"n_rows":51,"n_cols":9,"rows_kept":51,"cut":false,"hidden":false,"merged":[[21,1,21,9],[23,1,23,9],[8,1,8,9],[1,1,1,2],[1,3,1,6],[2,3,2,6],[3,3,3,6],[3,8,3,9],[10,1,10,9],[14,1,14,9],[16,1,16,9],[19,1,19,9],[5,2,5,6],[5,8,5,9],[50,1,50,9],[30,1,30,9],[33,1,33,9],[44,1,44,9],[47,3,47,9],[46,1,46,9],[35,3,35,9],[36,3,36,9],[39,3,39,9],[40,3,40,9]]}
[]
[null,"Intersection Description: ",null,{"$f":"IF('Strain Pole 1 Input'!D2=0,\"\",'Strain Pole 1 Input'!D2)","v":""},null,null,null,"Pole #:",2]
[null,null,null,{"$f":"IF('Strain Pole 1 Input'!D3=0,\"\",'Strain Pole 1 Input'!D3)","v":""}]
[null,null,null,{"$f":"IF('Strain Pole 1 Input'!D4=0,\"\",'Strain Pole 1 Input'!D4)","v":""},null,null,null,"Structure ID:"]
[]
[null,"Pole Location:",null,null,null,null,null,"CS Spot Location:",{"$f":"IF('Strain Pole 1 Input'!I6=0,\"\",'Strain Pole 1 Input'!I6)","v":""}]
[]
[null,null,"  Is Pole 2 identical to Pole 1?"]
[null,{"$f":"IF(B8=Lists!A2,\"All work associated with pole 1 has been applied to pole 2.\",\"\")","v":""}]
[]
{"$rows_left_out":42}
{"sheet":"Strain Pole 3 Input","index":6,"n_rows":51,"n_cols":9,"rows_kept":51,"cut":false,"hidden":false,"merged":[[21,1,21,9],[23,1,23,9],[8,1,8,9],[1,1,1,2],[1,3,1,6],[2,3,2,6],[3,3,3,6],[3,8,3,9],[10,1,10,9],[14,1,14,9],[16,1,16,9],[19,1,19,9],[5,2,5,6],[5,8,5,9],[50,1,50,9],[30,1,30,9],[33,1,33,9],[44,1,44,9],[47,3,47,9],[46,1,46,9],[35,3,35,9],[36,3,36,9],[39,3,39,9],[40,3,40,9]]}
[]
[null,"Intersection Description: ",null,{"$f":"IF('Strain Pole 1 Input'!D2=0,\"\",'Strain Pole 1 Input'!D2)","v":""},null,null,null,"Pole #:",3]
[null,null,null,{"$f":"IF('Strain Pole 1 Input'!D3=0,\"\",'Strain Pole 1 Input'!D3)","v":""}]
[null,null,null,{"$f":"IF('Strain Pole 1 Input'!D4=0,\"\",'Strain Pole 1 Input'!D4)","v":""},null,null,null,"Structure ID:"]
[]
[null,"Pole Location:",null,null,null,null,null,"CS Spot Location:",{"$f":"IF('Strain Pole 1 Input'!I6=0,\"\",'Strain Pole 1 Input'!I6)","v":""}]
[]
[null,null,"  Is Pole 3 identical to another pole?"]
[null,{"$f":"IF(B8=Lists!A19,\"All work associated with pole 1 has been applied to pole 3.\",IF(B8=Lists!A20,\"All work associated with pole 2 has been applied to pole 3.\",\"\"))","v":""}]
[]
{"$rows_left_out":42}
{"sheet":"Strain Pole 4 Input","index":7,"n_rows":51,"n_cols":9,"rows_kept":51,"cut":false,"hidden":false,"merged":[[21,1,21,9],[23,1,23,9],[8,1,8,9],[1,1,1,2],[1,3,1,6],[2,3,2,6],[3,3,3,6],[3,8,3,9],[10,1,10,9],[14,1,14,9],[16,1,16,9],[19,1,19,9],[5,2,5,6],[5,8,5,9],[50,1,50,9],[30,1,30,9],[33,1,33,9],[44,1,44,9],[47,3,47,9],[46,1,46,9],[35,3,35,9],[36,3,36,9],[39,3,39,9],[40,3,40,9]]}
[]
[null,"Intersection Description: ",null,{"$f":"IF('Strain Pole 1 Input'!D2=0,\"\",'Strain Pole 1 Input'!D2)","v":""},null,null,null,"Pole #:",4]
[null,null,null,{"$f":"IF('Strain Pole 1 Input'!D3=0,\"\",'Strain Pole 1 Input'!D3)","v":""}]
[null,null,null,{"$f":"IF('Strain Pole 1 Input'!D4=0,\"\",'Strain Pole 1 Input'!D4)","v":""},null,null,null,"Structure ID:"]
[]
[null,"Pole Location:",null,null,null,null,null,"CS Spot Location:",{"$f":"IF('Strain Pole 1 Input'!I6=0,\"\",'Strain Pole 1 Input'!I6)","v":""}]
[]
[null,null,"  Is Pole 4 identical to another pole?"]
[null,{"$f":"IF(B8=Lists!A19,\"All work associated with pole 1 has been applied to pole 4.\",IF(B8=Lists!A20,\"All work associated with pole 2 has been applied to pole 4.\",IF(B8=Lists!A21,\"All work associated with pole 3 has been applied to pole 4.\",\"\")))","v":""}]
[]
{"$rows_left_out":42}
{"sheet":"Strain Pole 5 Input","index":8,"n_rows":51,"n_cols":9,"rows_kept":51,"cut":false,"hidden":false,"merged":[[36,3,36,9],[1,1,1,2],[1,3,1,6],[2,3,2,6],[3,3,3,6],[3,8,3,9],[5,2,5,6],[5,8,5,9],[50,1,50,9],[47,3,47,9],[46,1,46,9],[8,1,8,9],[10,1,10,9],[14,1,14,9],[16,1,16,9],[19,1,19,9],[21,1,21,9],[23,1,23,9],[30,1,30,9],[33,1,33,9],[44,1,44,9],[39,3,39,9],[40,3,40,9],[35,3,35,9]]}
[]
[null,"Intersection Description: ",null,{"$f":"IF('Strain Pole 1 Input'!D2=0,\"\",'Strain Pole 1 Input'!D2)","v":""},null,null,null,"Pole #:",5]
[null,null,null,{"$f":"IF('Strain Pole 1 Input'!D3=0,\"\",'Strain Pole 1 Input'!D3)","v":""}]
[null,null,null,{"$f":"IF('Strain Pole 1 Input'!D4=0,\"\",'Strain Pole 1 Input'!D4)","v":""},null,null,null,"Structure ID:"]
[]
[null,"Pole Location:",null,null,null,null,null,"CS Spot Location:",{"$f":"IF('Strain Pole 1 Input'!I6=0,\"\",'Strain Pole 1 Input'!I6)","v":""}]
[]
[null,null,"  Is Pole 5 identical to another pole?"]
[null,{"$f":"IF(B8=Lists!A19,\"All work associated with pole 1 has been applied to pole 5.\",IF(B8=Lists!A20,\"All work associated with pole 2 has been applied to pole 5.\",IF(B8=Lists!A21,\"All work associated with pole 3 has been applied to pole 5.\",IF(B8=Lists!A22,\"All work associated with pole 4 has been applied to pole 5.\",\"\"))))","v":""}]
[]
{"$rows_left_out":42}
{"sheet":"Strain Pole 6 Input","index":9,"n_rows":51,"n_cols":9,"rows_kept":51,"cut":false,"hidden":false,"merged":[[1,1,1,2],[1,3,1,6],[2,3,2,6],[3,3,3,6],[3,8,3,9],[5,2,5,6],[5,8,5,9],[21,1,21,9],[8,1,8,9],[10,1,10,9],[14,1,14,9],[16,1,16,9],[19,1,19,9],[50,1,50,9],[23,1,23,9],[30,1,30,9],[33,1,33,9],[35,3,35,9],[36,3,36,9],[39,3,39,9],[40,3,40,9],[44,1,44,9],[46,1,46,9],[47,3,47,9]]}
[]
[null,"Intersection Description: ",null,{"$f":"IF('Strain Pole 1 Input'!D2=0,\"\",'Strain Pole 1 Input'!D2)","v":""},null,null,null,"Pole #:",6]
[null,null,null,{"$f":"IF('Strain Pole 1 Input'!D3=0,\"\",'Strain Pole 1 Input'!D3)","v":""}]
[null,null,null,{"$f":"IF('Strain Pole 1 Input'!D4=0,\"\",'Strain Pole 1 Input'!D4)","v":""},null,null,null,"Structure ID:"]
[]
[null,"Pole Location:",null,null,null,null,null,"CS Spot Location:",{"$f":"IF('Strain Pole 1 Input'!I6=0,\"\",'Strain Pole 1 Input'!I6)","v":""}]
[]
[null,null,"  Is Pole 6 identical to another pole?"]
[null,{"$f":"IF(B8=Lists!A19,\"All work associated with pole 1 has been applied to pole 6.\",IF(B8=Lists!A20,\"All work associated with pole 2 has been applied to pole 6.\",IF(B8=Lists!A21,\"All work associated with pole 3 has been applied to pole 6.\",IF(B8=Lists!A22,\"All work associated with pole 4 has been applied to pole 6.\",IF(B8=Lists!A23,\"All work associated with pole 5 has been applied to pole 6.\",\"\")))))","v":""}]
[]
{"$rows_left_out":42}
{"sheet":"Strain Pole 7 Input","index":10,"n_rows":51,"n_cols":9,"rows_kept":51,"cut":false,"hidden":false,"merged":[[21,1,21,9],[8,1,8,9],[1,1,1,2],[1,3,1,6],[2,3,2,6],[3,3,3,6],[3,8,3,9],[10,1,10,9],[14,1,14,9],[16,1,16,9],[19,1,19,9],[5,2,5,6],[5,8,5,9],[50,1,50,9],[23,1,23,9],[30,1,30,9],[33,1,33,9],[35,3,35,9],[36,3,36,9],[39,3,39,9],[40,3,40,9],[44,1,44,9],[46,1,46,9],[47,3,47,9]]}
[]
[null,"Intersection Description: ",null,{"$f":"IF('Strain Pole 1 Input'!D2=0,\"\",'Strain Pole 1 Input'!D2)","v":""},null,null,null,"Pole #:",7]
[null,null,null,{"$f":"IF('Strain Pole 1 Input'!D3=0,\"\",'Strain Pole 1 Input'!D3)","v":""}]
[null,null,null,{"$f":"IF('Strain Pole 1 Input'!D4=0,\"\",'Strain Pole 1 Input'!D4)","v":""},null,null,null,"Structure ID:"]
[]
[null,"Pole Location:",null,null,null,null,null,"CS Spot Location:",{"$f":"IF('Strain Pole 1 Input'!I6=0,\"\",'Strain Pole 1 Input'!I6)","v":""}]
[]
[null,null,"  Is Pole 7 identical to another pole?"]
[null,{"$f":"IF(B8=Lists!A19,\"All work associated with pole 1 has been applied to pole 7.\",IF(B8=Lists!A20,\"All work associated with pole 2 has been applied to pole 7.\",IF(B8=Lists!A21,\"All work associated with pole 3 has been applied to pole 7.\",IF(B8=Lists!A22,\"All work associated with pole 4 has been applied to pole 7.\",IF(B8=Lists!A23,\"All work associated with pole 5 has been applied to pole 7.\",IF(B8=Lists!A24,\"All work associated with pole 6 has been applied to pole 7.\",\"\"))))))","v":""}]
[]
{"$rows_left_out":42}
{"sheet":"Strain Pole 8 Input","index":11,"n_rows":51,"n_cols":9,"rows_kept":51,"cut":false,"hidden":false,"merged":[[21,1,21,9],[1,1,1,2],[1,3,1,6],[2,3,2,6],[3,3,3,6],[3,8,3,9],[8,1,8,9],[10,1,10,9],[14,1,14,9],[16,1,16,9],[19,1,19,9],[5,2,5,6],[5,8,5,9],[50,1,50,9],[23,1,23,9],[30,1,30,9],[33,1,33,9],[35,3,35,9],[36,3,36,9],[39,3,39,9],[40,3,40,9],[44,1,44,9],[46,1,46,9],[47,3,47,9]]}
[]
[null,"Intersection Description: ",null,{"$f":"IF('Strain Pole 1 Input'!D2=0,\"\",'Strain Pole 1 Input'!D2)","v":""},null,null,null,"Pole #:",8]
[null,null,null,{"$f":"IF('Strain Pole 1 Input'!D3=0,\"\",'Strain Pole 1 Input'!D3)","v":""}]
[null,null,null,{"$f":"IF('Strain Pole 1 Input'!D4=0,\"\",'Strain Pole 1 Input'!D4)","v":""},null,null,null,"Structure ID:"]
[]
[null,"Pole Location:",null,null,null,null,null,"CS Spot Location:",{"$f":"IF('Strain Pole 1 Input'!I6=0,\"\",'Strain Pole 1 Input'!I6)","v":""}]
[]
[null,null,"  Is Pole 8 identical to another pole?"]
[null,{"$f":"IF(B8=Lists!A19,\"All work associated with pole 1 has been applied to pole 8.\",IF(B8=Lists!A20,\"All work associated with pole 2 has been applied to pole 8.\",IF(B8=Lists!A21,\"All work associated with pole 3 has been applied to pole 8.\",IF(B8=Lists!A22,\"All work associated with pole 4 has been applied to pole 8.\",IF(B8=Lists!A23,\"All work associated with pole 5 has been applied to pole 8.\",IF(B8=Lists!A24,\"All work associated with pole 6 has been applied to pole 8.\",IF(B8=Lists!A25,\"All work associated with pole 7 has been applied to pole 8.\",\"\")))))))","v":""}]
[]
{"$rows_left_out":42}
{"sheet":"Strain Pole 9 Input","index":12,"n_rows":51,"n_cols":9,"rows_kept":51,"cut":false,"hidden":false,"merged":[[21,1,21,9],[1,1,1,2],[1,3,1,6],[2,3,2,6],[3,3,3,6],[3,8,3,9],[8,1,8,9],[10,1,10,9],[14,1,14,9],[16,1,16,9],[19,1,19,9],[5,2,5,6],[5,8,5,9],[50,1,50,9],[23,1,23,9],[30,1,30,9],[33,1,33,9],[35,3,35,9],[36,3,36,9],[39,3,39,9],[40,3,40,9],[44,1,44,9],[46,1,46,9],[47,3,47,9]]}
[]
[null,"Intersection Description: ",null,{"$f":"IF('Strain Pole 1 Input'!D2=0,\"\",'Strain Pole 1 Input'!D2)","v":""},null,null,null,"Pole #:",9]
[null,null,null,{"$f":"IF('Strain Pole 1 Input'!D3=0,\"\",'Strain Pole 1 Input'!D3)","v":""}]
[null,null,null,{"$f":"IF('Strain Pole 1 Input'!D4=0,\"\",'Strain Pole 1 Input'!D4)","v":""},null,null,null,"Structure ID:"]
[]
[null,"Pole Location:",null,null,null,null,null,"CS Spot Location:",{"$f":"IF('Strain Pole 1 Input'!I6=0,\"\",'Strain Pole 1 Input'!I6)","v":""}]
[]
[null,null,"  Is Pole 9 identical to another pole?"]
[null,{"$f":"IF(B8=Lists!A19,\"All work associated with pole 1 has been applied to pole 9.\",IF(B8=Lists!A20,\"All work associated with pole 2 has been applied to pole 9.\",IF(B8=Lists!A21,\"All work associated with pole 3 has been applied to pole 9.\",IF(B8=Lists!A22,\"All work associated with pole 4 has been applied to pole 9.\",IF(B8=Lists!A23,\"All work associated with pole 5 has been applied to pole 9.\",IF(B8=Lists!A24,\"All work associated with pole 6 has been applied to pole 9.\",IF(B8=Lists!A25,\"All work associated with pole 7 has been applied to pole 9.\",IF(B8=Lists!A26,\"All work associated with pole 8 has been applied to pole 9.\",\"\"))))))))","v":""}]
[]
{"$rows_left_out":42}
{"sheet":"Strain Pole 10 Input","index":13,"n_rows":51,"n_cols":9,"rows_kept":51,"cut":false,"hidden":false,"merged":[[21,1,21,9],[1,1,1,2],[1,3,1,6],[2,3,2,6],[3,3,3,6],[3,8,3,9],[8,1,8,9],[10,1,10,9],[14,1,14,9],[16,1,16,9],[19,1,19,9],[5,2,5,6],[5,8,5,9],[50,1,50,9],[23,1,23,9],[30,1,30,9],[33,1,33,9],[35,3,35,9],[36,3,36,9],[39,3,39,9],[40,3,40,9],[44,1,44,9],[46,1,46,9],[47,3,47,9]]}
[]
[null,"Intersection Description: ",null,{"$f":"IF('Strain Pole 1 Input'!D2=0,\"\",'Strain Pole 1 Input'!D2)","v":""},null,null,null,"Pole #:",10]
[null,null,null,{"$f":"IF('Strain Pole 1 Input'!D3=0,\"\",'Strain Pole 1 Input'!D3)","v":""}]
[null,null,null,{"$f":"IF('Strain Pole 1 Input'!D4=0,\"\",'Strain Pole 1 Input'!D4)","v":""},null,null,null,"Structure ID:"]
[]
[null,"Pole Location:",null,null,null,null,null,"CS Spot Location:",{"$f":"IF('Strain Pole 1 Input'!I6=0,\"\",'Strain Pole 1 Input'!I6)","v":""}]
[]
[null,null,"  Is Pole 10 identical to another pole?"]
[null,{"$f":"IF(B8=Lists!A19,\"All work associated with pole 1 has been applied to pole 10.\",IF(B8=Lists!A20,\"All work associated with pole 2 has been applied to pole 10.\",IF(B8=Lists!A21,\"All work associated with pole 3 has been applied to pole 10.\",IF(B8=Lists!A22,\"All work associated with pole 4 has been applied to pole 10.\",IF(B8=Lists!A23,\"All work associated with pole 5 has been applied to pole 10.\",IF(B8=Lists!A24,\"All work associated with pole 6 has been applied to pole 10.\",IF(B8=Lists!A25,\"All work associated with pole 7 has been applied to pole 10.\",IF(B8=Lists!A26,\"All work associated with pole 8 has been applied to pole 10.\",IF(B8=Lists!A27,\"All work associated with pole 9 has been applied to pole 10.\",\"\")))))))))","v":""}]
[]
{"$rows_left_out":42}
{"sheet":"RESULTS","index":14,"n_rows":18,"n_cols":15,"rows_kept":18,"cut":false,"hidden":false,"merged":[[6,1,6,14],[1,5,1,7],[3,5,3,6],[1,11,1,13],[2,11,2,12],[3,11,3,12],[1,1,3,2],[1,3,1,4],[2,3,2,4],[3,3,3,4]]}
[]
[null,null,null,"Project Name: ",null,null,null,null,null,null,"Intersection Name:"]
[null,null,null,null,null,null,null,null,null,null,"MDOT CS: "]
[null,null,null,"MDOT JN: ",null,null,null,null,null,null,"MI County: "]
[]
[]
[null,"INCLUDE THE FOLLOWING WITH WORK"]
[null,"POLE #","POLE LOCATION","Proceed as is. No additional checks needed.","Full Replacement \nof Foundation \nand Pole Recommended","1a. Structural Prequalification  Needed for Site-Specific Structural Design","1b. Structural Prequalification Needed for Repair Design","2. Field Investigation to gather data for site-specific analysis of existing poles (Gather material properties, structural component sizes, soil properties, etc.)","3. Geotechnical Prequalification","Replace pole \nin-kind and \nreplace vertical connections.","Repair base plate/pole","Replace Vertical Connections","Replace Horizontal Elements (i.e. span wire, span wire connections, luminaire arm, etc.)","Outstanding repairs from RFAs and Work Recs","Repairs to address construction non-conformance report(s) or other known issues."]
[null,"Strain Pole 1",{"$f":"'Strain Pole 1 Input'!C6","v":0},{"$f":"IF('Strain Pole 1 Input'!B$10=\"No\",\"X\",IF(AND(E$9:O$9=\"\",'Strain Pole 1 Input'!B$45=Lists!A$2),\"X\",\"\"))","v":""},{"$f":"IF('Strain Pole 1 Input'!B$14=\"Full Replacement Recommended\",\"X\",IF('Strain Pole 1 Input'!B$21=\"Full Replacement Recommended\",\"X\",IF('Strain Pole 1 Input'!B$28=\"Full Replacement Recommended\",\"X\",\"\")))","v":""},{"$f":"IF('Strain Pole 1 Input'!B$43=\"No\",\"X\",IF('Strain Pole 1 Input'!B$45=Lists!A$3,\"X\",IF('Strain Pole 1 Input'!B$45=Lists!A$3,\"X\",\"\")))","v":""},{"$f":"IF('Strain Pole 1 Input'!B$25=\"Yes\",\"X\",IF(OR('Strain Pole 1 Input'!B$33=\"Yes\",'Strain Pole 1 Input'!B$34=\"Yes\"),\"X\",IF(OR('Strain Pole 1 Input'!B$37=\"Yes\",'Strain Pole 1 Input'!B$38=\"Yes\"),\"X\",\"\")))","v":""},{"$f":"IF('Strain Pole 1 Input'!B$18=\"Not Rated\",\"X\",IF(OR('Strain Pole 1 Input'!B$37=\"Yes\",'Strain Pole 1 Input'!B$38=\"Yes\"),\"X\",IF('Strain Pole 1 Input'!B$43=\"No\",\"X\",\"\")))","v":""},{"$f":"IF('Strain Pole 1 Input'!B$34=\"Yes\",\"X\",IF('Strain Pole 1 Input'!B$38=\"Yes\",\"X\",IF('Strain Pole 1 Input'!B$43=\"No\",\"X\",\"\")))","v":""},{"$f":"IF('Strain Pole 1 Input'!B$26=\"Yes\",\"X\",\"\")","v":""},{"$f":"IF('Strain Pole 1 Input'!B$25=\"Yes\",\"X\",\"\")","v":""},{"$f":"IF('Strain Pole 1 Input'!B$27=\"Yes\",\"X\",\"\")","v":""},{"$f":"IF('Strain Pole 1 Input'!B$22=\"No\",\"X\",\"\")","v":""},{"$f":"IF('Strain Pole 1 Input'!B$32=\"Yes\",\"X\",\"\")","v":""},{"$f":"IF('Strain Pole 1 Input'!B$36=\"Yes\",\"X\",\"\")","v":""}]
[null,"Strain Pole 2",{"$f":"'Strain Pole 2 Input'!C6","v":0},{"$f":"IF('Strain Pole 2 Input'!B$8=Lists!A$2,RESULTS!D$9,IF('Strain Pole 2 Input'!B$13=\"No\",\"X\",IF(AND(E$10:O$10=\"\",'Strain Pole 2 Input'!B$48=Lists!A$2),\"X\",\"\")))","v":""},{"$f":"IF('Strain Pole 2 Input'!B$8=Lists!A$2,RESULTS!E$9,IF('Strain Pole 2 Input'!B$17=\"Full Replacement Recommended\",\"X\",IF('Strain Pole 2 Input'!B$24=\"Full Replacement Recommended\",\"X\",IF('Strain Pole 2 Input'!B$31=\"Full Replacement Recommended\",\"X\",\"\"))))","v":""},{"$f":"IF('Strain Pole 2 Input'!B$8=Lists!A$2,RESULTS!F$9,IF('Strain Pole 2 Input'!B$46=\"No\",\"X\",IF('Strain Pole 2 Input'!B$48=Lists!A$3,\"X\",\"\")))","v":""},{"$f":"IF('Strain Pole 2 Input'!B$8=Lists!A$2,RESULTS!G$9,IF('Strain Pole 2 Input'!B$28=\"Yes\",\"X\",IF(OR('Strain Pole 2 Input'!B$36=\"Yes\",'Strain Pole 2 Input'!B$37=\"Yes\"),\"X\",IF(OR('Strain Pole 2 Input'!B$40=\"Yes\",'Strain Pole 2 Input'!B$41=\"Yes\"),\"X\",\"\"))))","v":""},{"$f":"IF('Strain Pole 2 Input'!B$8=Lists!A$2,RESULTS!H$9,IF('Strain Pole 2 Input'!B$21=\"Not Rated\",\"X\",IF(OR('Strain Pole 2 Input'!B$40=\"Yes\",'Strain Pole 2 Input'!B$41=\"Yes\"),\"X\",IF('Strain Pole 2 Input'!B$46=\"No\",\"X\",\"\"))))","v":""},{"$f":"IF('Strain Pole 2 Input'!B$8=Lists!A$2,RESULTS!I$9,IF('Strain Pole 2 Input'!B$37=\"Yes\",\"X\",IF('Strain Pole 2 Input'!B$41=\"Yes\",\"X\",IF('Strain Pole 2 Input'!B$46=\"No\",\"X\",\"\"))))","v":""},{"$f":"IF('Strain Pole 2 Input'!B$8=Lists!A$2,RESULTS!J$9,IF('Strain Pole 2 Input'!B$29=\"Yes\",\"X\",\"\"))","v":""},{"$f":"IF('Strain Pole 2 Input'!B$8=Lists!A$2,RESULTS!K$9,IF('Strain Pole 2 Input'!B$28=\"Yes\",\"X\",\"\"))","v":""},{"$f":"IF('Strain Pole 2 Input'!B$8=Lists!A$2,RESULTS!L$9,IF('Strain Pole 2 Input'!B$30=\"Yes\",\"X\",\"\"))","v":""},{"$f":"IF('Strain Pole 2 Input'!B$8=Lists!A$2,RESULTS!M$9,IF('Strain Pole 2 Input'!B$25=\"No\",\"X\",\"\"))","v":""},{"$f":"IF('Strain Pole 2 Input'!B$8=Lists!A$2,RESULTS!N$9,IF('Strain Pole 2 Input'!B$35=\"Yes\",\"X\",\"\"))","v":""},{"$f":"IF('Strain Pole 2 Input'!B$8=Lists!A$2,RESULTS!O$9,IF('Strain Pole 2 Input'!B$39=\"Yes\",\"X\",\"\"))","v":""}]
{"$rows_left_out":9}
{"sheet":"Equipment Loading","index":15,"n_rows":47,"n_cols":13,"rows_kept":47,"cut":false,"hidden":true,"merged":[[40,0,40,6],[0,6,1,6],[0,7,1,7],[0,8,0,9],[0,10,1,10],[0,11,1,11],[0,12,1,12],[0,0,1,0],[0,1,1,1],[0,2,1,2],[0,3,1,3],[0,4,1,4],[0,5,1,5]]}
["Code","Description","Comment/Detail","Code","Weight***\n(lbs)","Trans Area\n(sft)","Par Area\n(sft)","Bot Area\n(sft)","Height**",null,"Width\n(ft)","Depth\n(ft)","Unit Cost ($/each)"]
[null,null,null,null,null,null,null,null,"inches","feet"]
[]
["1W-1C",null,null,null,17,1.36,1.49,1.53,14,{"$f":"I4/12","v":1.1666666666666667},{"$f":"F4/J4","v":1.1657142857142857},{"$f":"H4/J4","v":1.3114285714285714}]
["1W-1C w/BP",null,null,null,21,4,1.59,1.53,24,2,2,0.76500000000000001,1000]
["1W-1C w/CS",null,null,null,49,3.61,2.15,2.25,{"$f":"I4+12","v":26},2.1666666666666665,1.6661538461538463,1.0384615384615385]
["1W-1C w/CS w/BP",null,null,null,53,6.25,2.2599999999999998,2.25,{"$f":"I5+12","v":36},3,2.0833333333333335,0.75,1200]
["1W-2C PED",null,null,null,27,2.72,3.97,1.53,28,2.3333333333333335,1.1657142857142857,0.65571428571428569]
["1W-2C PED w/BP",null,null,null,32,6.33,4.1399999999999997,1.53,38,3.1666666666666665,1.9989473684210528,0.48315789473684212,100]
["1W-2C PED w/CS",null,null,null,59,4.97,4.6399999999999997,2.25,{"$f":"I8+12","v":40},3.3333333333333335,1.4909999999999999,0.67499999999999993,100]
{"$rows_left_out":38}
{"sheet":"Lists","index":16,"n_rows":39,"n_cols":1,"rows_kept":39,"cut":false,"hidden":true,"merged":[]}
[]
["Yes"]
["No"]
[]
["Yes"]
["No"]
["Unknown"]
[]
["Yes"]
["No"]
{"$rows_left_out":29}