{"text_format":"1","workbook":"xlsx","n_sheets":7,"sheets":["Revisions","Instructions","Cars & Peds","Single Units","Heavy Vehicles","Calculations","Summary"],"not_rendered":{"charts":2,"images":0,"macros":0,"external_links":0,"defined_names":0,"comments":0,"pivot_tables":0},"unopened":[],"bounds":{"document_bytes":16777216,"sheet_cells":100000,"rows_first":2000,"rows_last":500,"rows_between":2000,"halvings":0,"cell_chars":16384,"cell_head_chars":4096},"cells_cut":0,"cells_raw":0,"read":"whole","date_system":"1900"}

{"sheet":"Revisions","index":0,"n_rows":2,"n_cols":2,"rows_kept":2,"cut":false,"hidden":false,"merged":[]}
["Revision Date","Issues Addressed"]
["2021-04-02","Initial posting to web"]

{"sheet":"Instructions","index":1,"n_rows":1,"n_cols":1,"rows_kept":1,"cut":false,"hidden":false,"merged":[]}
["Copy and paste counts into yellow cells for each of the 3 tabs (Cars & Peds, Single Units, Heavy Vehicles)  making sure times, directions, and lanes match."]

{"sheet":"Cars & Peds","index":2,"n_rows":55,"n_cols":17,"rows_kept":55,"cut":false,"hidden":false,"merged":[[9,1,9,4],[9,5,9,8],[9,9,9,12],[9,13,9,16],[0,0,0,1],[1,0,1,1],[2,0,2,1],[0,2,0,16],[1,2,1,16],[2,2,2,16],[3,0,3,1],[4,0,4,1],[5,0,5,1],[3,2,3,16],[4,2,4,16],[5,2,5,16],[8,13,8,16],[6,2,6,16],[7,2,7,16],[6,0,6,1],[7,0,7,1],[8,1,8,4],[8,5,8,8],[8,9,8,12]]}
["File Name:",null,"E:\\2016 DATA\\TURNING MOVEMENTS\\TM#202 M-24@ TURRILL LAPEER\\TM_160202_353490_10-12-2016.ppd"]
["Start Date:",null,"10/12/2016"]
["Start Time:",null,"7:00:00 AM"]
["Site Code:",null,"160202"]
["Major Road:",null,"M-24 (LAPEER RD)"]
["Minor Road:",null,"TURRILL RD"]
["City/Township:",null,"LAPEER TWP"]
["County:",null,"LAPEER"]
[null,"M-24/LAPEER RD",null,null,null,"TURRILL RD",null,null,null,"M-24/LAPEER RD",null,null,null,"TURRILL RD"]
[null,"Northbound",null,null,null,"Eastbound",null,null,null,"Southbound",null,null,null,"Westbound"]
["Start Time","Right","Thru","Left","Peds","Right","Thru","Left","Peds","Right","Thru","Left","Peds","Right","Thru","Left","Peds"]
["07:00 AM",11,18,25,0,1,56,7,0,60,33,7,0,1,195,26,0]
["07:15 AM",13,18,19,0,2,63,6,0,72,46,14,0,1,217,32,0]
["07:30 AM",17,18,22,0,5,73,10,0,49,64,10,0,0,206,30,0]
["07:45 AM",16,24,28,0,3,61,20,0,38,67,11,0,2,145,43,0]
["08:00 AM",32,30,32,0,5,73,6,0,38,37,3,0,2,137,28,0]
["08:15 AM",17,16,30,0,5,85,15,0,32,35,13,0,0,135,15,0]
["08:30 AM",9,16,13,0,3,88,18,0,36,17,11,0,1,148,23,0]
["08:45 AM",13,19,18,0,2,80,15,0,39,20,5,0,1,113,12,0]
["09:00 AM",0,0,0,0,0,0,0,0,0,0,0,0,0,0,0,0]
["09:15 AM",0,0,0,0,0,0,0,0,0,0,0,0,0,0,0,0]
["09:30 AM",0,0,0,0,0,0,0,0,0,0,0,0,0,0,0,0]
["09:45 AM",0,0,0,0,0,0,0,0,0,0,0,0,0,0,0,0]
["10:00 AM",0,0,0,0,0,0,0,0,0,0,0,0,0,0,0,0]
["10:15 AM",0,0,0,0,0,0,0,0,0,0,0,0,0,0,0,0]
["10:30 AM",0,0,0,0,0,0,0,0,0,0,0,0,0,0,0,0]
["10:45 AM",0,0,0,0,0,0,0,0,0,0,0,0,0,0,0,0]
["11:00 AM",21,13,20,0,7,79,19,0,12,21,6,0,3,111,15,0]
["11:15 AM",21,9,17,0,3,87,21,0,27,21,4,0,1,112,15,0]
["11:30 AM",25,20,21,0,4,98,31,0,28,14,6,0,2,120,21,0]
["11:45 AM",11,19,26,0,4,88,18,0,27,17,8,0,3,99,10,0]
["12:00 PM",23,12,17,0,5,109,22,0,32,17,9,0,4,127,21,0]
["12:15 PM",16,15,20,0,6,121,20,0,30,20,4,0,3,123,17,0]
["12:30 PM",19,18,18,0,4,105,23,0,28,21,6,0,3,140,20,0]
["12:45 PM",17,18,22,0,14,108,21,0,29,17,1,0,2,88,21,0]
["01:00 PM",1,0,0,0,0,0,0,0,0,0,0,0,0,0,0,0]
["01:15 PM",0,0,0,0,0,0,0,0,0,0,0,0,0,0,0,0]
["01:30 PM",0,0,0,0,0,0,0,0,0,0,0,0,0,0,0,0]
["01:45 PM",0,0,0,0,0,0,0,0,0,0,0,0,0,0,0,0]
["02:00 PM",6,24,12,0,3,123,23,0,35,19,7,0,3,98,22,0]
["02:15 PM",14,17,16,0,3,126,20,0,21,27,2,0,3,110,22,0]
["02:30 PM",20,15,13,0,7,115,25,0,26,30,11,0,3,111,24,0]
["02:45 PM",14,15,24,0,5,134,20,0,30,26,6,0,5,117,20,0]
["03:00 PM",20,28,22,0,5,138,31,0,20,21,4,0,1,106,18,0]
["03:15 PM",55,52,29,0,3,136,35,0,18,26,8,0,7,111,15,0]
["03:30 PM",27,41,25,0,3,172,46,0,29,26,8,0,4,114,18,0]
["03:45 PM",28,34,21,0,2,178,37,0,23,30,14,0,4,112,26,0]
["04:00 PM",18,45,20,0,1,179,48,0,30,18,9,0,5,139,25,0]
["04:15 PM",34,42,20,0,2,177,42,0,22,29,15,0,6,97,25,0]
["04:30 PM",25,31,26,0,8,188,56,0,26,28,11,0,3,121,21,0]
["04:45 PM",26,50,30,0,6,170,53,0,20,23,4,0,1,131,19,0]
["05:00 PM",29,56,18,0,10,184,62,0,22,24,9,0,3,106,15,0]
["05:15 PM",27,59,30,0,6,186,52,0,16,25,12,0,6,110,20,0]
["05:30 PM",30,40,34,0,3,157,58,0,27,29,11,0,4,115,20,0]
["05:45 PM",29,45,28,0,2,175,54,0,34,21,8,0,7,103,10,0]

{"sheet":"Single Units","index":3,"n_rows":55,"n_cols":13,"rows_kept":55,"cut":false,"hidden":false,"merged":[[9,1,9,3],[9,4,9,6],[9,7,9,9],[9,10,9,12],[0,0,0,1],[1,0,1,1],[2,0,2,1],[0,2,0,12],[1,2,1,12],[2,2,2,12],[3,0,3,1],[4,0,4,1],[5,0,5,1],[3,2,3,12],[4,2,4,12],[5,2,5,12],[8,10,8,12],[6,0,6,1],[7,0,7,1],[8,1,8,3],[8,4,8,6],[8,7,8,9],[6,2,6,12],[7,2,7,12]]}
["File Name:",null,{"$f":"'Cars & Peds'!C1:P1","v":"E:\\2016 DATA\\TURNING MOVEMENTS\\TM#202 M-24@ TURRILL LAPEER\\TM_160202_353490_10-12-2016.ppd"}]
["Start Date:",null,{"$f":"'Cars & Peds'!C2:P2","v":"10/12/2016"}]
["Start Time:",null,{"$f":"'Cars & Peds'!C3:P3","v":"7:00:00 AM"}]
["Site Code:",null,{"$f":"'Cars & Peds'!C4:P4","v":"160202"}]
["Major Road:",null,{"$f":"'Cars & Peds'!C5:P5","v":"M-24 (LAPEER RD)"}]
["Minor Road:",null,{"$f":"'Cars & Peds'!C6:P6","v":"TURRILL RD"}]
["City/Township:",null,{"$f":"'Cars & Peds'!C7:P7","v":"LAPEER TWP"}]
["County:",null,{"$f":"'Cars & Peds'!C8:P8","v":"LAPEER"}]
[null,{"$f":"'Cars & Peds'!$B$9","v":"M-24/LAPEER RD"},null,null,{"$f":"'Cars & Peds'!$F$9","v":"TURRILL RD"},null,null,{"$f":"'Cars & Peds'!$J$9","v":"M-24/LAPEER RD"},null,null,{"$f":"'Cars & Peds'!$N$9","v":"TURRILL RD"}]
[null,"Northbound",null,null,"Eastbound",null,null,"Southbound",null,null,"Westbound"]
["Start Time","Right","Thru","Left","Right","Thru","Left","Right","Thru","Left","Right","Thru","Left"]
["07:00 AM",1,0,1,0,8,0,1,0,1,0,3,0]
["07:15 AM",2,1,4,0,8,0,1,1,0,0,3,0]
["07:30 AM",1,1,3,0,2,1,1,1,0,1,6,0]
["07:45 AM",0,0,2,0,1,2,1,0,0,0,7,2]
["08:00 AM",1,0,4,2,3,0,0,0,1,0,5,1]
["08:15 AM",0,0,5,0,2,1,0,0,1,1,3,0]
["08:30 AM",1,0,2,0,3,0,2,0,0,1,5,0]
["08:45 AM",0,0,0,2,9,0,1,0,1,0,6,1]
["09:00 AM",0,0,0,0,0,0,0,0,0,0,0,0]
["09:15 AM",0,0,0,0,0,0,0,0,0,0,0,0]
["09:30 AM",0,0,0,0,0,0,0,0,0,0,0,0]
["09:45 AM",0,0,0,0,0,0,0,0,0,0,0,0]
["10:00 AM",0,0,0,0,0,0,0,0,0,0,0,0]
["10:15 AM",0,0,0,0,0,0,0,0,0,0,0,0]
["10:30 AM",0,0,0,0,0,0,0,0,0,0,0,0]
["10:45 AM",0,0,0,0,0,0,0,0,0,0,0,0]
["11:00 AM",0,0,1,0,2,0,2,0,0,1,5,1]
["11:15 AM",1,0,0,0,5,2,1,1,0,0,6,0]
["11:30 AM",1,1,0,0,4,0,0,0,0,0,5,0]
["11:45 AM",3,1,0,0,1,0,0,1,0,0,5,2]
["12:00 PM",0,0,0,0,7,0,0,0,1,0,2,0]
["12:15 PM",0,0,0,0,4,0,0,0,0,0,7,0]
["12:30 PM",1,0,0,0,0,0,1,0,1,1,5,0]
["12:45 PM",1,0,0,0,4,3,0,0,0,0,3,1]
["01:00 PM",0,0,0,0,0,0,0,0,0,0,0,0]
["01:15 PM",0,0,0,0,0,0,0,0,0,0,0,0]
["01:30 PM",0,0,0,0,0,0,0,0,0,0,0,0]
["01:45 PM",0,0,0,0,0,0,0,0,0,0,0,0]
["02:00 PM",0,1,0,0,6,1,0,1,1,0,4,1]
["02:15 PM",1,0,1,0,2,1,1,0,0,0,3,0]
["02:30 PM",0,0,1,0,2,0,3,0,0,1,8,1]
["02:45 PM",0,1,0,0,1,0,1,0,1,0,3,1]
["03:00 PM",0,0,2,1,2,1,0,0,1,0,7,1]
["03:15 PM",1,0,1,1,4,0,3,0,0,0,3,0]
["03:30 PM",1,1,2,2,5,0,0,0,0,0,3,0]
["03:45 PM",1,0,4,1,8,0,0,3,1,1,3,1]
["04:00 PM",1,1,0,1,3,0,1,0,1,0,5,0]
["04:15 PM",0,0,1,0,1,0,2,1,1,0,3,0]
["04:30 PM",0,1,1,0,4,0,2,0,0,1,8,1]
["04:45 PM",2,0,2,0,2,0,2,0,0,0,10,0]
["05:00 PM",0,0,0,0,1,0,2,0,1,0,3,1]
["05:15 PM",0,0,0,0,7,0,0,0,0,0,10,0]
["05:30 PM",0,0,0,0,2,0,1,0,0,1,3,1]
["05:45 PM",1,0,0,0,1,0,1,0,0,0,4,0]

{"sheet":"Heavy Vehicles","index":4,"n_rows":55,"n_cols":13,"rows_kept":55,"cut":false,"hidden":false,"merged":[[9,1,9,3],[9,4,9,6],[9,7,9,9],[9,10,9,12],[0,0,0,1],[1,0,1,1],[2,0,2,1],[0,2,0,12],[1,2,1,12],[2,2,2,12],[3,0,3,1],[4,0,4,1],[5,0,5,1],[3,2,3,12],[4,2,4,12],[5,2,5,12],[8,10,8,12],[6,0,6,1],[7,0,7,1],[8,1,8,3],[8,4,8,6],[8,7,8,9],[6,2,6,12],[7,2,7,12]]}
["File Name:",null,{"$f":"'Cars & Peds'!C1:P1","v":"E:\\2016 DATA\\TURNING MOVEMENTS\\TM#202 M-24@ TURRILL LAPEER\\TM_160202_353490_10-12-2016.ppd"}]
["Start Date:",null,{"$f":"'Cars & Peds'!C2:P2","v":"10/12/2016"}]
["Start Time:",null,{"$f":"'Cars & Peds'!C3:P3","v":"7:00:00 AM"}]
["Site Code:",null,{"$f":"'Cars & Peds'!C4:P4","v":"160202"}]
["Major Road:",null,{"$f":"'Cars & Peds'!C5:P5","v":"M-24 (LAPEER RD)"}]
["Minor Road:",null,{"$f":"'Cars & Peds'!C6:P6","v":"TURRILL RD"}]
["City/Township:",null,{"$f":"'Cars & Peds'!C7:P7","v":"LAPEER TWP"}]
["County:",null,{"$f":"'Cars & Peds'!C8:P8","v":"LAPEER"}]
[null,{"$f":"'Cars & Peds'!$B$9","v":"M-24/LAPEER RD"},null,null,{"$f":"'Cars & Peds'!$F$9","v":"TURRILL RD"},null,null,{"$f":"'Cars & Peds'!$J$9","v":"M-24/LAPEER RD"},null,null,{"$f":"'Cars & Peds'!$N$9","v":"TURRILL RD"}]
[null,"Northbound",null,null,"Eastbound",null,null,"Southbound",null,null,"Westbound"]
["Start Time","Right","Thru","Left","Right","Thru","Left","Right","Thru","Left","Right","Thru","Left"]
["07:00 AM",1,0,0,0,3,0,1,0,0,0,0,0]
["07:15 AM",2,0,0,0,5,0,0,0,0,0,0,0]
["07:30 AM",0,0,1,0,1,1,0,0,0,0,1,0]
["07:45 AM",0,0,1,1,2,0,0,0,0,0,2,0]
["08:00 AM",1,0,0,1,0,0,0,0,0,0,2,0]
["08:15 AM",0,0,1,0,5,0,0,0,0,0,0,0]
["08:30 AM",1,1,0,0,2,0,1,0,0,0,2,0]
["08:45 AM",0,0,0,0,0,0,0,0,0,0,2,0]
["09:00 AM",0,0,0,0,0,0,0,0,0,0,0,0]
["09:15 AM",0,0,0,0,0,0,0,0,0,0,0,0]
["09:30 AM",0,0,0,0,0,0,0,0,0,0,0,0]
["09:45 AM",0,0,0,0,0,0,0,0,0,0,0,0]
["10:00 AM",0,0,0,0,0,0,0,0,0,0,0,0]
["10:15 AM",0,0,0,0,0,0,0,0,0,0,0,0]
["10:30 AM",0,0,0,0,0,0,0,0,0,0,0,0]
["10:45 AM",0,0,0,0,0,0,0,0,0,0,0,0]
["11:00 AM",1,0,0,1,5,0,0,0,0,0,0,0]
["11:15 AM",0,0,0,0,1,0,0,0,0,0,3,0]
["11:30 AM",0,0,0,0,6,0,0,0,1,0,2,0]
["11:45 AM",0,0,0,0,4,0,0,0,0,0,1,0]
["12:00 PM",0,0,2,0,2,0,0,0,1,0,2,0]
["12:15 PM",0,1,0,0,4,0,0,0,0,0,1,1]
["12:30 PM",0,0,0,1,4,0,0,0,0,0,1,1]
["12:45 PM",0,0,0,0,1,0,0,0,0,0,5,0]
["01:00 PM",0,0,0,0,0,0,1,0,0,0,0,0]
["01:15 PM",0,0,0,0,0,0,0,0,0,0,0,0]
["01:30 PM",0,0,0,0,0,0,0,0,0,0,0,0]
["01:45 PM",0,0,0,0,0,0,0,0,0,0,0,0]
["02:00 PM",0,0,1,0,1,0,1,0,0,0,5,0]
["02:15 PM",0,0,0,0,3,0,1,0,0,0,1,0]
["02:30 PM",0,0,0,0,4,0,0,0,0,0,0,0]
["02:45 PM",0,0,1,0,2,0,0,0,0,0,2,0]
["03:00 PM",0,0,0,0,2,0,0,0,0,0,5,0]
["03:15 PM",0,0,0,0,1,0,1,0,0,0,3,0]
["03:30 PM",0,0,0,0,1,1,1,0,0,0,2,0]
["03:45 PM",0,0,0,1,3,0,0,0,0,0,2,1]
["04:00 PM",0,0,0,0,4,0,1,0,0,0,3,0]
["04:15 PM",0,0,1,0,0,0,0,0,0,1,1,0]
["04:30 PM",0,0,0,0,0,0,0,0,0,0,0,0]
["04:45 PM",0,0,0,0,0,0,0,0,0,0,3,0]
["05:00 PM",0,0,0,0,0,0,0,0,0,0,1,1]
["05:15 PM",0,0,0,0,0,0,0,0,0,0,3,0]
["05:30 PM",0,0,0,0,0,0,0,0,0,0,2,0]
["05:45 PM",0,0,0,0,0,0,0,0,0,0,0,0]

{"sheet":"Calculations","index":5,"n_rows":60,"n_cols":62,"rows_kept":60,"cut":false,"hidden":false,"merged":[[8,40,8,44],[8,45,8,49],[8,50,8,54],[6,2,6,20],[7,2,7,20],[8,21,9,22],[8,23,9,24],[9,40,9,44],[8,28,10,29],[8,30,10,32],[8,33,10,33],[8,34,10,34],[8,35,8,39],[8,55,10,56],[8,57,9,61],[9,35,9,39],[8,25,9,26],[6,0,6,1],[7,0,7,1],[8,1,8,5],[9,1,9,5],[8,6,8,10],[9,6,9,10],[8,16,8,20],[9,16,9,20],[8,11,8,15],[9,11,9,15],[9,45,9,49],[9,50,9,54],[3,0,3,1],[4,0,4,1],[5,0,5,1],[0,0,0,1],[1,0,1,1],[2,0,2,1],[5,2,5,20],[0,2,0,20],[1,2,1,20],[2,2,2,20],[3,2,3,20],[4,2,4,20]]}
["File Name:",null,{"$f":"'Cars & Peds'!C1:P1","v":"E:\\2016 DATA\\TURNING MOVEMENTS\\TM#202 M-24@ TURRILL LAPEER\\TM_160202_353490_10-12-2016.ppd"}]
["Start Date:",null,{"$f":"'Cars & Peds'!C2:P2","v":"10/12/2016"}]
["Start Time:",null,{"$f":"'Cars & Peds'!C3:P3","v":"7:00:00 AM"}]
["Site Code:",null,{"$f":"'Cars & Peds'!C4:P4","v":"160202"}]
["Major Road:",null,{"$f":"'Cars & Peds'!C5:P5","v":"M-24 (LAPEER RD)"}]
["Minor Road:",null,{"$f":"'Cars & Peds'!C6:P6","v":"TURRILL RD"}]
["City/Township:",null,{"$f":"'Cars & Peds'!C7:P7","v":"LAPEER TWP"}]
["County:",null,{"$f":"'Cars & Peds'!C8:P8","v":"LAPEER"}]
[null,{"$f":"'Cars & Peds'!$B$9","v":"M-24/LAPEER RD"},null,null,null,null,{"$f":"'Cars & Peds'!$F$9","v":"TURRILL RD"},null,null,null,null,{"$f":"'Cars & Peds'!$J$9","v":"M-24/LAPEER RD"},null,null,null,null,{"$f":"'Cars & Peds'!$N$9","v":"TURRILL RD"},null,null,null,null,"NB/SB Volume",null,"EB/WB Volume",null,"Intersection Volume",null,null,"Peak Volume",null,"Time of Day",null,null,"Start Time","End Time",{"$f":"B9","v":"M-24/LAPEER RD"},null,null,null,null,{"$f":"G9","v":"TURRILL RD"},null,null,null,null,{"$f":"L9","v":"M-24/LAPEER RD"},null,null,null,null,{"$f":"Q9","v":"TURRILL RD"},null,null,null,null,"Intersection Volume",null,"PHF"]
[null,"Northbound",null,null,null,null,"Eastbound",null,null,null,null,"Southbound",null,null,null,null,"Westbound",null,null,null,null,null,null,null,null,null,null,null,null,null,null,null,null,null,null,"Northbound",null,null,null,null,"Eastbound",null,null,null,null,"Southbound",null,null,null,null,"Westbound"]
["Start Time","Right","Thru","Left","Peds","Total","Right","Thru","Left","Peds","Total","Right","Thru","Left","Peds","Total","Right","Thru","Left","Peds","Total","15-Min","Hourly","15-Min","Hourly","15-Min","Hourly",null,null,null,null,null,null,null,null,"Right","Thru","Left","Peds","Total","Right","Thru","Left","Peds","Total","Right","Thru","Left","Peds","Total","Right","Thru","Left","Peds","Total",null,null,"Intersection","NB","EB","SB","WB"]
["07:00 AM",{"$f":"'Cars & Peds'!B12+'Single Units'!B12+'Heavy Vehicles'!B12","v":13},{"$f":"'Cars & Peds'!C12+'Single Units'!C12+'Heavy Vehicles'!C12","v":18},{"$f":"'Cars & Peds'!D12+'Single Units'!D12+'Heavy Vehicles'!D12","v":26},{"$f":"'Cars & Peds'!E12","v":0},{"$f":"B12+C12+D12","v":57},{"$f":"'Cars & Peds'!F12+'Single Units'!E12+'Heavy Vehicles'!E12","v":1},{"$f":"'Cars & Peds'!G12+'Single Units'!F12+'Heavy Vehicles'!F12","v":67},{"$f":"'Cars & Peds'!H12+'Single Units'!G12+'Heavy Vehicles'!G12","v":7},{"$f":"'Cars & Peds'!I12","v":0},{"$f":"G12+H12+I12","v":75},{"$f":"'Cars & Peds'!J12+'Single Units'!H12+'Heavy Vehicles'!H12","v":62},{"$f":"'Cars & Peds'!K12+'Single Units'!I12+'Heavy Vehicles'!I12","v":33},{"$f":"'Cars & Peds'!L12+'Single Units'!J12+'Heavy Vehicles'!J12","v":8},{"$f":"'Cars & Peds'!M12","v":0},{"$f":"L12+M12+N12","v":103},{"$f":"'Cars & Peds'!N12+'Single Units'!K12+'Heavy Vehicles'!K12","v":1},{"$f":"'Cars & Peds'!O12+'Single Units'!L12+'Heavy Vehicles'!L12","v":198},{"$f":"'Cars & Peds'!P12+'Single Units'!M12+'Heavy Vehicles'!M12","v":26},{"$f":"'Cars & Peds'!Q12","v":0},{"$f":"Q12+R12+S12","v":225},{"$f":"F12+P12","v":160},{"$f":"SUM(V9:V12)","v":160},{"$f":"K12+U12","v":300},{"$f":"SUM(X9:X12)","v":300},{"$f":"F12+K12+P12+U12","v":460},{"$f":"SUM(Z9:Z12)","v":460},null,null,{"$f":"IF(AA12>=$AC$27,AA12,\"\")","v":""},{"$f":"IF(AD12=AA12,A12,\"\")","v":""},{"$f":"IF(AA12=AD12,AE12-0.03125,0)","v":"00:00:00"},{"$f":"IF(AA12=AD12,AE12+0.0104166666666666,0)","v":"00:00:00"},{"$f":"MAX(AF12:AF27)","v":"07:00:00"},{"$f":"MAX(AG12:AG27)","v":"08:00:00"},{"$f":"IF($AA12>=$AC$27,SUM(B9:B12),0)","v":0},{"$f":"IF($AA12>=$AC$27,SUM(C9:C12),0)","v":0},{"$f":"IF($AA12>=$AC$27,SUM(D9:D12),0)","v":0},{"$f":"IF($AA12>=$AC$27,SUM(E9:E12),0)","v":0},{"$f":"AJ12+AK12+AL12","v":0},{"$f":"IF($AA12>=$AC$27,SUM(G9:G12),0)","v":0},{"$f":"IF($AA12>=$AC$27,SUM(H9:H12),0)","v":0},{"$f":"IF($AA12>=$AC$27,SUM(I9:I12),0)","v":0},{"$f":"IF($AA12>=$AC$27,SUM(J9:J12),0)","v":0},{"$f":"AO12+AP12+AQ12","v":0},{"$f":"IF($AA12>=$AC$27,SUM(L9:L12),0)","v":0},{"$f":"IF($AA12>=$AC$27,SUM(M9:M12),0)","v":0},{"$f":"IF($AA12>=$AC$27,SUM(N9:N12),0)","v":0},{"$f":"IF($AA12>=$AC$27,SUM(O9:O12),0)","v":0},{"$f":"AT12+AU12+AV12","v":0},{"$f":"IF($AA12>=$AC$27,SUM(Q9:Q12),0)","v":0},{"$f":"IF($AA12>=$AC$27,SUM(R9:R12),0)","v":0},{"$f":"IF($AA12>=$AC$27,SUM(S9:S12),0)","v":0},{"$f":"IF($AA12>=$AC$27,SUM(T9:T12),0)","v":0},{"$f":"AY12+AZ12+BA12","v":0},{"$f":"IF($AA12>=$AC$27,SUM(Z9:Z12),0)","v":0},{"$f":"IF(BD12=0,\"\", \"PEAK\")","v":""},{"$f":"IF(BD12=0,0,0.25*BD12/MAX(Z9:Z12))","v":0},{"$f":"IF($BD12=0,0,0.25*AN12/MAX(F9:F12))","v":0},{"$f":"IF($BD12=0,0,0.25*AS12/MAX(K9:K12))","v":0},{"$f":"IF($BD12=0,0,0.25*AX12/MAX(P9:P12))","v":0},{"$f":"IF($BD12=0,0,0.25*BC12/MAX(U9:U12))","v":0}]
["07:15 AM",{"$f":"'Cars & Peds'!B13+'Single Units'!B13+'Heavy Vehicles'!B13","v":17},{"$f":"'Cars & Peds'!C13+'Single Units'!C13+'Heavy Vehicles'!C13","v":19},{"$f":"'Cars & Peds'!D13+'Single Units'!D13+'Heavy Vehicles'!D13","v":23},{"$f":"'Cars & Peds'!E13","v":0},{"$f":"B13+C13+D13","v":59},{"$f":"'Cars & Peds'!F13+'Single Units'!E13+'Heavy Vehicles'!E13","v":2},{"$f":"'Cars & Peds'!G13+'Single Units'!F13+'Heavy Vehicles'!F13","v":76},{"$f":"'Cars & Peds'!H13+'Single Units'!G13+'Heavy Vehicles'!G13","v":6},{"$f":"'Cars & Peds'!I13","v":0},{"$f":"G13+H13+I13","v":84},{"$f":"'Cars & Peds'!J13+'Single Units'!H13+'Heavy Vehicles'!H13","v":73},{"$f":"'Cars & Peds'!K13+'Single Units'!I13+'Heavy Vehicles'!I13","v":47},{"$f":"'Cars & Peds'!L13+'Single Units'!J13+'Heavy Vehicles'!J13","v":14},{"$f":"'Cars & Peds'!M13","v":0},{"$f":"L13+M13+N13","v":134},{"$f":"'Cars & Peds'!N13+'Single Units'!K13+'Heavy Vehicles'!K13","v":1},{"$f":"'Cars & Peds'!O13+'Single Units'!L13+'Heavy Vehicles'!L13","v":220},{"$f":"'Cars & Peds'!P13+'Single Units'!M13+'Heavy Vehicles'!M13","v":32},{"$f":"'Cars & Peds'!Q13","v":0},{"$f":"Q13+R13+S13","v":253},{"$f":"F13+P13","v":193},{"$f":"SUM(V10:V13)","v":353},{"$f":"K13+U13","v":337},{"$f":"SUM(X10:X13)","v":637},{"$f":"F13+K13+P13+U13","v":530},{"$f":"SUM(Z10:Z13)","v":990},null,null,{"$f":"IF(AA13>=$AC$27,AA13,\"\")","v":""},{"$f":"IF(AD13=AA13,A13,\"\")","v":""},{"$f":"IF(AA13=AD13,AE13-0.03125,0)","v":"00:00:00"},{"$f":"IF(AA13=AD13,AE13+0.0104166666666666,0)","v":"00:00:00"},null,null,{"$f":"IF($AA13>=$AC$27,SUM(B10:B13),0)","v":0},{"$f":"IF($AA13>=$AC$27,SUM(C10:C13),0)","v":0},{"$f":"IF($AA13>=$AC$27,SUM(D10:D13),0)","v":0},{"$f":"IF($AA13>=$AC$27,SUM(E10:E13),0)","v":0},{"$f":"AJ13+AK13+AL13","v":0},{"$f":"IF($AA13>=$AC$27,SUM(G10:G13),0)","v":0},{"$f":"IF($AA13>=$AC$27,SUM(H10:H13),0)","v":0},{"$f":"IF($AA13>=$AC$27,SUM(I10:I13),0)","v":0},{"$f":"IF($AA13>=$AC$27,SUM(J10:J13),0)","v":0},{"$f":"AO13+AP13+AQ13","v":0},{"$f":"IF($AA13>=$AC$27,SUM(L10:L13),0)","v":0},{"$f":"IF($AA13>=$AC$27,SUM(M10:M13),0)","v":0},{"$f":"IF($AA13>=$AC$27,SUM(N10:N13),0)","v":0},{"$f":"IF($AA13>=$AC$27,SUM(O10:O13),0)","v":0},{"$f":"AT13+AU13+AV13","v":0},{"$f":"IF($AA13>=$AC$27,SUM(Q10:Q13),0)","v":0},{"$f":"IF($AA13>=$AC$27,SUM(R10:R13),0)","v":0},{"$f":"IF($AA13>=$AC$27,SUM(S10:S13),0)","v":0},{"$f":"IF($AA13>=$AC$27,SUM(T10:T13),0)","v":0},{"$f":"AY13+AZ13+BA13","v":0},{"$f":"IF($AA13>=$AC$27,SUM(Z10:Z13),0)","v":0},{"$f":"IF(BD13=0,\"\", \"PEAK\")","v":""},{"$f":"IF(BD13=0,0,0.25*BD13/MAX(Z10:Z13))","v":0},{"$f":"IF($BD13=0,0,0.25*AN13/MAX(F10:F13))","v":0},{"$f":"IF($BD13=0,0,0.25*AS13/MAX(K10:K13))","v":0},{"$f":"IF($BD13=0,0,0.25*AX13/MAX(P10:P13))","v":0},{"$f":"IF($BD13=0,0,0.25*BC13/MAX(U10:U13))","v":0}]
["07:30 AM",{"$f":"'Cars & Peds'!B14+'Single Units'!B14+'Heavy Vehicles'!B14","v":18},{"$f":"'Cars & Peds'!C14+'Single Units'!C14+'Heavy Vehicles'!C14","v":19},{"$f":"'Cars & Peds'!D14+'Single Units'!D14+'Heavy Vehicles'!D14","v":26},{"$f":"'Cars & Peds'!E14","v":0},63,{"$f":"'Cars & Peds'!F14+'Single Units'!E14+'Heavy Vehicles'!E14","v":5},{"$f":"'Cars & Peds'!G14+'Single Units'!F14+'Heavy Vehicles'!F14","v":76},{"$f":"'Cars & Peds'!H14+'Single Units'!G14+'Heavy Vehicles'!G14","v":12},{"$f":"'Cars & Peds'!I14","v":0},93,{"$f":"'Cars & Peds'!J14+'Single Units'!H14+'Heavy Vehicles'!H14","v":50},{"$f":"'Cars & Peds'!K14+'Single Units'!I14+'Heavy Vehicles'!I14","v":65},{"$f":"'Cars & Peds'!L14+'Single Units'!J14+'Heavy Vehicles'!J14","v":10},{"$f":"'Cars & Peds'!M14","v":0},125,{"$f":"'Cars & Peds'!N14+'Single Units'!K14+'Heavy Vehicles'!K14","v":1},{"$f":"'Cars & Peds'!O14+'Single Units'!L14+'Heavy Vehicles'!L14","v":213},{"$f":"'Cars & Peds'!P14+'Single Units'!M14+'Heavy Vehicles'!M14","v":30},{"$f":"'Cars & Peds'!Q14","v":0},244,188,541,337,974,525,{"$f":"SUM(Z11:Z14)","v":1515},null,null,"","","00:00:00","00:00:00",null,null,0,0,0,0,0,0,0,0,0,0,0,0,0,0,0,0,0,0,0,0,0,"",0,0,0,0,0]
["07:45 AM",{"$f":"'Cars & Peds'!B15+'Single Units'!B15+'Heavy Vehicles'!B15","v":16},{"$f":"'Cars & Peds'!C15+'Single Units'!C15+'Heavy Vehicles'!C15","v":24},{"$f":"'Cars & Peds'!D15+'Single Units'!D15+'Heavy Vehicles'!D15","v":31},{"$f":"'Cars & Peds'!E15","v":0},71,{"$f":"'Cars & Peds'!F15+'Single Units'!E15+'Heavy Vehicles'!E15","v":4},{"$f":"'Cars & Peds'!G15+'Single Units'!F15+'Heavy Vehicles'!F15","v":64},{"$f":"'Cars & Peds'!H15+'Single Units'!G15+'Heavy Vehicles'!G15","v":22},{"$f":"'Cars & Peds'!I15","v":0},90,{"$f":"'Cars & Peds'!J15+'Single Units'!H15+'Heavy Vehicles'!H15","v":39},{"$f":"'Cars & Peds'!K15+'Single Units'!I15+'Heavy Vehicles'!I15","v":67},{"$f":"'Cars & Peds'!L15+'Single Units'!J15+'Heavy Vehicles'!J15","v":11},{"$f":"'Cars & Peds'!M15","v":0},117,{"$f":"'Cars & Peds'!N15+'Single Units'!K15+'Heavy Vehicles'!K15","v":2},{"$f":"'Cars & Peds'!O15+'Single Units'!L15+'Heavy Vehicles'!L15","v":154},{"$f":"'Cars & Peds'!P15+'Single Units'!M15+'Heavy Vehicles'!M15","v":45},{"$f":"'Cars & Peds'!Q15","v":0},201,188,729,291,1265,479,{"$f":"SUM(Z12:Z15)","v":1994},null,null,1994,"07:45 AM","07:00:00","08:00:00",null,null,64,80,106,0,250,12,283,47,0,342,224,212,43,0,479,5,785,133,0,923,1994,"PEAK",0.94056603773584901,0.88028169014084512,0.91935483870967738,0.89365671641791045,0.9120553359683794]
["08:00 AM",{"$f":"'Cars & Peds'!B16+'Single Units'!B16+'Heavy Vehicles'!B16","v":34},{"$f":"'Cars & Peds'!C16+'Single Units'!C16+'Heavy Vehicles'!C16","v":30},{"$f":"'Cars & Peds'!D16+'Single Units'!D16+'Heavy Vehicles'!D16","v":36},{"$f":"'Cars & Peds'!E16","v":0},100,{"$f":"'Cars & Peds'!F16+'Single Units'!E16+'Heavy Vehicles'!E16","v":8},{"$f":"'Cars & Peds'!G16+'Single Units'!F16+'Heavy Vehicles'!F16","v":76},{"$f":"'Cars & Peds'!H16+'Single Units'!G16+'Heavy Vehicles'!G16","v":6},{"$f":"'Cars & Peds'!I16","v":0},90,{"$f":"'Cars & Peds'!J16+'Single Units'!H16+'Heavy Vehicles'!H16","v":38},{"$f":"'Cars & Peds'!K16+'Single Units'!I16+'Heavy Vehicles'!I16","v":37},{"$f":"'Cars & Peds'!L16+'Single Units'!J16+'Heavy Vehicles'!J16","v":4},{"$f":"'Cars & Peds'!M16","v":0},79,{"$f":"'Cars & Peds'!N16+'Single Units'!K16+'Heavy Vehicles'!K16","v":2},{"$f":"'Cars & Peds'!O16+'Single Units'!L16+'Heavy Vehicles'!L16","v":144},{"$f":"'Cars & Peds'!P16+'Single Units'!M16+'Heavy Vehicles'!M16","v":29},{"$f":"'Cars & Peds'!Q16","v":0},175,179,748,265,1230,444,{"$f":"SUM(Z13:Z16)","v":1978},null,null,"","","00:00:00","00:00:00",null,null,0,0,0,0,0,0,0,0,0,0,0,0,0,0,0,0,0,0,0,0,0,"",0,0,0,0,0]
["08:15 AM",{"$f":"'Cars & Peds'!B17+'Single Units'!B17+'Heavy Vehicles'!B17","v":17},{"$f":"'Cars & Peds'!C17+'Single Units'!C17+'Heavy Vehicles'!C17","v":16},{"$f":"'Cars & Peds'!D17+'Single Units'!D17+'Heavy Vehicles'!D17","v":36},{"$f":"'Cars & Peds'!E17","v":0},69,{"$f":"'Cars & Peds'!F17+'Single Units'!E17+'Heavy Vehicles'!E17","v":5},{"$f":"'Cars & Peds'!G17+'Single Units'!F17+'Heavy Vehicles'!F17","v":92},{"$f":"'Cars & Peds'!H17+'Single Units'!G17+'Heavy Vehicles'!G17","v":16},{"$f":"'Cars & Peds'!I17","v":0},113,{"$f":"'Cars & Peds'!J17+'Single Units'!H17+'Heavy Vehicles'!H17","v":32},{"$f":"'Cars & Peds'!K17+'Single Units'!I17+'Heavy Vehicles'!I17","v":35},{"$f":"'Cars & Peds'!L17+'Single Units'!J17+'Heavy Vehicles'!J17","v":14},{"$f":"'Cars & Peds'!M17","v":0},81,{"$f":"'Cars & Peds'!N17+'Single Units'!K17+'Heavy Vehicles'!K17","v":1},{"$f":"'Cars & Peds'!O17+'Single Units'!L17+'Heavy Vehicles'!L17","v":138},{"$f":"'Cars & Peds'!P17+'Single Units'!M17+'Heavy Vehicles'!M17","v":15},{"$f":"'Cars & Peds'!Q17","v":0},154,150,705,267,1160,417,{"$f":"SUM(Z14:Z17)","v":1865},null,null,"","","00:00:00","00:00:00",null,null,0,0,0,0,0,0,0,0,0,0,0,0,0,0,0,0,0,0,0,0,0,"",0,0,0,0,0]
["08:30 AM",{"$f":"'Cars & Peds'!B18+'Single Units'!B18+'Heavy Vehicles'!B18","v":11},{"$f":"'Cars & Peds'!C18+'Single Units'!C18+'Heavy Vehicles'!C18","v":17},{"$f":"'Cars & Peds'!D18+'Single Units'!D18+'Heavy Vehicles'!D18","v":15},{"$f":"'Cars & Peds'!E18","v":0},43,{"$f":"'Cars & Peds'!F18+'Single Units'!E18+'Heavy Vehicles'!E18","v":3},{"$f":"'Cars & Peds'!G18+'Single Units'!F18+'Heavy Vehicles'!F18","v":93},{"$f":"'Cars & Peds'!H18+'Single Units'!G18+'Heavy Vehicles'!G18","v":18},{"$f":"'Cars & Peds'!I18","v":0},114,{"$f":"'Cars & Peds'!J18+'Single Units'!H18+'Heavy Vehicles'!H18","v":39},{"$f":"'Cars & Peds'!K18+'Single Units'!I18+'Heavy Vehicles'!I18","v":17},{"$f":"'Cars & Peds'!L18+'Single Units'!J18+'Heavy Vehicles'!J18","v":11},{"$f":"'Cars & Peds'!M18","v":0},67,{"$f":"'Cars & Peds'!N18+'Single Units'!K18+'Heavy Vehicles'!K18","v":2},{"$f":"'Cars & Peds'!O18+'Single Units'!L18+'Heavy Vehicles'!L18","v":155},{"$f":"'Cars & Peds'!P18+'Single Units'!M18+'Heavy Vehicles'!M18","v":23},{"$f":"'Cars & Peds'!Q18","v":0},180,110,627,294,1117,404,1744,null,null,"","","00:00:00","00:00:00",null,null,0,0,0,0,0,0,0,0,0,0,0,0,0,0,0,0,0,0,0,0,0,"",0,0,0,0,0]
["08:45 AM",{"$f":"'Cars & Peds'!B19+'Single Units'!B19+'Heavy Vehicles'!B19","v":13},{"$f":"'Cars & Peds'!C19+'Single Units'!C19+'Heavy Vehicles'!C19","v":19},{"$f":"'Cars & Peds'!D19+'Single Units'!D19+'Heavy Vehicles'!D19","v":18},{"$f":"'Cars & Peds'!E19","v":0},50,{"$f":"'Cars & Peds'!F19+'Single Units'!E19+'Heavy Vehicles'!E19","v":4},{"$f":"'Cars & Peds'!G19+'Single Units'!F19+'Heavy Vehicles'!F19","v":89},{"$f":"'Cars & Peds'!H19+'Single Units'!G19+'Heavy Vehicles'!G19","v":15},{"$f":"'Cars & Peds'!I19","v":0},108,{"$f":"'Cars & Peds'!J19+'Single Units'!H19+'Heavy Vehicles'!H19","v":40},{"$f":"'Cars & Peds'!K19+'Single Units'!I19+'Heavy Vehicles'!I19","v":20},{"$f":"'Cars & Peds'!L19+'Single Units'!J19+'Heavy Vehicles'!J19","v":6},{"$f":"'Cars & Peds'!M19","v":0},66,{"$f":"'Cars & Peds'!N19+'Single Units'!K19+'Heavy Vehicles'!K19","v":1},{"$f":"'Cars & Peds'!O19+'Single Units'!L19+'Heavy Vehicles'!L19","v":121},{"$f":"'Cars & Peds'!P19+'Single Units'!M19+'Heavy Vehicles'!M19","v":13},{"$f":"'Cars & Peds'!Q19","v":0},135,116,555,243,1069,{"$f":"F19+K19+P19+U19","v":359},1624,null,null,"","","00:00:00","00:00:00",null,null,0,0,0,0,0,0,0,0,0,0,0,0,0,0,0,0,0,0,0,0,0,"",0,0,0,0,0]
["09:00 AM",{"$f":"'Cars & Peds'!B20+'Single Units'!B20+'Heavy Vehicles'!B20","v":0},{"$f":"'Cars & Peds'!C20+'Single Units'!C20+'Heavy Vehicles'!C20","v":0},{"$f":"'Cars & Peds'!D20+'Single Units'!D20+'Heavy Vehicles'!D20","v":0},{"$f":"'Cars & Peds'!E20","v":0},0,{"$f":"'Cars & Peds'!F20+'Single Units'!E20+'Heavy Vehicles'!E20","v":0},{"$f":"'Cars & Peds'!G20+'Single Units'!F20+'Heavy Vehicles'!F20","v":0},{"$f":"'Cars & Peds'!H20+'Single Units'!G20+'Heavy Vehicles'!G20","v":0},{"$f":"'Cars & Peds'!I20","v":0},0,{"$f":"'Cars & Peds'!J20+'Single Units'!H20+'Heavy Vehicles'!H20","v":0},{"$f":"'Cars & Peds'!K20+'Single Units'!I20+'Heavy Vehicles'!I20","v":0},{"$f":"'Cars & Peds'!L20+'Single Units'!J20+'Heavy Vehicles'!J20","v":0},{"$f":"'Cars & Peds'!M20","v":0},0,{"$f":"'Cars & Peds'!N20+'Single Units'!K20+'Heavy Vehicles'!K20","v":0},{"$f":"'Cars & Peds'!O20+'Single Units'!L20+'Heavy Vehicles'!L20","v":0},{"$f":"'Cars & Peds'!P20+'Single Units'!M20+'Heavy Vehicles'!M20","v":0},{"$f":"'Cars & Peds'!Q20","v":0},0,0,376,0,804,0,{"$f":"SUM(Z17:Z20)","v":1180},null,null,"","","00:00:00","00:00:00",null,null,0,0,0,0,0,0,0,0,0,0,0,0,0,0,0,0,0,0,0,0,0,"",0,0,0,0,0]
["09:15 AM",{"$f":"'Cars & Peds'!B21+'Single Units'!B21+'Heavy Vehicles'!B21","v":0},{"$f":"'Cars & Peds'!C21+'Single Units'!C21+'Heavy Vehicles'!C21","v":0},{"$f":"'Cars & Peds'!D21+'Single Units'!D21+'Heavy Vehicles'!D21","v":0},{"$f":"'Cars & Peds'!E21","v":0},0,{"$f":"'Cars & Peds'!F21+'Single Units'!E21+'Heavy Vehicles'!E21","v":0},{"$f":"'Cars & Peds'!G21+'Single Units'!F21+'Heavy Vehicles'!F21","v":0},{"$f":"'Cars & Peds'!H21+'Single Units'!G21+'Heavy Vehicles'!G21","v":0},{"$f":"'Cars & Peds'!I21","v":0},0,{"$f":"'Cars & Peds'!J21+'Single Units'!H21+'Heavy Vehicles'!H21","v":0},{"$f":"'Cars & Peds'!K21+'Single Units'!I21+'Heavy Vehicles'!I21","v":0},{"$f":"'Cars & Peds'!L21+'Single Units'!J21+'Heavy Vehicles'!J21","v":0},{"$f":"'Cars & Peds'!M21","v":0},0,{"$f":"'Cars & Peds'!N21+'Single Units'!K21+'Heavy Vehicles'!K21","v":0},{"$f":"'Cars & Peds'!O21+'Single Units'!L21+'Heavy Vehicles'!L21","v":0},{"$f":"'Cars & Peds'!P21+'Single Units'!M21+'Heavy Vehicles'!M21","v":0},{"$f":"'Cars & Peds'!Q21","v":0},0,0,226,0,537,0,763,null,null,"","","00:00:00","00:00:00",null,null,0,0,0,0,0,0,0,0,0,0,0,0,0,0,0,0,0,0,0,0,0,"",0,0,0,0,0]
["09:30 AM",{"$f":"'Cars & Peds'!B22+'Single Units'!B22+'Heavy Vehicles'!B22","v":0},{"$f":"'Cars & Peds'!C22+'Single Units'!C22+'Heavy Vehicles'!C22","v":0},{"$f":"'Cars & Peds'!D22+'Single Units'!D22+'Heavy Vehicles'!D22","v":0},{"$f":"'Cars & Peds'!E22","v":0},0,{"$f":"'Cars & Peds'!F22+'Single Units'!E22+'Heavy Vehicles'!E22","v":0},{"$f":"'Cars & Peds'!G22+'Single Units'!F22+'Heavy Vehicles'!F22","v":0},{"$f":"'Cars & Peds'!H22+'Single Units'!G22+'Heavy Vehicles'!G22","v":0},{"$f":"'Cars & Peds'!I22","v":0},0,{"$f":"'Cars & Peds'!J22+'Single Units'!H22+'Heavy Vehicles'!H22","v":0},{"$f":"'Cars & Peds'!K22+'Single Units'!I22+'Heavy Vehicles'!I22","v":0},{"$f":"'Cars & Peds'!L22+'Single Units'!J22+'Heavy Vehicles'!J22","v":0},{"$f":"'Cars & Peds'!M22","v":0},0,{"$f":"'Cars & Peds'!N22+'Single Units'!K22+'Heavy Vehicles'!K22","v":0},{"$f":"'Cars & Peds'!O22+'Single Units'!L22+'Heavy Vehicles'!L22","v":0},{"$f":"'Cars & Peds'!P22+'Single Units'!M22+'Heavy Vehicles'!M22","v":0},{"$f":"'Cars & Peds'!Q22","v":0},0,0,116,0,243,0,359,null,null,"","","00:00:00","00:00:00",null,null,0,0,0,0,0,0,0,0,0,0,0,0,0,0,0,0,0,0,0,0,0,"",0,0,0,0,0]
["09:45 AM",{"$f":"'Cars & Peds'!B23+'Single Units'!B23+'Heavy Vehicles'!B23","v":0},{"$f":"'Cars & Peds'!C23+'Single Units'!C23+'Heavy Vehicles'!C23","v":0},{"$f":"'Cars & Peds'!D23+'Single Units'!D23+'Heavy Vehicles'!D23","v":0},{"$f":"'Cars & Peds'!E23","v":0},0,{"$f":"'Cars & Peds'!F23+'Single Units'!E23+'Heavy Vehicles'!E23","v":0},{"$f":"'Cars & Peds'!G23+'Single Units'!F23+'Heavy Vehicles'!F23","v":0},{"$f":"'Cars & Peds'!H23+'Single Units'!G23+'Heavy Vehicles'!G23","v":0},{"$f":"'Cars & Peds'!I23","v":0},0,{"$f":"'Cars & Peds'!J23+'Single Units'!H23+'Heavy Vehicles'!H23","v":0},{"$f":"'Cars & Peds'!K23+'Single Units'!I23+'Heavy Vehicles'!I23","v":0},{"$f":"'Cars & Peds'!L23+'Single Units'!J23+'Heavy Vehicles'!J23","v":0},{"$f":"'Cars & Peds'!M23","v":0},0,{"$f":"'Cars & Peds'!N23+'Single Units'!K23+'Heavy Vehicles'!K23","v":0},{"$f":"'Cars & Peds'!O23+'Single Units'!L23+'Heavy Vehicles'!L23","v":0},{"$f":"'Cars & Peds'!P23+'Single Units'!M23+'Heavy Vehicles'!M23","v":0},{"$f":"'Cars & Peds'!Q23","v":0},0,0,0,0,0,0,0,null,null,"","","00:00:00","00:00:00",null,null,0,0,0,0,0,0,0,0,0,0,0,0,0,0,0,0,0,0,0,0,0,"",0,0,0,0,0]
["10:00 AM",{"$f":"'Cars & Peds'!B24+'Single Units'!B24+'Heavy Vehicles'!B24","v":0},{"$f":"'Cars & Peds'!C24+'Single Units'!C24+'Heavy Vehicles'!C24","v":0},{"$f":"'Cars & Peds'!D24+'Single Units'!D24+'Heavy Vehicles'!D24","v":0},{"$f":"'Cars & Peds'!E24","v":0},0,{"$f":"'Cars & Peds'!F24+'Single Units'!E24+'Heavy Vehicles'!E24","v":0},{"$f":"'Cars & Peds'!G24+'Single Units'!F24+'Heavy Vehicles'!F24","v":0},{"$f":"'Cars & Peds'!H24+'Single Units'!G24+'Heavy Vehicles'!G24","v":0},{"$f":"'Cars & Peds'!I24","v":0},0,{"$f":"'Cars & Peds'!J24+'Single Units'!H24+'Heavy Vehicles'!H24","v":0},{"$f":"'Cars & Peds'!K24+'Single Units'!I24+'Heavy Vehicles'!I24","v":0},{"$f":"'Cars & Peds'!L24+'Single Units'!J24+'Heavy Vehicles'!J24","v":0},{"$f":"'Cars & Peds'!M24","v":0},0,{"$f":"'Cars & Peds'!N24+'Single Units'!K24+'Heavy Vehicles'!K24","v":0},{"$f":"'Cars & Peds'!O24+'Single Units'!L24+'Heavy Vehicles'!L24","v":0},{"$f":"'Cars & Peds'!P24+'Single Units'!M24+'Heavy Vehicles'!M24","v":0},{"$f":"'Cars & Peds'!Q24","v":0},0,0,0,0,0,0,0,null,null,"","","00:00:00","00:00:00",null,null,0,0,0,0,0,0,0,0,0,0,0,0,0,0,0,0,0,0,0,0,0,"",0,0,0,0,0]
["10:15 AM",{"$f":"'Cars & Peds'!B25+'Single Units'!B25+'Heavy Vehicles'!B25","v":0},{"$f":"'Cars & Peds'!C25+'Single Units'!C25+'Heavy Vehicles'!C25","v":0},{"$f":"'Cars & Peds'!D25+'Single Units'!D25+'Heavy Vehicles'!D25","v":0},{"$f":"'Cars & Peds'!E25","v":0},0,{"$f":"'Cars & Peds'!F25+'Single Units'!E25+'Heavy Vehicles'!E25","v":0},{"$f":"'Cars & Peds'!G25+'Single Units'!F25+'Heavy Vehicles'!F25","v":0},{"$f":"'Cars & Peds'!H25+'Single Units'!G25+'Heavy Vehicles'!G25","v":0},{"$f":"'Cars & Peds'!I25","v":0},0,{"$f":"'Cars & Peds'!J25+'Single Units'!H25+'Heavy Vehicles'!H25","v":0},{"$f":"'Cars & Peds'!K25+'Single Units'!I25+'Heavy Vehicles'!I25","v":0},{"$f":"'Cars & Peds'!L25+'Single Units'!J25+'Heavy Vehicles'!J25","v":0},{"$f":"'Cars & Peds'!M25","v":0},0,{"$f":"'Cars & Peds'!N25+'Single Units'!K25+'Heavy Vehicles'!K25","v":0},{"$f":"'Cars & Peds'!O25+'Single Units'!L25+'Heavy Vehicles'!L25","v":0},{"$f":"'Cars & Peds'!P25+'Single Units'!M25+'Heavy Vehicles'!M25","v":0},{"$f":"'Cars & Peds'!Q25","v":0},0,0,0,0,0,0,0,null,null,"","","00:00:00","00:00:00",null,null,0,0,0,0,0,0,0,0,0,0,0,0,0,0,0,0,0,0,0,0,0,"",0,0,0,0,0]
["10:30 AM",{"$f":"'Cars & Peds'!B26+'Single Units'!B26+'Heavy Vehicles'!B26","v":0},{"$f":"'Cars & Peds'!C26+'Single Units'!C26+'Heavy Vehicles'!C26","v":0},{"$f":"'Cars & Peds'!D26+'Single Units'!D26+'Heavy Vehicles'!D26","v":0},{"$f":"'Cars & Peds'!E26","v":0},0,{"$f":"'Cars & Peds'!F26+'Single Units'!E26+'Heavy Vehicles'!E26","v":0},{"$f":"'Cars & Peds'!G26+'Single Units'!F26+'Heavy Vehicles'!F26","v":0},{"$f":"'Cars & Peds'!H26+'Single Units'!G26+'Heavy Vehicles'!G26","v":0},{"$f":"'Cars & Peds'!I26","v":0},0,{"$f":"'Cars & Peds'!J26+'Single Units'!H26+'Heavy Vehicles'!H26","v":0},{"$f":"'Cars & Peds'!K26+'Single Units'!I26+'Heavy Vehicles'!I26","v":0},{"$f":"'Cars & Peds'!L26+'Single Units'!J26+'Heavy Vehicles'!J26","v":0},{"$f":"'Cars & Peds'!M26","v":0},0,{"$f":"'Cars & Peds'!N26+'Single Units'!K26+'Heavy Vehicles'!K26","v":0},{"$f":"'Cars & Peds'!O26+'Single Units'!L26+'Heavy Vehicles'!L26","v":0},{"$f":"'Cars & Peds'!P26+'Single Units'!M26+'Heavy Vehicles'!M26","v":0},{"$f":"'Cars & Peds'!Q26","v":0},0,0,0,0,0,0,0,null,null,"","","00:00:00","00:00:00",null,null,0,0,0,0,0,0,0,0,0,0,0,0,0,0,0,0,0,0,0,0,0,"",0,0,0,0,0]
["10:45 AM",{"$f":"'Cars & Peds'!B27+'Single Units'!B27+'Heavy Vehicles'!B27","v":0},{"$f":"'Cars & Peds'!C27+'Single Units'!C27+'Heavy Vehicles'!C27","v":0},{"$f":"'Cars & Peds'!D27+'Single Units'!D27+'Heavy Vehicles'!D27","v":0},{"$f":"'Cars & Peds'!E27","v":0},0,{"$f":"'Cars & Peds'!F27+'Single Units'!E27+'Heavy Vehicles'!E27","v":0},{"$f":"'Cars & Peds'!G27+'Single Units'!F27+'Heavy Vehicles'!F27","v":0},{"$f":"'Cars & Peds'!H27+'Single Units'!G27+'Heavy Vehicles'!G27","v":0},{"$f":"'Cars & Peds'!I27","v":0},0,{"$f":"'Cars & Peds'!J27+'Single Units'!H27+'Heavy Vehicles'!H27","v":0},{"$f":"'Cars & Peds'!K27+'Single Units'!I27+'Heavy Vehicles'!I27","v":0},{"$f":"'Cars & Peds'!L27+'Single Units'!J27+'Heavy Vehicles'!J27","v":0},{"$f":"'Cars & Peds'!M27","v":0},0,{"$f":"'Cars & Peds'!N27+'Single Units'!K27+'Heavy Vehicles'!K27","v":0},{"$f":"'Cars & Peds'!O27+'Single Units'!L27+'Heavy Vehicles'!L27","v":0},{"$f":"'Cars & Peds'!P27+'Single Units'!M27+'Heavy Vehicles'!M27","v":0},{"$f":"'Cars & Peds'!Q27","v":0},0,0,0,0,0,0,0,null,{"$f":"MAX(AA12:AA27)","v":1994},"","","00:00:00","00:00:00",null,null,0,0,0,0,0,0,0,0,0,0,0,0,0,0,0,0,0,0,0,0,0,"",0,0,0,0,0]
["11:00 AM",{"$f":"'Cars & Peds'!B28+'Single Units'!B28+'Heavy Vehicles'!B28","v":22},{"$f":"'Cars & Peds'!C28+'Single Units'!C28+'Heavy Vehicles'!C28","v":13},{"$f":"'Cars & Peds'!D28+'Single Units'!D28+'Heavy Vehicles'!D28","v":21},{"$f":"'Cars & Peds'!E28","v":0},56,{"$f":"'Cars & Peds'!F28+'Single Units'!E28+'Heavy Vehicles'!E28","v":8},{"$f":"'Cars & Peds'!G28+'Single Units'!F28+'Heavy Vehicles'!F28","v":86},{"$f":"'Cars & Peds'!H28+'Single Units'!G28+'Heavy Vehicles'!G28","v":19},{"$f":"'Cars & Peds'!I28","v":0},113,{"$f":"'Cars & Peds'!J28+'Single Units'!H28+'Heavy Vehicles'!H28","v":14},{"$f":"'Cars & Peds'!K28+'Single Units'!I28+'Heavy Vehicles'!I28","v":21},{"$f":"'Cars & Peds'!L28+'Single Units'!J28+'Heavy Vehicles'!J28","v":6},{"$f":"'Cars & Peds'!M28","v":0},41,{"$f":"'Cars & Peds'!N28+'Single Units'!K28+'Heavy Vehicles'!K28","v":4},{"$f":"'Cars & Peds'!O28+'Single Units'!L28+'Heavy Vehicles'!L28","v":116},{"$f":"'Cars & Peds'!P28+'Single Units'!M28+'Heavy Vehicles'!M28","v":16},{"$f":"'Cars & Peds'!Q28","v":0},136,97,97,249,249,346,346,null,null,{"$f":"IF(AA28>=$AC$47,AA28,\"\")","v":""},"","00:00:00","00:00:00",{"$f":"MAX(AF28:AF47)","v":"15:00:00"},{"$f":"MAX(AG28:AG47)","v":"16:00:00"},{"$f":"IF($AA28>=$AC$47,SUM(B25:B28),0)","v":0},{"$f":"IF($AA28>=$AC$47,SUM(C25:C28),0)","v":0},{"$f":"IF($AA28>=$AC$47,SUM(D25:D28),0)","v":0},{"$f":"IF($AA28>=$AC$47,SUM(E25:E28),0)","v":0},0,{"$f":"IF($AA28>=$AC$47,SUM(G25:G28),0)","v":0},{"$f":"IF($AA28>=$AC$47,SUM(H25:H28),0)","v":0},{"$f":"IF($AA28>=$AC$47,SUM(I25:I28),0)","v":0},{"$f":"IF($AA28>=$AC$47,SUM(J25:J28),0)","v":0},0,{"$f":"IF($AA28>=$AC$47,SUM(L25:L28),0)","v":0},{"$f":"IF($AA28>=$AC$47,SUM(M25:M28),0)","v":0},{"$f":"IF($AA28>=$AC$47,SUM(N25:N28),0)","v":0},{"$f":"IF($AA28>=$AC$47,SUM(O25:O28),0)","v":0},0,{"$f":"IF($AA28>=$AC$47,SUM(Q25:Q28),0)","v":0},{"$f":"IF($AA28>=$AC$47,SUM(R25:R28),0)","v":0},{"$f":"IF($AA28>=$AC$47,SUM(S25:S28),0)","v":0},{"$f":"IF($AA28>=$AC$47,SUM(T25:T28),0)","v":0},0,{"$f":"IF($AA28>=$AC$47,SUM(Z25:Z28),0)","v":0},"",0,0,0,0,0]
["11:15 AM",{"$f":"'Cars & Peds'!B29+'Single Units'!B29+'Heavy Vehicles'!B29","v":22},{"$f":"'Cars & Peds'!C29+'Single Units'!C29+'Heavy Vehicles'!C29","v":9},{"$f":"'Cars & Peds'!D29+'Single Units'!D29+'Heavy Vehicles'!D29","v":17},{"$f":"'Cars & Peds'!E29","v":0},48,{"$f":"'Cars & Peds'!F29+'Single Units'!E29+'Heavy Vehicles'!E29","v":3},{"$f":"'Cars & Peds'!G29+'Single Units'!F29+'Heavy Vehicles'!F29","v":93},{"$f":"'Cars & Peds'!H29+'Single Units'!G29+'Heavy Vehicles'!G29","v":23},{"$f":"'Cars & Peds'!I29","v":0},119,{"$f":"'Cars & Peds'!J29+'Single Units'!H29+'Heavy Vehicles'!H29","v":28},{"$f":"'Cars & Peds'!K29+'Single Units'!I29+'Heavy Vehicles'!I29","v":22},{"$f":"'Cars & Peds'!L29+'Single Units'!J29+'Heavy Vehicles'!J29","v":4},{"$f":"'Cars & Peds'!M29","v":0},54,{"$f":"'Cars & Peds'!N29+'Single Units'!K29+'Heavy Vehicles'!K29","v":1},{"$f":"'Cars & Peds'!O29+'Single Units'!L29+'Heavy Vehicles'!L29","v":121},{"$f":"'Cars & Peds'!P29+'Single Units'!M29+'Heavy Vehicles'!M29","v":15},{"$f":"'Cars & Peds'!Q29","v":0},137,102,199,256,505,358,704,null,null,{"$f":"IF(AA29>=$AC$47,AA29,\"\")","v":""},"","00:00:00","00:00:00",null,null,{"$f":"IF($AA29>=$AC$47,SUM(B26:B29),0)","v":0},{"$f":"IF($AA29>=$AC$47,SUM(C26:C29),0)","v":0},{"$f":"IF($AA29>=$AC$47,SUM(D26:D29),0)","v":0},{"$f":"IF($AA29>=$AC$47,SUM(E26:E29),0)","v":0},0,{"$f":"IF($AA29>=$AC$47,SUM(G26:G29),0)","v":0},{"$f":"IF($AA29>=$AC$47,SUM(H26:H29),0)","v":0},{"$f":"IF($AA29>=$AC$47,SUM(I26:I29),0)","v":0},{"$f":"IF($AA29>=$AC$47,SUM(J26:J29),0)","v":0},0,{"$f":"IF($AA29>=$AC$47,SUM(L26:L29),0)","v":0},{"$f":"IF($AA29>=$AC$47,SUM(M26:M29),0)","v":0},{"$f":"IF($AA29>=$AC$47,SUM(N26:N29),0)","v":0},{"$f":"IF($AA29>=$AC$47,SUM(O26:O29),0)","v":0},0,{"$f":"IF($AA29>=$AC$47,SUM(Q26:Q29),0)","v":0},{"$f":"IF($AA29>=$AC$47,SUM(R26:R29),0)","v":0},{"$f":"IF($AA29>=$AC$47,SUM(S26:S29),0)","v":0},{"$f":"IF($AA29>=$AC$47,SUM(T26:T29),0)","v":0},0,{"$f":"IF($AA29>=$AC$47,SUM(Z26:Z29),0)","v":0},"",0,0,0,0,0]
["11:30 AM",{"$f":"'Cars & Peds'!B30+'Single Units'!B30+'Heavy Vehicles'!B30","v":26},{"$f":"'Cars & Peds'!C30+'Single Units'!C30+'Heavy Vehicles'!C30","v":21},{"$f":"'Cars & Peds'!D30+'Single Units'!D30+'Heavy Vehicles'!D30","v":21},{"$f":"'Cars & Peds'!E30","v":0},68,{"$f":"'Cars & Peds'!F30+'Single Units'!E30+'Heavy Vehicles'!E30","v":4},{"$f":"'Cars & Peds'!G30+'Single Units'!F30+'Heavy Vehicles'!F30","v":108},{"$f":"'Cars & Peds'!H30+'Single Units'!G30+'Heavy Vehicles'!G30","v":31},{"$f":"'Cars & Peds'!I30","v":0},143,{"$f":"'Cars & Peds'!J30+'Single Units'!H30+'Heavy Vehicles'!H30","v":28},{"$f":"'Cars & Peds'!K30+'Single Units'!I30+'Heavy Vehicles'!I30","v":14},{"$f":"'Cars & Peds'!L30+'Single Units'!J30+'Heavy Vehicles'!J30","v":7},{"$f":"'Cars & Peds'!M30","v":0},49,{"$f":"'Cars & Peds'!N30+'Single Units'!K30+'Heavy Vehicles'!K30","v":2},{"$f":"'Cars & Peds'!O30+'Single Units'!L30+'Heavy Vehicles'!L30","v":127},{"$f":"'Cars & Peds'!P30+'Single Units'!M30+'Heavy Vehicles'!M30","v":21},{"$f":"'Cars & Peds'!Q30","v":0},150,117,316,293,798,410,1114,null,null,"","","00:00:00","00:00:00",null,null,0,0,0,0,0,0,0,0,0,0,0,0,0,0,0,0,0,0,0,0,0,"",0,0,0,0,0]
["11:45 AM",{"$f":"'Cars & Peds'!B31+'Single Units'!B31+'Heavy Vehicles'!B31","v":14},{"$f":"'Cars & Peds'!C31+'Single Units'!C31+'Heavy Vehicles'!C31","v":20},{"$f":"'Cars & Peds'!D31+'Single Units'!D31+'Heavy Vehicles'!D31","v":26},{"$f":"'Cars & Peds'!E31","v":0},60,{"$f":"'Cars & Peds'!F31+'Single Units'!E31+'Heavy Vehicles'!E31","v":4},{"$f":"'Cars & Peds'!G31+'Single Units'!F31+'Heavy Vehicles'!F31","v":93},{"$f":"'Cars & Peds'!H31+'Single Units'!G31+'Heavy Vehicles'!G31","v":18},{"$f":"'Cars & Peds'!I31","v":0},115,{"$f":"'Cars & Peds'!J31+'Single Units'!H31+'Heavy Vehicles'!H31","v":27},{"$f":"'Cars & Peds'!K31+'Single Units'!I31+'Heavy Vehicles'!I31","v":18},{"$f":"'Cars & Peds'!L31+'Single Units'!J31+'Heavy Vehicles'!J31","v":8},{"$f":"'Cars & Peds'!M31","v":0},53,{"$f":"'Cars & Peds'!N31+'Single Units'!K31+'Heavy Vehicles'!K31","v":3},{"$f":"'Cars & Peds'!O31+'Single Units'!L31+'Heavy Vehicles'!L31","v":105},{"$f":"'Cars & Peds'!P31+'Single Units'!M31+'Heavy Vehicles'!M31","v":12},{"$f":"'Cars & Peds'!Q31","v":0},120,113,429,235,1033,348,1462,null,null,"","","00:00:00","00:00:00",null,null,0,0,0,0,0,0,0,0,0,0,0,0,0,0,0,0,0,0,0,0,0,"",0,0,0,0,0]
["12:00 PM",{"$f":"'Cars & Peds'!B32+'Single Units'!B32+'Heavy Vehicles'!B32","v":23},{"$f":"'Cars & Peds'!C32+'Single Units'!C32+'Heavy Vehicles'!C32","v":12},{"$f":"'Cars & Peds'!D32+'Single Units'!D32+'Heavy Vehicles'!D32","v":19},{"$f":"'Cars & Peds'!E32","v":0},54,{"$f":"'Cars & Peds'!F32+'Single Units'!E32+'Heavy Vehicles'!E32","v":5},{"$f":"'Cars & Peds'!G32+'Single Units'!F32+'Heavy Vehicles'!F32","v":118},{"$f":"'Cars & Peds'!H32+'Single Units'!G32+'Heavy Vehicles'!G32","v":22},{"$f":"'Cars & Peds'!I32","v":0},145,{"$f":"'Cars & Peds'!J32+'Single Units'!H32+'Heavy Vehicles'!H32","v":32},{"$f":"'Cars & Peds'!K32+'Single Units'!I32+'Heavy Vehicles'!I32","v":17},{"$f":"'Cars & Peds'!L32+'Single Units'!J32+'Heavy Vehicles'!J32","v":11},{"$f":"'Cars & Peds'!M32","v":0},60,{"$f":"'Cars & Peds'!N32+'Single Units'!K32+'Heavy Vehicles'!K32","v":4},{"$f":"'Cars & Peds'!O32+'Single Units'!L32+'Heavy Vehicles'!L32","v":131},{"$f":"'Cars & Peds'!P32+'Single Units'!M32+'Heavy Vehicles'!M32","v":21},{"$f":"'Cars & Peds'!Q32","v":0},156,114,446,301,1085,415,1531,null,null,"","","00:00:00","00:00:00",null,null,0,0,0,0,0,0,0,0,0,0,0,0,0,0,0,0,0,0,0,0,0,"",0,0,0,0,0]
["12:15 PM",{"$f":"'Cars & Peds'!B33+'Single Units'!B33+'Heavy Vehicles'!B33","v":16},{"$f":"'Cars & Peds'!C33+'Single Units'!C33+'Heavy Vehicles'!C33","v":16},{"$f":"'Cars & Peds'!D33+'Single Units'!D33+'Heavy Vehicles'!D33","v":20},{"$f":"'Cars & Peds'!E33","v":0},52,{"$f":"'Cars & Peds'!F33+'Single Units'!E33+'Heavy Vehicles'!E33","v":6},{"$f":"'Cars & Peds'!G33+'Single Units'!F33+'Heavy Vehicles'!F33","v":129},{"$f":"'Cars & Peds'!H33+'Single Units'!G33+'Heavy Vehicles'!G33","v":20},{"$f":"'Cars & Peds'!I33","v":0},155,{"$f":"'Cars & Peds'!J33+'Single Units'!H33+'Heavy Vehicles'!H33","v":30},{"$f":"'Cars & Peds'!K33+'Single Units'!I33+'Heavy Vehicles'!I33","v":20},{"$f":"'Cars & Peds'!L33+'Single Units'!J33+'Heavy Vehicles'!J33","v":4},{"$f":"'Cars & Peds'!M33","v":0},54,{"$f":"'Cars & Peds'!N33+'Single Units'!K33+'Heavy Vehicles'!K33","v":3},{"$f":"'Cars & Peds'!O33+'Single Units'!L33+'Heavy Vehicles'!L33","v":131},{"$f":"'Cars & Peds'!P33+'Single Units'!M33+'Heavy Vehicles'!M33","v":18},{"$f":"'Cars & Peds'!Q33","v":0},152,106,450,307,1136,413,1586,null,null,"","","00:00:00","00:00:00",null,null,0,0,0,0,0,0,0,0,0,0,0,0,0,0,0,0,0,0,0,0,0,"",0,0,0,0,0]
["12:30 PM",{"$f":"'Cars & Peds'!B34+'Single Units'!B34+'Heavy Vehicles'!B34","v":20},{"$f":"'Cars & Peds'!C34+'Single Units'!C34+'Heavy Vehicles'!C34","v":18},{"$f":"'Cars & Peds'!D34+'Single Units'!D34+'Heavy Vehicles'!D34","v":18},{"$f":"'Cars & Peds'!E34","v":0},56,{"$f":"'Cars & Peds'!F34+'Single Units'!E34+'Heavy Vehicles'!E34","v":5},{"$f":"'Cars & Peds'!G34+'Single Units'!F34+'Heavy Vehicles'!F34","v":109},{"$f":"'Cars & Peds'!H34+'Single Units'!G34+'Heavy Vehicles'!G34","v":23},{"$f":"'Cars & Peds'!I34","v":0},137,{"$f":"'Cars & Peds'!J34+'Single Units'!H34+'Heavy Vehicles'!H34","v":29},{"$f":"'Cars & Peds'!K34+'Single Units'!I34+'Heavy Vehicles'!I34","v":21},{"$f":"'Cars & Peds'!L34+'Single Units'!J34+'Heavy Vehicles'!J34","v":7},{"$f":"'Cars & Peds'!M34","v":0},57,{"$f":"'Cars & Peds'!N34+'Single Units'!K34+'Heavy Vehicles'!K34","v":4},{"$f":"'Cars & Peds'!O34+'Single Units'!L34+'Heavy Vehicles'!L34","v":146},{"$f":"'Cars & Peds'!P34+'Single Units'!M34+'Heavy Vehicles'!M34","v":21},{"$f":"'Cars & Peds'!Q34","v":0},171,113,446,308,1151,421,1597,null,null,"","","00:00:00","00:00:00",null,null,0,0,0,0,0,0,0,0,0,0,0,0,0,0,0,0,0,0,0,0,0,"",0,0,0,0,0]
["12:45 PM",{"$f":"'Cars & Peds'!B35+'Single Units'!B35+'Heavy Vehicles'!B35","v":18},{"$f":"'Cars & Peds'!C35+'Single Units'!C35+'Heavy Vehicles'!C35","v":18},{"$f":"'Cars & Peds'!D35+'Single Units'!D35+'Heavy Vehicles'!D35","v":22},{"$f":"'Cars & Peds'!E35","v":0},58,{"$f":"'Cars & Peds'!F35+'Single Units'!E35+'Heavy Vehicles'!E35","v":14},{"$f":"'Cars & Peds'!G35+'Single Units'!F35+'Heavy Vehicles'!F35","v":113},{"$f":"'Cars & Peds'!H35+'Single Units'!G35+'Heavy Vehicles'!G35","v":24},{"$f":"'Cars & Peds'!I35","v":0},151,{"$f":"'Cars & Peds'!J35+'Single Units'!H35+'Heavy Vehicles'!H35","v":29},{"$f":"'Cars & Peds'!K35+'Single Units'!I35+'Heavy Vehicles'!I35","v":17},{"$f":"'Cars & Peds'!L35+'Single Units'!J35+'Heavy Vehicles'!J35","v":1},{"$f":"'Cars & Peds'!M35","v":0},47,{"$f":"'Cars & Peds'!N35+'Single Units'!K35+'Heavy Vehicles'!K35","v":2},{"$f":"'Cars & Peds'!O35+'Single Units'!L35+'Heavy Vehicles'!L35","v":96},{"$f":"'Cars & Peds'!P35+'Single Units'!M35+'Heavy Vehicles'!M35","v":22},{"$f":"'Cars & Peds'!Q35","v":0},120,105,438,271,1187,376,1625,null,null,"","","00:00:00","00:00:00",null,null,0,0,0,0,0,0,0,0,0,0,0,0,0,0,0,0,0,0,0,0,0,"",0,0,0,0,0]
["01:00 PM",{"$f":"'Cars & Peds'!B36+'Single Units'!B36+'Heavy Vehicles'!B36","v":1},{"$f":"'Cars & Peds'!C36+'Single Units'!C36+'Heavy Vehicles'!C36","v":0},{"$f":"'Cars & Peds'!D36+'Single Units'!D36+'Heavy Vehicles'!D36","v":0},{"$f":"'Cars & Peds'!E36","v":0},1,{"$f":"'Cars & Peds'!F36+'Single Units'!E36+'Heavy Vehicles'!E36","v":0},{"$f":"'Cars & Peds'!G36+'Single Units'!F36+'Heavy Vehicles'!F36","v":0},{"$f":"'Cars & Peds'!H36+'Single Units'!G36+'Heavy Vehicles'!G36","v":0},{"$f":"'Cars & Peds'!I36","v":0},0,{"$f":"'Cars & Peds'!J36+'Single Units'!H36+'Heavy Vehicles'!H36","v":1},{"$f":"'Cars & Peds'!K36+'Single Units'!I36+'Heavy Vehicles'!I36","v":0},{"$f":"'Cars & Peds'!L36+'Single Units'!J36+'Heavy Vehicles'!J36","v":0},{"$f":"'Cars & Peds'!M36","v":0},1,{"$f":"'Cars & Peds'!N36+'Single Units'!K36+'Heavy Vehicles'!K36","v":0},{"$f":"'Cars & Peds'!O36+'Single Units'!L36+'Heavy Vehicles'!L36","v":0},{"$f":"'Cars & Peds'!P36+'Single Units'!M36+'Heavy Vehicles'!M36","v":0},{"$f":"'Cars & Peds'!Q36","v":0},0,2,326,0,886,2,1212,null,null,"","","00:00:00","00:00:00",null,null,0,0,0,0,0,0,0,0,0,0,0,0,0,0,0,0,0,0,0,0,0,"",0,0,0,0,0]
["01:15 PM",{"$f":"'Cars & Peds'!B37+'Single Units'!B37+'Heavy Vehicles'!B37","v":0},{"$f":"'Cars & Peds'!C37+'Single Units'!C37+'Heavy Vehicles'!C37","v":0},{"$f":"'Cars & Peds'!D37+'Single Units'!D37+'Heavy Vehicles'!D37","v":0},{"$f":"'Cars & Peds'!E37","v":0},0,{"$f":"'Cars & Peds'!F37+'Single Units'!E37+'Heavy Vehicles'!E37","v":0},{"$f":"'Cars & Peds'!G37+'Single Units'!F37+'Heavy Vehicles'!F37","v":0},{"$f":"'Cars & Peds'!H37+'Single Units'!G37+'Heavy Vehicles'!G37","v":0},{"$f":"'Cars & Peds'!I37","v":0},0,{"$f":"'Cars & Peds'!J37+'Single Units'!H37+'Heavy Vehicles'!H37","v":0},{"$f":"'Cars & Peds'!K37+'Single Units'!I37+'Heavy Vehicles'!I37","v":0},{"$f":"'Cars & Peds'!L37+'Single Units'!J37+'Heavy Vehicles'!J37","v":0},{"$f":"'Cars & Peds'!M37","v":0},0,{"$f":"'Cars & Peds'!N37+'Single Units'!K37+'Heavy Vehicles'!K37","v":0},{"$f":"'Cars & Peds'!O37+'Single Units'!L37+'Heavy Vehicles'!L37","v":0},{"$f":"'Cars & Peds'!P37+'Single Units'!M37+'Heavy Vehicles'!M37","v":0},{"$f":"'Cars & Peds'!Q37","v":0},0,0,220,0,579,0,799,null,null,"","","00:00:00","00:00:00",null,null,0,0,0,0,0,0,0,0,0,0,0,0,0,0,0,0,0,0,0,0,0,"",0,0,0,0,0]
["01:30 PM",{"$f":"'Cars & Peds'!B38+'Single Units'!B38+'Heavy Vehicles'!B38","v":0},{"$f":"'Cars & Peds'!C38+'Single Units'!C38+'Heavy Vehicles'!C38","v":0},{"$f":"'Cars & Peds'!D38+'Single Units'!D38+'Heavy Vehicles'!D38","v":0},{"$f":"'Cars & Peds'!E38","v":0},0,{"$f":"'Cars & Peds'!F38+'Single Units'!E38+'Heavy Vehicles'!E38","v":0},{"$f":"'Cars & Peds'!G38+'Single Units'!F38+'Heavy Vehicles'!F38","v":0},{"$f":"'Cars & Peds'!H38+'Single Units'!G38+'Heavy Vehicles'!G38","v":0},{"$f":"'Cars & Peds'!I38","v":0},0,{"$f":"'Cars & Peds'!J38+'Single Units'!H38+'Heavy Vehicles'!H38","v":0},{"$f":"'Cars & Peds'!K38+'Single Units'!I38+'Heavy Vehicles'!I38","v":0},{"$f":"'Cars & Peds'!L38+'Single Units'!J38+'Heavy Vehicles'!J38","v":0},{"$f":"'Cars & Peds'!M38","v":0},0,{"$f":"'Cars & Peds'!N38+'Single Units'!K38+'Heavy Vehicles'!K38","v":0},{"$f":"'Cars & Peds'!O38+'Single Units'!L38+'Heavy Vehicles'!L38","v":0},{"$f":"'Cars & Peds'!P38+'Single Units'!M38+'Heavy Vehicles'!M38","v":0},{"$f":"'Cars & Peds'!Q38","v":0},0,0,107,0,271,0,378,null,null,"","","00:00:00","00:00:00",null,null,0,0,0,0,0,0,0,0,0,0,0,0,0,0,0,0,0,0,0,0,0,"",0,0,0,0,0]
["01:45 PM",{"$f":"'Cars & Peds'!B39+'Single Units'!B39+'Heavy Vehicles'!B39","v":0},{"$f":"'Cars & Peds'!C39+'Single Units'!C39+'Heavy Vehicles'!C39","v":0},{"$f":"'Cars & Peds'!D39+'Single Units'!D39+'Heavy Vehicles'!D39","v":0},{"$f":"'Cars & Peds'!E39","v":0},0,{"$f":"'Cars & Peds'!F39+'Single Units'!E39+'Heavy Vehicles'!E39","v":0},{"$f":"'Cars & Peds'!G39+'Single Units'!F39+'Heavy Vehicles'!F39","v":0},{"$f":"'Cars & Peds'!H39+'Single Units'!G39+'Heavy Vehicles'!G39","v":0},{"$f":"'Cars & Peds'!I39","v":0},0,{"$f":"'Cars & Peds'!J39+'Single Units'!H39+'Heavy Vehicles'!H39","v":0},{"$f":"'Cars & Peds'!K39+'Single Units'!I39+'Heavy Vehicles'!I39","v":0},{"$f":"'Cars & Peds'!L39+'Single Units'!J39+'Heavy Vehicles'!J39","v":0},{"$f":"'Cars & Peds'!M39","v":0},0,{"$f":"'Cars & Peds'!N39+'Single Units'!K39+'Heavy Vehicles'!K39","v":0},{"$f":"'Cars & Peds'!O39+'Single Units'!L39+'Heavy Vehicles'!L39","v":0},{"$f":"'Cars & Peds'!P39+'Single Units'!M39+'Heavy Vehicles'!M39","v":0},{"$f":"'Cars & Peds'!Q39","v":0},0,0,2,0,0,0,2,null,null,"","","00:00:00","00:00:00",null,null,0,0,0,0,0,0,0,0,0,0,0,0,0,0,0,0,0,0,0,0,0,"",0,0,0,0,0]
["02:00 PM",{"$f":"'Cars & Peds'!B40+'Single Units'!B40+'Heavy Vehicles'!B40","v":6},{"$f":"'Cars & Peds'!C40+'Single Units'!C40+'Heavy Vehicles'!C40","v":25},{"$f":"'Cars & Peds'!D40+'Single Units'!D40+'Heavy Vehicles'!D40","v":13},{"$f":"'Cars & Peds'!E40","v":0},44,{"$f":"'Cars & Peds'!F40+'Single Units'!E40+'Heavy Vehicles'!E40","v":3},{"$f":"'Cars & Peds'!G40+'Single Units'!F40+'Heavy Vehicles'!F40","v":130},{"$f":"'Cars & Peds'!H40+'Single Units'!G40+'Heavy Vehicles'!G40","v":24},{"$f":"'Cars & Peds'!I40","v":0},157,{"$f":"'Cars & Peds'!J40+'Single Units'!H40+'Heavy Vehicles'!H40","v":36},{"$f":"'Cars & Peds'!K40+'Single Units'!I40+'Heavy Vehicles'!I40","v":20},{"$f":"'Cars & Peds'!L40+'Single Units'!J40+'Heavy Vehicles'!J40","v":8},{"$f":"'Cars & Peds'!M40","v":0},64,{"$f":"'Cars & Peds'!N40+'Single Units'!K40+'Heavy Vehicles'!K40","v":3},{"$f":"'Cars & Peds'!O40+'Single Units'!L40+'Heavy Vehicles'!L40","v":107},{"$f":"'Cars & Peds'!P40+'Single Units'!M40+'Heavy Vehicles'!M40","v":23},{"$f":"'Cars & Peds'!Q40","v":0},133,108,108,290,290,398,398,null,null,"","","00:00:00","00:00:00",null,null,0,0,0,0,0,0,0,0,0,0,0,0,0,0,0,0,0,0,0,0,0,"",0,0,0,0,0]
["02:15 PM",{"$f":"'Cars & Peds'!B41+'Single Units'!B41+'Heavy Vehicles'!B41","v":15},{"$f":"'Cars & Peds'!C41+'Single Units'!C41+'Heavy Vehicles'!C41","v":17},{"$f":"'Cars & Peds'!D41+'Single Units'!D41+'Heavy Vehicles'!D41","v":17},{"$f":"'Cars & Peds'!E41","v":0},49,{"$f":"'Cars & Peds'!F41+'Single Units'!E41+'Heavy Vehicles'!E41","v":3},{"$f":"'Cars & Peds'!G41+'Single Units'!F41+'Heavy Vehicles'!F41","v":131},{"$f":"'Cars & Peds'!H41+'Single Units'!G41+'Heavy Vehicles'!G41","v":21},{"$f":"'Cars & Peds'!I41","v":0},155,{"$f":"'Cars & Peds'!J41+'Single Units'!H41+'Heavy Vehicles'!H41","v":23},{"$f":"'Cars & Peds'!K41+'Single Units'!I41+'Heavy Vehicles'!I41","v":27},{"$f":"'Cars & Peds'!L41+'Single Units'!J41+'Heavy Vehicles'!J41","v":2},{"$f":"'Cars & Peds'!M41","v":0},52,{"$f":"'Cars & Peds'!N41+'Single Units'!K41+'Heavy Vehicles'!K41","v":3},{"$f":"'Cars & Peds'!O41+'Single Units'!L41+'Heavy Vehicles'!L41","v":114},{"$f":"'Cars & Peds'!P41+'Single Units'!M41+'Heavy Vehicles'!M41","v":22},{"$f":"'Cars & Peds'!Q41","v":0},139,101,209,294,584,395,793,null,null,"","","00:00:00","00:00:00",null,null,0,0,0,0,0,0,0,0,0,0,0,0,0,0,0,0,0,0,0,0,0,"",0,0,0,0,0]
["02:30 PM",{"$f":"'Cars & Peds'!B42+'Single Units'!B42+'Heavy Vehicles'!B42","v":20},{"$f":"'Cars & Peds'!C42+'Single Units'!C42+'Heavy Vehicles'!C42","v":15},{"$f":"'Cars & Peds'!D42+'Single Units'!D42+'Heavy Vehicles'!D42","v":14},{"$f":"'Cars & Peds'!E42","v":0},49,{"$f":"'Cars & Peds'!F42+'Single Units'!E42+'Heavy Vehicles'!E42","v":7},{"$f":"'Cars & Peds'!G42+'Single Units'!F42+'Heavy Vehicles'!F42","v":121},{"$f":"'Cars & Peds'!H42+'Single Units'!G42+'Heavy Vehicles'!G42","v":25},{"$f":"'Cars & Peds'!I42","v":0},153,{"$f":"'Cars & Peds'!J42+'Single Units'!H42+'Heavy Vehicles'!H42","v":29},{"$f":"'Cars & Peds'!K42+'Single Units'!I42+'Heavy Vehicles'!I42","v":30},{"$f":"'Cars & Peds'!L42+'Single Units'!J42+'Heavy Vehicles'!J42","v":11},{"$f":"'Cars & Peds'!M42","v":0},70,{"$f":"'Cars & Peds'!N42+'Single Units'!K42+'Heavy Vehicles'!K42","v":4},{"$f":"'Cars & Peds'!O42+'Single Units'!L42+'Heavy Vehicles'!L42","v":119},{"$f":"'Cars & Peds'!P42+'Single Units'!M42+'Heavy Vehicles'!M42","v":25},{"$f":"'Cars & Peds'!Q42","v":0},148,119,328,301,885,420,1213,null,null,"","","00:00:00","00:00:00",null,null,0,0,0,0,0,0,0,0,0,0,0,0,0,0,0,0,0,0,0,0,0,"",0,0,0,0,0]
["02:45 PM",{"$f":"'Cars & Peds'!B43+'Single Units'!B43+'Heavy Vehicles'!B43","v":14},{"$f":"'Cars & Peds'!C43+'Single Units'!C43+'Heavy Vehicles'!C43","v":16},{"$f":"'Cars & Peds'!D43+'Single Units'!D43+'Heavy Vehicles'!D43","v":25},{"$f":"'Cars & Peds'!E43","v":0},55,{"$f":"'Cars & Peds'!F43+'Single Units'!E43+'Heavy Vehicles'!E43","v":5},{"$f":"'Cars & Peds'!G43+'Single Units'!F43+'Heavy Vehicles'!F43","v":137},{"$f":"'Cars & Peds'!H43+'Single Units'!G43+'Heavy Vehicles'!G43","v":20},{"$f":"'Cars & Peds'!I43","v":0},162,{"$f":"'Cars & Peds'!J43+'Single Units'!H43+'Heavy Vehicles'!H43","v":31},{"$f":"'Cars & Peds'!K43+'Single Units'!I43+'Heavy Vehicles'!I43","v":26},{"$f":"'Cars & Peds'!L43+'Single Units'!J43+'Heavy Vehicles'!J43","v":7},{"$f":"'Cars & Peds'!M43","v":0},64,{"$f":"'Cars & Peds'!N43+'Single Units'!K43+'Heavy Vehicles'!K43","v":5},{"$f":"'Cars & Peds'!O43+'Single Units'!L43+'Heavy Vehicles'!L43","v":122},{"$f":"'Cars & Peds'!P43+'Single Units'!M43+'Heavy Vehicles'!M43","v":21},{"$f":"'Cars & Peds'!Q43","v":0},148,119,447,310,1195,429,1642,null,null,"","","00:00:00","00:00:00",null,null,0,0,0,0,0,0,0,0,0,0,0,0,0,0,0,0,0,0,0,0,0,"",0,0,0,0,0]
["03:00 PM",{"$f":"'Cars & Peds'!B44+'Single Units'!B44+'Heavy Vehicles'!B44","v":20},{"$f":"'Cars & Peds'!C44+'Single Units'!C44+'Heavy Vehicles'!C44","v":28},{"$f":"'Cars & Peds'!D44+'Single Units'!D44+'Heavy Vehicles'!D44","v":24},{"$f":"'Cars & Peds'!E44","v":0},72,{"$f":"'Cars & Peds'!F44+'Single Units'!E44+'Heavy Vehicles'!E44","v":6},{"$f":"'Cars & Peds'!G44+'Single Units'!F44+'Heavy Vehicles'!F44","v":142},{"$f":"'Cars & Peds'!H44+'Single Units'!G44+'Heavy Vehicles'!G44","v":32},{"$f":"'Cars & Peds'!I44","v":0},180,{"$f":"'Cars & Peds'!J44+'Single Units'!H44+'Heavy Vehicles'!H44","v":20},{"$f":"'Cars & Peds'!K44+'Single Units'!I44+'Heavy Vehicles'!I44","v":21},{"$f":"'Cars & Peds'!L44+'Single Units'!J44+'Heavy Vehicles'!J44","v":5},{"$f":"'Cars & Peds'!M44","v":0},46,{"$f":"'Cars & Peds'!N44+'Single Units'!K44+'Heavy Vehicles'!K44","v":1},{"$f":"'Cars & Peds'!O44+'Single Units'!L44+'Heavy Vehicles'!L44","v":118},{"$f":"'Cars & Peds'!P44+'Single Units'!M44+'Heavy Vehicles'!M44","v":19},{"$f":"'Cars & Peds'!Q44","v":0},138,118,457,318,1223,436,1680,null,null,"","","00:00:00","00:00:00",null,null,0,0,0,0,0,0,0,0,0,0,0,0,0,0,0,0,0,0,0,0,0,"",0,0,0,0,0]
["03:15 PM",{"$f":"'Cars & Peds'!B45+'Single Units'!B45+'Heavy Vehicles'!B45","v":56},{"$f":"'Cars & Peds'!C45+'Single Units'!C45+'Heavy Vehicles'!C45","v":52},{"$f":"'Cars & Peds'!D45+'Single Units'!D45+'Heavy Vehicles'!D45","v":30},{"$f":"'Cars & Peds'!E45","v":0},138,{"$f":"'Cars & Peds'!F45+'Single Units'!E45+'Heavy Vehicles'!E45","v":4},{"$f":"'Cars & Peds'!G45+'Single Units'!F45+'Heavy Vehicles'!F45","v":141},{"$f":"'Cars & Peds'!H45+'Single Units'!G45+'Heavy Vehicles'!G45","v":35},{"$f":"'Cars & Peds'!I45","v":0},180,{"$f":"'Cars & Peds'!J45+'Single Units'!H45+'Heavy Vehicles'!H45","v":22},{"$f":"'Cars & Peds'!K45+'Single Units'!I45+'Heavy Vehicles'!I45","v":26},{"$f":"'Cars & Peds'!L45+'Single Units'!J45+'Heavy Vehicles'!J45","v":8},{"$f":"'Cars & Peds'!M45","v":0},56,{"$f":"'Cars & Peds'!N45+'Single Units'!K45+'Heavy Vehicles'!K45","v":7},{"$f":"'Cars & Peds'!O45+'Single Units'!L45+'Heavy Vehicles'!L45","v":117},{"$f":"'Cars & Peds'!P45+'Single Units'!M45+'Heavy Vehicles'!M45","v":15},{"$f":"'Cars & Peds'!Q45","v":0},139,194,550,319,1248,513,1798,null,null,"","","00:00:00","00:00:00",null,null,0,0,0,0,0,0,0,0,0,0,0,0,0,0,0,0,0,0,0,0,0,"",0,0,0,0,0]
["03:30 PM",{"$f":"'Cars & Peds'!B46+'Single Units'!B46+'Heavy Vehicles'!B46","v":28},{"$f":"'Cars & Peds'!C46+'Single Units'!C46+'Heavy Vehicles'!C46","v":42},{"$f":"'Cars & Peds'!D46+'Single Units'!D46+'Heavy Vehicles'!D46","v":27},{"$f":"'Cars & Peds'!E46","v":0},97,{"$f":"'Cars & Peds'!F46+'Single Units'!E46+'Heavy Vehicles'!E46","v":5},{"$f":"'Cars & Peds'!G46+'Single Units'!F46+'Heavy Vehicles'!F46","v":178},{"$f":"'Cars & Peds'!H46+'Single Units'!G46+'Heavy Vehicles'!G46","v":47},{"$f":"'Cars & Peds'!I46","v":0},230,{"$f":"'Cars & Peds'!J46+'Single Units'!H46+'Heavy Vehicles'!H46","v":30},{"$f":"'Cars & Peds'!K46+'Single Units'!I46+'Heavy Vehicles'!I46","v":26},{"$f":"'Cars & Peds'!L46+'Single Units'!J46+'Heavy Vehicles'!J46","v":8},{"$f":"'Cars & Peds'!M46","v":0},64,{"$f":"'Cars & Peds'!N46+'Single Units'!K46+'Heavy Vehicles'!K46","v":4},{"$f":"'Cars & Peds'!O46+'Single Units'!L46+'Heavy Vehicles'!L46","v":119},{"$f":"'Cars & Peds'!P46+'Single Units'!M46+'Heavy Vehicles'!M46","v":18},{"$f":"'Cars & Peds'!Q46","v":0},141,161,592,371,1318,532,1910,null,null,"","","00:00:00","00:00:00",null,null,0,0,0,0,0,0,0,0,0,0,0,0,0,0,0,0,0,0,0,0,0,"",0,0,0,0,0]
["03:45 PM",{"$f":"'Cars & Peds'!B47+'Single Units'!B47+'Heavy Vehicles'!B47","v":29},{"$f":"'Cars & Peds'!C47+'Single Units'!C47+'Heavy Vehicles'!C47","v":34},{"$f":"'Cars & Peds'!D47+'Single Units'!D47+'Heavy Vehicles'!D47","v":25},{"$f":"'Cars & Peds'!E47","v":0},88,{"$f":"'Cars & Peds'!F47+'Single Units'!E47+'Heavy Vehicles'!E47","v":4},{"$f":"'Cars & Peds'!G47+'Single Units'!F47+'Heavy Vehicles'!F47","v":189},{"$f":"'Cars & Peds'!H47+'Single Units'!G47+'Heavy Vehicles'!G47","v":37},{"$f":"'Cars & Peds'!I47","v":0},230,{"$f":"'Cars & Peds'!J47+'Single Units'!H47+'Heavy Vehicles'!H47","v":23},{"$f":"'Cars & Peds'!K47+'Single Units'!I47+'Heavy Vehicles'!I47","v":33},{"$f":"'Cars & Peds'!L47+'Single Units'!J47+'Heavy Vehicles'!J47","v":15},{"$f":"'Cars & Peds'!M47","v":0},71,{"$f":"'Cars & Peds'!N47+'Single Units'!K47+'Heavy Vehicles'!K47","v":5},{"$f":"'Cars & Peds'!O47+'Single Units'!L47+'Heavy Vehicles'!L47","v":117},{"$f":"'Cars & Peds'!P47+'Single Units'!M47+'Heavy Vehicles'!M47","v":28},{"$f":"'Cars & Peds'!Q47","v":0},150,159,632,380,1388,539,2020,null,{"$f":"MAX(AA28:AA47)","v":2020},2020,"03:45 PM","15:00:00","16:00:00",null,null,133,156,106,0,395,19,650,151,0,820,95,106,36,0,237,17,471,80,0,568,2020,"PEAK",0.93692022263450836,0.71557971014492749,0.89130434782608692,0.83450704225352113,0.94666666666666666]
["04:00 PM",{"$f":"'Cars & Peds'!B48+'Single Units'!B48+'Heavy Vehicles'!B48","v":19},{"$f":"'Cars & Peds'!C48+'Single Units'!C48+'Heavy Vehicles'!C48","v":46},{"$f":"'Cars & Peds'!D48+'Single Units'!D48+'Heavy Vehicles'!D48","v":20},{"$f":"'Cars & Peds'!E48","v":0},85,{"$f":"'Cars & Peds'!F48+'Single Units'!E48+'Heavy Vehicles'!E48","v":2},{"$f":"'Cars & Peds'!G48+'Single Units'!F48+'Heavy Vehicles'!F48","v":186},{"$f":"'Cars & Peds'!H48+'Single Units'!G48+'Heavy Vehicles'!G48","v":48},{"$f":"'Cars & Peds'!I48","v":0},236,{"$f":"'Cars & Peds'!J48+'Single Units'!H48+'Heavy Vehicles'!H48","v":32},{"$f":"'Cars & Peds'!K48+'Single Units'!I48+'Heavy Vehicles'!I48","v":18},{"$f":"'Cars & Peds'!L48+'Single Units'!J48+'Heavy Vehicles'!J48","v":10},{"$f":"'Cars & Peds'!M48","v":0},60,{"$f":"'Cars & Peds'!N48+'Single Units'!K48+'Heavy Vehicles'!K48","v":5},{"$f":"'Cars & Peds'!O48+'Single Units'!L48+'Heavy Vehicles'!L48","v":147},{"$f":"'Cars & Peds'!P48+'Single Units'!M48+'Heavy Vehicles'!M48","v":25},{"$f":"'Cars & Peds'!Q48","v":0},177,145,659,413,1483,558,2142,null,null,{"$f":"IF(AA48>=$AC$55,AA48,\"\")","v":""},"","00:00:00","00:00:00",{"$f":"MAX(AF48:AF55)","v":"16:30:00"},{"$f":"MAX(AG48:AG55)","v":"17:30:00"},{"$f":"IF($AA48>=$AC$55,SUM(B45:B48),0)","v":0},{"$f":"IF($AA48>=$AC$55,SUM(C45:C48),0)","v":0},{"$f":"IF($AA48>=$AC$55,SUM(D45:D48),0)","v":0},{"$f":"IF($AA48>=$AC$55,SUM(E45:E48),0)","v":0},0,{"$f":"IF($AA48>=$AC$55,SUM(G45:G48),0)","v":0},{"$f":"IF($AA48>=$AC$55,SUM(H45:H48),0)","v":0},{"$f":"IF($AA48>=$AC$55,SUM(I45:I48),0)","v":0},{"$f":"IF($AA48>=$AC$55,SUM(J45:J48),0)","v":0},0,{"$f":"IF($AA48>=$AC$55,SUM(L45:L48),0)","v":0},{"$f":"IF($AA48>=$AC$55,SUM(M45:M48),0)","v":0},{"$f":"IF($AA48>=$AC$55,SUM(N45:N48),0)","v":0},{"$f":"IF($AA48>=$AC$55,SUM(O45:O48),0)","v":0},0,{"$f":"IF($AA48>=$AC$55,SUM(Q45:Q48),0)","v":0},{"$f":"IF($AA48>=$AC$55,SUM(R45:R48),0)","v":0},{"$f":"IF($AA48>=$AC$55,SUM(S45:S48),0)","v":0},{"$f":"IF($AA48>=$AC$55,SUM(T45:T48),0)","v":0},0,{"$f":"IF($AA48>=$AC$55,SUM(Z45:Z48),0)","v":0},"",0,0,0,0,0]
["04:15 PM",{"$f":"'Cars & Peds'!B49+'Single Units'!B49+'Heavy Vehicles'!B49","v":34},{"$f":"'Cars & Peds'!C49+'Single Units'!C49+'Heavy Vehicles'!C49","v":42},{"$f":"'Cars & Peds'!D49+'Single Units'!D49+'Heavy Vehicles'!D49","v":22},{"$f":"'Cars & Peds'!E49","v":0},98,{"$f":"'Cars & Peds'!F49+'Single Units'!E49+'Heavy Vehicles'!E49","v":2},{"$f":"'Cars & Peds'!G49+'Single Units'!F49+'Heavy Vehicles'!F49","v":178},{"$f":"'Cars & Peds'!H49+'Single Units'!G49+'Heavy Vehicles'!G49","v":42},{"$f":"'Cars & Peds'!I49","v":0},222,{"$f":"'Cars & Peds'!J49+'Single Units'!H49+'Heavy Vehicles'!H49","v":24},{"$f":"'Cars & Peds'!K49+'Single Units'!I49+'Heavy Vehicles'!I49","v":30},{"$f":"'Cars & Peds'!L49+'Single Units'!J49+'Heavy Vehicles'!J49","v":16},{"$f":"'Cars & Peds'!M49","v":0},70,{"$f":"'Cars & Peds'!N49+'Single Units'!K49+'Heavy Vehicles'!K49","v":7},{"$f":"'Cars & Peds'!O49+'Single Units'!L49+'Heavy Vehicles'!L49","v":101},{"$f":"'Cars & Peds'!P49+'Single Units'!M49+'Heavy Vehicles'!M49","v":25},{"$f":"'Cars & Peds'!Q49","v":0},133,168,633,355,1519,523,2152,null,null,{"$f":"IF(AA49>=$AC$55,AA49,\"\")","v":""},"","00:00:00","00:00:00",null,null,0,{"$f":"IF($AA49>=$AC$55,SUM(C46:C49),0)","v":0},{"$f":"IF($AA49>=$AC$55,SUM(D46:D49),0)","v":0},0,0,0,0,0,0,0,0,0,0,{"$f":"IF($AA49>=$AC$55,SUM(O46:O49),0)","v":0},0,0,{"$f":"IF($AA49>=$AC$55,SUM(R46:R49),0)","v":0},0,0,0,0,"",0,0,0,0,0]
["04:30 PM",{"$f":"'Cars & Peds'!B50+'Single Units'!B50+'Heavy Vehicles'!B50","v":25},{"$f":"'Cars & Peds'!C50+'Single Units'!C50+'Heavy Vehicles'!C50","v":32},{"$f":"'Cars & Peds'!D50+'Single Units'!D50+'Heavy Vehicles'!D50","v":27},{"$f":"'Cars & Peds'!E50","v":0},84,{"$f":"'Cars & Peds'!F50+'Single Units'!E50+'Heavy Vehicles'!E50","v":8},{"$f":"'Cars & Peds'!G50+'Single Units'!F50+'Heavy Vehicles'!F50","v":192},{"$f":"'Cars & Peds'!H50+'Single Units'!G50+'Heavy Vehicles'!G50","v":56},{"$f":"'Cars & Peds'!I50","v":0},256,{"$f":"'Cars & Peds'!J50+'Single Units'!H50+'Heavy Vehicles'!H50","v":28},{"$f":"'Cars & Peds'!K50+'Single Units'!I50+'Heavy Vehicles'!I50","v":28},{"$f":"'Cars & Peds'!L50+'Single Units'!J50+'Heavy Vehicles'!J50","v":11},{"$f":"'Cars & Peds'!M50","v":0},67,{"$f":"'Cars & Peds'!N50+'Single Units'!K50+'Heavy Vehicles'!K50","v":4},{"$f":"'Cars & Peds'!O50+'Single Units'!L50+'Heavy Vehicles'!L50","v":129},{"$f":"'Cars & Peds'!P50+'Single Units'!M50+'Heavy Vehicles'!M50","v":22},{"$f":"'Cars & Peds'!Q50","v":0},155,151,623,411,1559,562,2182,null,null,"","","00:00:00","00:00:00",null,null,0,0,0,0,0,0,0,0,0,0,0,0,0,0,0,0,0,0,0,0,0,"",0,0,0,0,0]
["04:45 PM",{"$f":"'Cars & Peds'!B51+'Single Units'!B51+'Heavy Vehicles'!B51","v":28},{"$f":"'Cars & Peds'!C51+'Single Units'!C51+'Heavy Vehicles'!C51","v":50},{"$f":"'Cars & Peds'!D51+'Single Units'!D51+'Heavy Vehicles'!D51","v":32},{"$f":"'Cars & Peds'!E51","v":0},110,{"$f":"'Cars & Peds'!F51+'Single Units'!E51+'Heavy Vehicles'!E51","v":6},{"$f":"'Cars & Peds'!G51+'Single Units'!F51+'Heavy Vehicles'!F51","v":172},{"$f":"'Cars & Peds'!H51+'Single Units'!G51+'Heavy Vehicles'!G51","v":53},{"$f":"'Cars & Peds'!I51","v":0},231,{"$f":"'Cars & Peds'!J51+'Single Units'!H51+'Heavy Vehicles'!H51","v":22},{"$f":"'Cars & Peds'!K51+'Single Units'!I51+'Heavy Vehicles'!I51","v":23},{"$f":"'Cars & Peds'!L51+'Single Units'!J51+'Heavy Vehicles'!J51","v":4},{"$f":"'Cars & Peds'!M51","v":0},49,{"$f":"'Cars & Peds'!N51+'Single Units'!K51+'Heavy Vehicles'!K51","v":1},{"$f":"'Cars & Peds'!O51+'Single Units'!L51+'Heavy Vehicles'!L51","v":144},{"$f":"'Cars & Peds'!P51+'Single Units'!M51+'Heavy Vehicles'!M51","v":19},{"$f":"'Cars & Peds'!Q51","v":0},164,159,623,395,1574,554,2197,null,null,"","","00:00:00","00:00:00",null,null,0,0,0,0,0,0,0,0,0,0,0,0,0,0,0,0,0,0,0,0,0,"",0,0,0,0,0]
["05:00 PM",{"$f":"'Cars & Peds'!B52+'Single Units'!B52+'Heavy Vehicles'!B52","v":29},{"$f":"'Cars & Peds'!C52+'Single Units'!C52+'Heavy Vehicles'!C52","v":56},{"$f":"'Cars & Peds'!D52+'Single Units'!D52+'Heavy Vehicles'!D52","v":18},{"$f":"'Cars & Peds'!E52","v":0},103,{"$f":"'Cars & Peds'!F52+'Single Units'!E52+'Heavy Vehicles'!E52","v":10},{"$f":"'Cars & Peds'!G52+'Single Units'!F52+'Heavy Vehicles'!F52","v":185},{"$f":"'Cars & Peds'!H52+'Single Units'!G52+'Heavy Vehicles'!G52","v":62},{"$f":"'Cars & Peds'!I52","v":0},257,{"$f":"'Cars & Peds'!J52+'Single Units'!H52+'Heavy Vehicles'!H52","v":24},{"$f":"'Cars & Peds'!K52+'Single Units'!I52+'Heavy Vehicles'!I52","v":24},{"$f":"'Cars & Peds'!L52+'Single Units'!J52+'Heavy Vehicles'!J52","v":10},{"$f":"'Cars & Peds'!M52","v":0},58,{"$f":"'Cars & Peds'!N52+'Single Units'!K52+'Heavy Vehicles'!K52","v":3},{"$f":"'Cars & Peds'!O52+'Single Units'!L52+'Heavy Vehicles'!L52","v":110},{"$f":"'Cars & Peds'!P52+'Single Units'!M52+'Heavy Vehicles'!M52","v":17},{"$f":"'Cars & Peds'!Q52","v":0},130,161,639,387,1548,548,2187,null,null,"","","00:00:00","00:00:00",null,null,0,0,0,0,0,0,0,0,0,0,0,0,0,0,0,0,0,0,0,0,0,"",0,0,0,0,0]
["05:15 PM",{"$f":"'Cars & Peds'!B53+'Single Units'!B53+'Heavy Vehicles'!B53","v":27},{"$f":"'Cars & Peds'!C53+'Single Units'!C53+'Heavy Vehicles'!C53","v":59},{"$f":"'Cars & Peds'!D53+'Single Units'!D53+'Heavy Vehicles'!D53","v":30},{"$f":"'Cars & Peds'!E53","v":0},116,{"$f":"'Cars & Peds'!F53+'Single Units'!E53+'Heavy Vehicles'!E53","v":6},{"$f":"'Cars & Peds'!G53+'Single Units'!F53+'Heavy Vehicles'!F53","v":193},{"$f":"'Cars & Peds'!H53+'Single Units'!G53+'Heavy Vehicles'!G53","v":52},{"$f":"'Cars & Peds'!I53","v":0},251,{"$f":"'Cars & Peds'!J53+'Single Units'!H53+'Heavy Vehicles'!H53","v":16},{"$f":"'Cars & Peds'!K53+'Single Units'!I53+'Heavy Vehicles'!I53","v":25},{"$f":"'Cars & Peds'!L53+'Single Units'!J53+'Heavy Vehicles'!J53","v":12},{"$f":"'Cars & Peds'!M53","v":0},53,{"$f":"'Cars & Peds'!N53+'Single Units'!K53+'Heavy Vehicles'!K53","v":6},{"$f":"'Cars & Peds'!O53+'Single Units'!L53+'Heavy Vehicles'!L53","v":123},{"$f":"'Cars & Peds'!P53+'Single Units'!M53+'Heavy Vehicles'!M53","v":20},{"$f":"'Cars & Peds'!Q53","v":0},149,169,640,400,1593,569,2233,null,null,2233,"05:15 PM","16:30:00","17:30:00",null,null,109,197,107,0,413,30,742,223,0,995,90,100,37,0,227,14,506,78,0,598,2233,"PEAK",0.98110720562390163,0.89008620689655171,0.96789883268482491,0.84701492537313428,0.91158536585365857]
["05:30 PM",{"$f":"'Cars & Peds'!B54+'Single Units'!B54+'Heavy Vehicles'!B54","v":30},{"$f":"'Cars & Peds'!C54+'Single Units'!C54+'Heavy Vehicles'!C54","v":40},{"$f":"'Cars & Peds'!D54+'Single Units'!D54+'Heavy Vehicles'!D54","v":34},{"$f":"'Cars & Peds'!E54","v":0},104,{"$f":"'Cars & Peds'!F54+'Single Units'!E54+'Heavy Vehicles'!E54","v":3},{"$f":"'Cars & Peds'!G54+'Single Units'!F54+'Heavy Vehicles'!F54","v":159},{"$f":"'Cars & Peds'!H54+'Single Units'!G54+'Heavy Vehicles'!G54","v":58},{"$f":"'Cars & Peds'!I54","v":0},220,{"$f":"'Cars & Peds'!J54+'Single Units'!H54+'Heavy Vehicles'!H54","v":28},{"$f":"'Cars & Peds'!K54+'Single Units'!I54+'Heavy Vehicles'!I54","v":29},{"$f":"'Cars & Peds'!L54+'Single Units'!J54+'Heavy Vehicles'!J54","v":11},{"$f":"'Cars & Peds'!M54","v":0},68,{"$f":"'Cars & Peds'!N54+'Single Units'!K54+'Heavy Vehicles'!K54","v":5},{"$f":"'Cars & Peds'!O54+'Single Units'!L54+'Heavy Vehicles'!L54","v":120},{"$f":"'Cars & Peds'!P54+'Single Units'!M54+'Heavy Vehicles'!M54","v":21},{"$f":"'Cars & Peds'!Q54","v":0},146,172,661,366,1548,538,2209,null,null,"","","00:00:00","00:00:00",null,null,0,0,0,0,0,0,0,0,0,0,0,0,0,0,0,0,0,0,0,0,0,"",0,0,0,0,0]
["05:45 PM",{"$f":"'Cars & Peds'!B55+'Single Units'!B55+'Heavy Vehicles'!B55","v":30},{"$f":"'Cars & Peds'!C55+'Single Units'!C55+'Heavy Vehicles'!C55","v":45},{"$f":"'Cars & Peds'!D55+'Single Units'!D55+'Heavy Vehicles'!D55","v":28},{"$f":"'Cars & Peds'!E55","v":0},103,{"$f":"'Cars & Peds'!F55+'Single Units'!E55+'Heavy Vehicles'!E55","v":2},{"$f":"'Cars & Peds'!G55+'Single Units'!F55+'Heavy Vehicles'!F55","v":176},{"$f":"'Cars & Peds'!H55+'Single Units'!G55+'Heavy Vehicles'!G55","v":54},{"$f":"'Cars & Peds'!I55","v":0},232,{"$f":"'Cars & Peds'!J55+'Single Units'!H55+'Heavy Vehicles'!H55","v":35},{"$f":"'Cars & Peds'!K55+'Single Units'!I55+'Heavy Vehicles'!I55","v":21},{"$f":"'Cars & Peds'!L55+'Single Units'!J55+'Heavy Vehicles'!J55","v":8},{"$f":"'Cars & Peds'!M55","v":0},64,{"$f":"'Cars & Peds'!N55+'Single Units'!K55+'Heavy Vehicles'!K55","v":7},{"$f":"'Cars & Peds'!O55+'Single Units'!L55+'Heavy Vehicles'!L55","v":107},{"$f":"'Cars & Peds'!P55+'Single Units'!M55+'Heavy Vehicles'!M55","v":10},{"$f":"'Cars & Peds'!Q55","v":0},124,167,669,356,1509,523,{"$f":"SUM(Z52:Z55)","v":2178},null,{"$f":"MAX(AA48:AA55)","v":2233},"","","00:00:00","00:00:00",null,null,0,0,0,0,0,0,0,0,0,0,0,0,0,0,0,0,0,0,0,0,0,"",0,0,0,0,0]
[]
[null,null,null,null,"All",{"$f":"SUM(F12:F55)","v":2360},null,null,null,"All",{"$f":"SUM(K12:K55)","v":5197},null,null,null,"All",{"$f":"SUM(P12:P55)","v":2164},null,null,null,"All",{"$f":"SUM(U12:U55)","v":5023}]
[null,null,null,null,"SU",{"$f":"SUM('Single Units'!B12:D55)","v":67},null,null,null,"SU",{"$f":"SUM('Single Units'!E12:G55)","v":136},null,null,null,"SU",{"$f":"SUM('Single Units'!H12:J55)","v":52},null,null,null,"SU",{"$f":"SUM('Single Units'!K12:M55)","v":181}]
[null,null,null,null,"HV",{"$f":"SUM('Heavy Vehicles'!B12:D55)","v":16},null,null,null,"HV",{"$f":"SUM('Heavy Vehicles'!E12:G55)","v":73},null,null,null,"HV",{"$f":"SUM('Heavy Vehicles'!H12:J55)","v":10},null,null,null,"HV",{"$f":"SUM('Heavy Vehicles'!K12:M55)","v":62}]
[null,null,null,null,"Truck %",{"$f":"(F58+F59)/F57","v":3.5169491525423729E-2},null,null,null,"Truck %",{"$f":"(K58+K59)/K57","v":4.0215508947469697E-2},null,null,null,"Truck %",{"$f":"(P58+P59)/P57","v":2.865064695009242E-2},null,null,null,"Truck %",{"$f":"(U58+U59)/U57","v":4.8377463667131193E-2}]

{"sheet":"Summary","index":6,"n_rows":17,"n_cols":37,"rows_kept":17,"cut":false,"hidden":false,"merged":[[12,8,13,8],[12,16,12,18],[11,36,13,36],[9,33,10,36],[0,0,0,1],[1,0,1,1],[2,0,2,1],[3,0,3,1],[4,0,4,1],[5,0,5,1],[6,0,6,1],[7,0,7,1],[12,29,13,29],[11,35,13,35],[12,2,12,4],[12,5,12,6],[12,7,13,7],[11,33,13,33],[11,34,13,34],[10,23,10,29],[11,23,11,27],[11,28,11,29],[12,23,12,25],[12,26,12,27],[12,28,13,28],[11,30,13,30],[9,30,10,32],[11,31,13,31],[11,32,13,32],[12,22,13,22],[11,21,11,22],[12,19,12,20],[11,2,11,6],[11,7,11,8],[11,9,11,13],[11,14,11,15],[11,16,11,20],[12,21,13,21],[12,9,12,11],[12,12,12,13],[12,14,13,14],[12,15,13,15],[0,2,0,36],[1,2,1,36],[2,2,2,36],[10,2,10,8],[10,9,10,15],[10,16,10,22],[3,2,3,36],[4,2,4,36],[5,2,5,36],[6,2,6,36],[7,2,7,36],[9,2,9,8],[9,9,9,15],[9,16,9,22],[9,23,9,29]]}
["File Name:",null,{"$f":"'Cars & Peds'!C1:P1","v":"E:\\2016 DATA\\TURNING MOVEMENTS\\TM#202 M-24@ TURRILL LAPEER\\TM_160202_353490_10-12-2016.ppd"}]
["Start Date:",null,{"$f":"'Cars & Peds'!C2:P2","v":"10/12/2016"}]
["Start Time:",null,{"$f":"'Cars & Peds'!C3:P3","v":"7:00:00 AM"}]
["Site Code:",null,{"$f":"'Cars & Peds'!C4:P4","v":"160202"}]
["Major Road:",null,{"$f":"'Cars & Peds'!C5:P5","v":"M-24 (LAPEER RD)"}]
["Minor Road:",null,{"$f":"'Cars & Peds'!C6:P6","v":"TURRILL RD"}]
["City/Township:",null,{"$f":"'Cars & Peds'!C7:P7","v":"LAPEER TWP"}]
["County:",null,{"$f":"'Cars & Peds'!C8:P8","v":"LAPEER"}]
[]
[null,null,{"$f":"'Cars & Peds'!$B$9","v":"M-24/LAPEER RD"},null,null,null,null,null,null,{"$f":"'Cars & Peds'!$F$9","v":"TURRILL RD"},null,null,null,null,null,null,{"$f":"'Cars & Peds'!$J$9","v":"M-24/LAPEER RD"},null,null,null,null,null,null,{"$f":"'Cars & Peds'!$N$9","v":"TURRILL RD"},null,null,null,null,null,null,"INTERSECTION TOTAL COUNTS",null,null,"TIME OF DAY"]
[null,null,"Northbound",null,null,null,null,null,null,"Eastbound",null,null,null,null,null,null,"Southbound",null,null,null,null,null,null,"Westbound"]
[null,null,"Heavy Vehicles % =",null,null,null,null,{"$f":"Calculations!F60","v":3.5169491525423729E-2},null,"Heavy Vehicles % =",null,null,null,null,{"$f":"Calculations!K60","v":4.0215508947469697E-2},null,"Heavy Vehicles % =",null,null,null,null,{"$f":"Calculations!P60","v":2.865064695009242E-2},null,"Heavy Vehicles % =",null,null,null,null,{"$f":"Calculations!U60","v":4.8377463667131193E-2},null,"N-S","E-W","TOTAL","PEAK","FROM","TO","PHF"]
[null,null,"VEHICLES",null,null,"PED.",null,"Is Eng. Jdg. Needed?","PHF","VEHICLES",null,null,"PED.",null,"Is Eng. Jdg. Needed?","PHF","VEHICLES",null,null,"PED.",null,"Is Eng. Jdg. Needed?","PHF","VEHICLES",null,null,"PED.",null,"Is Eng. Jdg. Needed?","PHF"]
[null,null,"Right","Through","Left","COUNT","CALLS",null,null,"Right","Through","Left","COUNT","CALLS",null,null,"Right","Through","Left","COUNT","CALLS",null,null,"Right","Through","Left","COUNT","CALLS"]
[null,null,{"$f":"MAX(Calculations!AJ12:AJ27)","v":64},{"$f":"MAX(Calculations!AK12:AK27)","v":80},{"$f":"MAX(Calculations!AL12:AL27)","v":106},{"$f":"MAX(Calculations!AM12:AM27)","v":0},{"$f":"IF(F15<5.1,F15,IF(AND(F15>5,F15<10.1),5,IF(F15>10.1,ROUNDUP(F15/2,0),\"E\")))","v":0},{"$f":"IF(G15>15.1,\"YES\", \"NO\")","v":"NO"},{"$f":"MAX(Calculations!BG12:BG27)","v":0.88028169014084512},{"$f":"MAX(Calculations!AO12:AO27)","v":12},{"$f":"MAX(Calculations!AP12:AP27)","v":283},{"$f":"MAX(Calculations!AQ12:AQ27)","v":47},{"$f":"MAX(Calculations!AR12:AR27)","v":0},{"$f":"IF(M15<5.1,M15,IF(AND(M15>5,M15<10.1),5,IF(M15>10.1,ROUNDUP(M15/2,0),\"E\")))","v":0},{"$f":"IF(N15>15.1,\"YES\", \"NO\")","v":"NO"},{"$f":"MAX(Calculations!BH12:BH27)","v":0.91935483870967738},{"$f":"MAX(Calculations!AT12:AT27)","v":224},{"$f":"MAX(Calculations!AU12:AU27)","v":212},{"$f":"MAX(Calculations!AV12:AV27)","v":43},{"$f":"MAX(Calculations!AW12:AW27)","v":0},{"$f":"IF(T15<5.1,T15,IF(AND(T15>5,T15<10.1),5,IF(T15>10.1,ROUNDUP(T15/2,0),\"E\")))","v":0},{"$f":"IF(U15>15.1,\"YES\", \"NO\")","v":"NO"},{"$f":"MAX(Calculations!BI12:BI27)","v":0.89365671641791045},{"$f":"MAX(Calculations!AY12:AY27)","v":5},{"$f":"MAX(Calculations!AZ12:AZ27)","v":785},{"$f":"MAX(Calculations!BA12:BA27)","v":133},{"$f":"MAX(Calculations!BB12:BB27)","v":0},{"$f":"IF(AA15<5.1,AA15,IF(AND(AA15>5,AA15<10.1),5,IF(AA15>10.1,ROUNDUP(AA15/2,0),\"E\")))","v":0},{"$f":"IF(AB15>15.1,\"YES\", \"NO\")","v":"NO"},{"$f":"MAX(Calculations!BJ12:BJ27)","v":0.9120553359683794},{"$f":"C15+D15+E15+Q15+R15+S15","v":729},{"$f":"J15+K15+L15+X15+Y15+Z15","v":1265},{"$f":"MAX(Calculations!BD12:BD27)","v":1994},"AM",{"$f":"Calculations!AH12","v":"07:00:00"},{"$f":"Calculations!AI12","v":"08:00:00"},{"$f":"MAX(Calculations!BF12:BF27)","v":0.94056603773584901}]
[null,null,{"$f":"MAX(Calculations!AJ28:AJ47)","v":133},{"$f":"MAX(Calculations!AK28:AK47)","v":156},{"$f":"MAX(Calculations!AL28:AL47)","v":106},{"$f":"MAX(Calculations!AM28:AM47)","v":0},{"$f":"IF(F16<5.1,F16,IF(AND(F16>5,F16<10.1),5,IF(F16>10.1,ROUNDUP(F16/2,0),\"E\")))","v":0},{"$f":"IF(G16>15.1,\"YES\", \"NO\")","v":"NO"},{"$f":"MAX(Calculations!BG28:BG47)","v":0.71557971014492749},{"$f":"MAX(Calculations!AO28:AO47)","v":19},{"$f":"MAX(Calculations!AP28:AP47)","v":650},{"$f":"MAX(Calculations!AQ28:AQ47)","v":151},{"$f":"MAX(Calculations!AR28:AR47)","v":0},{"$f":"IF(M16<5.1,M16,IF(AND(M16>5,M16<10.1),5,IF(M16>10.1,ROUNDUP(M16/2,0),\"E\")))","v":0},{"$f":"IF(N16>15.1,\"YES\", \"NO\")","v":"NO"},{"$f":"MAX(Calculations!BH28:BH47)","v":0.89130434782608692},{"$f":"MAX(Calculations!AT28:AT47)","v":95},{"$f":"MAX(Calculations!AU28:AU47)","v":106},{"$f":"MAX(Calculations!AV28:AV47)","v":36},{"$f":"MAX(Calculations!AW28:AW47)","v":0},{"$f":"IF(T16<5.1,T16,IF(AND(T16>5,T16<10.1),5,IF(T16>10.1,ROUNDUP(T16/2,0),\"E\")))","v":0},{"$f":"IF(U16>15.1,\"YES\", \"NO\")","v":"NO"},{"$f":"MAX(Calculations!BI28:BI47)","v":0.83450704225352113},{"$f":"MAX(Calculations!AY28:AY47)","v":17},{"$f":"MAX(Calculations!AZ28:AZ47)","v":471},{"$f":"MAX(Calculations!BA28:BA47)","v":80},{"$f":"MAX(Calculations!BB28:BB47)","v":0},{"$f":"IF(AA16<5.1,AA16,IF(AND(AA16>5,AA16<10.1),5,IF(AA16>10.1,ROUNDUP(AA16/2,0),\"E\")))","v":0},{"$f":"IF(AB16>15.1,\"YES\", \"NO\")","v":"NO"},{"$f":"MAX(Calculations!BJ28:BJ47)","v":0.94666666666666666},{"$f":"C16+D16+E16+Q16+R16+S16","v":632},{"$f":"J16+K16+L16+X16+Y16+Z16","v":1388},{"$f":"MAX(Calculations!BD28:BD47)","v":2020},"MD",{"$f":"Calculations!AH28","v":"15:00:00"},{"$f":"Calculations!AI28","v":"16:00:00"},{"$f":"MAX(Calculations!BF28:BF47)","v":0.93692022263450836}]
[null,null,{"$f":"MAX(Calculations!AJ48:AJ55)","v":109},{"$f":"MAX(Calculations!AK48:AK55)","v":197},{"$f":"MAX(Calculations!AL48:AL55)","v":107},{"$f":"MAX(Calculations!AM48:AM55)","v":0},{"$f":"IF(F17<5.1,F17,IF(AND(F17>5,F17<10.1),5,IF(F17>10.1,ROUNDUP(F17/2,0),\"E\")))","v":0},{"$f":"IF(G17>15.1,\"YES\", \"NO\")","v":"NO"},{"$f":"MAX(Calculations!BG48:BG55)","v":0.89008620689655171},{"$f":"MAX(Calculations!AO48:AO55)","v":30},{"$f":"MAX(Calculations!AP48:AP55)","v":742},{"$f":"MAX(Calculations!AQ48:AQ55)","v":223},{"$f":"MAX(Calculations!AR48:AR55)","v":0},{"$f":"IF(M17<5.1,M17,IF(AND(M17>5,M17<10.1),5,IF(M17>10.1,ROUNDUP(M17/2,0),\"E\")))","v":0},{"$f":"IF(N17>15.1,\"YES\", \"NO\")","v":"NO"},{"$f":"MAX(Calculations!BH48:BH55)","v":0.96789883268482491},{"$f":"MAX(Calculations!AT48:AT55)","v":90},{"$f":"MAX(Calculations!AU48:AU55)","v":100},{"$f":"MAX(Calculations!AV48:AV55)","v":37},{"$f":"MAX(Calculations!AW48:AW55)","v":0},{"$f":"IF(T17<5.1,T17,IF(AND(T17>5,T17<10.1),5,IF(T17>10.1,ROUNDUP(T17/2,0),\"E\")))","v":0},{"$f":"IF(U17>15.1,\"YES\", \"NO\")","v":"NO"},{"$f":"MAX(Calculations!BI48:BI55)","v":0.84701492537313428},{"$f":"MAX(Calculations!AY48:AY55)","v":14},{"$f":"MAX(Calculations!AZ48:AZ55)","v":506},{"$f":"MAX(Calculations!BA48:BA55)","v":78},{"$f":"MAX(Calculations!BB48:BB55)","v":0},{"$f":"IF(AA17<5.1,AA17,IF(AND(AA17>5,AA17<10.1),5,IF(AA17>10.1,ROUNDUP(AA17/2,0),\"E\")))","v":0},{"$f":"IF(AB17>15.1,\"YES\", \"NO\")","v":"NO"},{"$f":"MAX(Calculations!BJ48:BJ55)","v":0.91158536585365857},{"$f":"C17+D17+E17+Q17+R17+S17","v":640},{"$f":"J17+K17+L17+X17+Y17+Z17","v":1593},{"$f":"MAX(Calculations!BD48:BD55)","v":2233},"PM",{"$f":"Calculations!AH48","v":"16:30:00"},{"$f":"Calculations!AI48","v":"17:30:00"},{"$f":"MAX(Calculations!BF48:BF55)","v":0.98110720562390163}]