{"text_format":"1","workbook":"xlsx","n_sheets":5,"sheets":["Menu","Properties","STA Summary","Search","Data Summary"],"not_rendered":{"charts":0,"images":1,"macros":1,"external_links":0,"defined_names":13,"comments":0,"pivot_tables":0},"unopened":[],"bounds":{"document_bytes":16777216,"sheet_cells":100000,"rows_first":2000,"rows_last":500,"rows_between":2000,"halvings":0,"cell_chars":16384,"cell_head_chars":4096},"cells_cut":0,"cells_raw":0,"read":"whole","date_system":"1900"}

{"sheet":"Menu","index":0,"n_rows":20,"n_cols":8,"rows_kept":20,"cut":false,"hidden":false,"merged":[[22,10,22,11],[22,12,22,13],[2,1,2,4],[13,7,13,8],[8,5,8,6],[15,1,15,2],[22,6,22,7],[22,8,22,9]]}
[{"$f":"Search!AE1","v":"MDOT HMA STA Worksheet v1.10 - FY 2022 [effective for contracts containing frequently used special provision 12SP501(U), 12SP501(V), 12SP501(W), 20SP501(R) and/or 20SP501(S)]"}]
[{"$f":"Search!AE2","v":"1/14/22"}]
[null,"Mix Information for PWL Calculations"]
[]
[null,"Control Section",null,"<<<   Input","Mix Type",{"$f":"IF(Search!N3=0,\" \",VLOOKUP(Search!N3,Search!F4:K66,2))","v":"2E03"},null,"<<< Select"]
[null,"Job Number",null,"<<<   Input","Shldr Mix/Vibe Res.",{"$f":"IF(Search!S3=0,\" \",VLOOKUP(Search!S3,Search!S4:U5,2))","v":"No"},null,"<<< Select"]
[null,"Testing Lab",null,"<<<   Input","Density QA",{"$f":"IF(Search!W3=0,\" \",VLOOKUP(Search!W3,Search!W4:Y8,2))","v":"Std QA"},null,"<<< Select"]
[null,"Lab Location",null,"<<<   Input","Binder Method",{"$f":"IF(Search!W10=0,\" \",VLOOKUP(Search!W10,Search!W11:X12,2))","v":"Ignition"},null,"<<< Select"]
[null,"Mix Design #",null,"<<<   Input","Contractor",{"$f":"IF(Search!W33=0,\" \",VLOOKUP(Search!W33,Search!W34:X83,2))","v":"Ace-Saginaw Paving Co"},null,"<<< Select"]
[null,"Unit Price (per ton)",null,"<<<   Input","Specification",{"$f":"IF(Search!N8=0,\" \",VLOOKUP(Search!N8,Search!N9:O10,2))","v":"12SP501U"},null,"<<< Select"]
[null,"Contract Base Pice (per ton)",null,"<<<   Input"]
[null,"Plant Location",null,"<<<   Input"]
[null,"Plant ID",{"$f":"IF(Search!Z33=0,\" \",VLOOKUP(Search!Z33,Search!Z34:AC133,4))","v":"10-03"},"<<< Select"]
[]
[]
[null,"Property",null,"Binder ","AV","VMA","Density"]
[null,"Target or Minimum Density",null,"From JMF",{"$f":"IF(Search!W3=4,VLOOKUP(Search!N3,Search!F4:K66,3),IF(Search!S3=1,2.5,VLOOKUP(Search!N3,Search!F4:K66,3)))","v":3},{"$f":"IF(Search!N3=0,\" \",VLOOKUP(Search!N3,Search!F4:K66,4))","v":13},{"$f":"IF(Search!W3=0,\" \",VLOOKUP(Search!W3,Search!W4:Y8,3))","v":92}]
[null,"Dev. from Target - Full/Incentive Pay Range ",null,"≤ 0.45","≤ 1.00","≤ 1.00",{"$f":"IF(OR(Search!$W$3=2,Search!$W$3=4,Search!$W$3=5),\"NA\",VLOOKUP(Search!$N$20,Search!$N$21:$R$23,3))","v":"92.00 ≤"}]
[null,"Dev. from Target - Disincentive Pay Range ",null,"0.46 - 1.00","1.01 - 2.00",{"$f":"IF(Search!N8=0,\" \",VLOOKUP(Search!N8,Search!N9:R10,4))","v":"1.01 - 2.00"},{"$f":"IF(OR(Search!$W$3=2,Search!$W$3=4,Search!$W$3=5),\"NA\",VLOOKUP(Search!$N$20,Search!$N$21:$R$23,4))","v":"90.00 - 92.00"}]
[null,"Dev. from Target - Section l.1.C",null,"1.00 <","2.00 <",{"$f":"IF(Search!N8=0,\" \",VLOOKUP(Search!N8,Search!N9:R10,5))","v":"2.00 <"},{"$f":"IF(OR(Search!$W$3=2,Search!$W$3=4,Search!$W$3=5),\"NA\",VLOOKUP(Search!$N$20,Search!$N$21:$R$23,5))","v":"< 90.00"}]

{"sheet":"Properties","index":1,"n_rows":218,"n_cols":76,"rows_kept":218,"cut":false,"hidden":false,"merged":[[28,72,31,72],[28,73,31,73],[24,75,27,75],[20,75,23,75],[16,75,19,75],[12,66,15,66],[16,66,19,66],[12,70,15,70],[12,74,15,74],[24,73,27,73],[48,75,51,75],[44,75,47,75],[40,75,43,75],[36,75,39,75],[32,75,35,75],[28,75,31,75],[72,75,75,75],[68,75,71,75],[64,75,67,75],[60,75,63,75],[56,75,59,75],[52,75,55,75],[36,73,39,73],[32,71,35,71],[32,72,35,72],[16,71,19,71],[16,72,19,72],[16,73,19,73],[44,67,47,67],[44,68,47,68],[44,69,47,69],[44,71,47,71],[104,75,107,75],[100,75,103,75],[96,75,99,75],[84,75,87,75],[80,75,83,75],[76,75,79,75],[128,75,131,75],[124,75,127,75],[120,75,123,75],[116,75,119,75],[112,75,115,75],[108,75,111,75],[152,75,155,75],[148,75,151,75],[144,75,147,75],[140,75,143,75],[136,75,139,75],[132,75,135,75],[88,75,91,75],[176,75,179,75],[172,75,175,75],[168,75,171,75],[164,75,167,75],[160,75,163,75],[156,75,159,75],[6,4,6,5],[6,6,6,7],[208,75,211,75],[204,75,207,75],[200,75,203,75],[196,75,199,75],[192,75,195,75],[188,75,191,75],[184,75,187,75],[180,75,183,75],[0,1,0,7],[3,4,3,5],[5,4,5,5],[4,4,4,5],[2,2,2,3],[1,2,1,3],[1,4,1,5],[2,4,2,5],[1,6,1,7],[2,6,2,7],[6,2,6,3],[3,2,3,3],[7,6,7,7],[4,6,4,7],[5,6,5,7],[5,2,5,3],[36,68,39,68],[36,59,39,59],[36,62,39,62],[36,47,39,47],[36,48,39,48],[36,69,39,69],[36,71,39,71],[36,72,39,72],[36,65,39,65],[36,60,39,60],[36,49,39,49],[36,50,39,50],[36,53,39,53],[36,54,39,54],[36,57,39,57],[36,58,39,58],[36,29,39,29],[36,51,39,51],[36,52,39,52],[36,41,39,41],[36,31,39,31],[36,32,39,32],[36,33,39,33],[32,62,35,62],[32,64,35,64],[32,52,35,52],[36,46,39,46],[36,39,39,39],[36,40,39,40],[36,64,39,64],[32,51,35,51],[32,45,35,45],[32,46,35,46],[7,4,7,5],[4,2,4,3],[3,6,3,7],[7,2,7,3],[12,2,15,2],[16,2,19,2],[20,2,23,2],[24,2,27,2],[36,61,39,61],[32,73,35,73],[32,54,35,54],[32,57,35,57],[32,58,35,58],[32,59,35,59],[32,40,35,40],[32,41,35,41],[32,43,35,43],[32,49,35,49],[32,50,35,50],[36,34,39,34],[36,42,39,42],[36,43,39,43],[36,23,39,23],[36,24,39,24],[36,25,39,25],[36,26,39,26],[36,27,39,27],[36,28,39,28],[32,65,35,65],[32,67,35,67],[32,42,35,42],[36,38,39,38],[36,35,39,35],[36,36,39,36],[36,67,39,67],[36,37,39,37],[36,44,39,44],[36,45,39,45],[36,30,39,30],[32,60,35,60],[32,61,35,61],[28,69,31,69],[28,71,31,71],[28,64,31,64],[28,65,31,65],[28,67,31,67],[28,68,31,68],[28,53,31,53],[28,54,31,54],[28,39,31,39],[32,23,35,23],[32,24,35,24],[32,25,35,25],[32,26,35,26],[32,27,35,27],[28,37,31,37],[28,23,31,23],[28,24,31,24],[28,25,31,25],[28,26,31,26],[28,38,31,38],[28,40,31,40],[28,61,31,61],[28,62,31,62],[28,57,31,57],[28,58,31,58],[32,47,35,47],[32,48,35,48],[32,53,35,53],[32,68,35,68],[32,69,35,69],[32,35,35,35],[32,36,35,36],[28,35,31,35],[28,36,31,36],[28,51,31,51],[28,52,31,52],[28,41,31,41],[28,42,31,42],[28,43,31,43],[28,44,31,44],[28,48,31,48],[28,49,31,49],[28,50,31,50],[28,47,31,47],[32,28,35,28],[32,29,35,29],[32,30,35,30],[32,31,35,31],[32,32,35,32],[32,33,35,33],[32,34,35,34],[32,37,35,37],[32,38,35,38],[32,39,35,39],[32,44,35,44],[24,28,27,28],[24,29,27,29],[24,30,27,30],[24,31,27,31],[24,32,27,32],[24,33,27,33],[28,27,31,27],[28,28,31,28],[28,29,31,29],[28,30,31,30],[24,60,27,60],[24,61,27,61],[24,42,27,42],[24,43,27,43],[24,46,27,46],[24,47,27,47],[24,64,27,64],[24,52,27,52],[24,53,27,53],[24,54,27,54],[24,57,27,57],[24,58,27,58],[24,44,27,44],[24,45,27,45],[28,59,31,59],[28,60,31,60],[28,45,31,45],[28,46,31,46],[28,31,31,31],[28,32,31,32],[28,33,31,33],[28,34,31,34],[20,37,23,37],[20,38,23,38],[20,39,23,39],[24,65,27,65],[24,67,27,67],[24,71,27,71],[24,72,27,72],[24,59,27,59],[24,68,27,68],[24,69,27,69],[24,62,27,62],[24,34,27,34],[24,35,27,35],[24,36,27,36],[24,37,27,37],[24,38,27,38],[24,39,27,39],[20,34,23,34],[20,35,23,35],[20,36,23,36],[20,64,23,64],[20,65,23,65],[20,67,23,67],[20,68,23,68],[24,40,27,40],[24,41,27,41],[24,48,27,48],[24,49,27,49],[24,50,27,50],[24,51,27,51],[20,72,23,72],[20,73,23,73],[24,23,27,23],[24,24,27,24],[24,25,27,25],[24,26,27,26],[24,27,27,27],[20,61,23,61],[20,69,23,69],[20,71,23,71],[20,62,23,62],[20,57,23,57],[20,58,23,58],[20,59,23,59],[20,60,23,60],[20,49,23,49],[20,50,23,50],[20,53,23,53],[20,54,23,54],[16,58,19,58],[20,23,23,23],[20,24,23,24],[20,25,23,25],[20,26,23,26],[20,27,23,27],[20,28,23,28],[16,59,19,59],[16,60,19,60],[16,61,19,61],[16,48,19,48],[16,49,19,49],[16,50,19,50],[16,51,19,51],[16,52,19,52],[16,53,19,53],[20,40,23,40],[20,51,23,51],[20,52,23,52],[20,41,23,41],[20,42,23,42],[20,43,23,43],[20,44,23,44],[20,45,23,45],[20,46,23,46],[20,47,23,47],[20,48,23,48],[20,29,23,29],[20,30,23,30],[20,31,23,31],[20,32,23,32],[20,33,23,33],[16,65,19,65],[16,67,19,67],[16,68,19,68],[16,69,19,69],[12,68,15,68],[12,69,15,69],[16,23,19,23],[16,24,19,24],[16,25,19,25],[16,26,19,26],[16,27,19,27],[16,28,19,28],[16,29,19,29],[16,30,19,30],[16,40,19,40],[16,41,19,41],[16,42,19,42],[16,31,19,31],[16,32,19,32],[16,33,19,33],[16,34,19,34],[16,36,19,36],[16,47,19,47],[16,43,19,43],[16,39,19,39],[12,28,15,28],[12,33,15,33],[12,31,15,31],[16,62,19,62],[16,64,19,64],[16,54,19,54],[16,57,19,57],[2,21,2,22],[3,21,3,22],[4,21,4,22],[5,21,5,22],[6,21,6,22],[16,45,19,45],[16,46,19,46],[9,18,9,22],[2,19,2,20],[16,12,19,12],[2,17,2,18],[3,17,3,18],[4,17,4,18],[5,17,5,18],[9,8,9,12],[2,15,2,16],[5,15,5,16],[3,15,3,16],[10,18,10,22],[12,8,15,8],[6,17,6,18],[12,25,15,25],[12,27,15,27],[12,23,15,23],[12,24,15,24],[16,44,19,44],[12,34,15,34],[12,26,15,26],[16,38,19,38],[12,30,15,30],[16,35,19,35],[16,37,19,37],[24,1,27,1],[24,3,27,3],[24,10,27,10],[24,12,27,12],[24,8,27,8],[28,1,31,1],[28,3,31,3],[28,7,31,7],[28,8,31,8],[24,7,27,7],[3,19,3,20],[4,19,4,20],[5,19,5,20],[6,19,6,20],[12,7,15,7],[16,15,19,15],[16,10,19,10],[12,9,15,9],[16,1,19,1],[16,3,19,3],[16,7,19,7],[16,9,19,9],[16,8,19,8],[16,6,19,6],[12,1,15,1],[12,3,15,3],[12,6,15,6],[20,1,23,1],[20,3,23,3],[20,7,23,7],[20,8,23,8],[20,6,23,6],[32,1,35,1],[32,3,35,3],[28,22,31,22],[28,13,31,13],[28,14,31,14],[28,17,31,17],[28,18,31,18],[32,6,35,6],[32,2,35,2],[28,2,31,2],[32,18,35,18],[32,19,35,19],[28,19,31,19],[24,18,27,18],[16,18,19,18],[24,17,27,17],[24,19,27,19],[24,20,27,20],[16,20,19,20],[20,20,23,20],[16,19,19,19],[20,19,23,19],[24,22,27,22],[24,9,27,9],[20,9,23,9],[20,22,23,22],[20,10,23,10],[20,12,23,12],[20,13,23,13],[20,18,23,18],[20,17,23,17],[24,13,27,13],[36,17,39,17],[28,15,31,15],[16,17,19,17],[32,22,35,22],[32,20,35,20],[16,22,19,22],[36,20,39,20],[36,18,39,18],[28,20,31,20],[36,19,39,19],[36,22,39,22],[32,17,35,17],[28,9,31,9],[28,10,31,10],[12,13,15,13],[12,10,15,10],[12,12,15,12],[32,14,35,14],[12,14,15,14],[24,14,27,14],[24,15,27,15],[16,13,19,13],[16,14,19,14],[12,18,15,18],[12,19,15,19],[12,20,15,20],[12,15,15,15],[36,13,39,13],[40,1,43,1],[20,14,23,14],[20,15,23,15],[28,12,31,12],[24,6,27,6],[32,15,35,15],[36,14,39,14],[40,15,43,15],[40,13,43,13],[40,14,43,14],[9,13,9,17],[4,15,4,16],[12,22,15,22],[6,15,6,16],[36,1,39,1],[36,3,39,3],[36,7,39,7],[36,6,39,6],[32,13,35,13],[32,8,35,8],[32,9,35,9],[32,10,35,10],[36,2,39,2],[28,6,31,6],[32,7,35,7],[36,12,39,12],[32,12,35,12],[36,8,39,8],[36,15,39,15],[36,9,39,9],[36,10,39,10],[12,32,15,32],[10,25,10,26],[12,17,15,17],[12,35,15,35],[12,36,15,36],[12,37,15,37],[12,29,15,29],[10,37,10,38],[10,27,10,28],[10,29,10,30],[10,35,10,36],[12,38,15,38],[10,49,10,50],[10,31,10,32],[10,39,10,40],[10,41,10,42],[10,47,10,48],[9,23,10,24],[10,51,10,52],[12,41,15,41],[12,42,15,42],[12,43,15,43],[12,44,15,44],[12,45,15,45],[12,49,15,49],[12,50,15,50],[10,45,10,46],[12,46,15,46],[12,39,15,39],[12,40,15,40],[12,59,15,59],[12,47,15,47],[12,48,15,48],[12,57,15,57],[12,51,15,51],[12,52,15,52],[12,53,15,53],[12,54,15,54],[12,78,15,78],[12,60,15,60],[12,58,15,58],[12,62,15,62],[12,64,15,64],[12,67,15,67],[12,65,15,65],[12,79,15,79],[12,61,15,61],[10,76,10,77],[10,78,10,79],[12,71,15,71],[12,72,15,72],[12,73,15,73],[10,57,10,62],[12,76,15,76],[12,77,15,77],[10,68,10,71],[10,72,10,75],[10,64,10,67],[12,75,15,75],[52,2,55,2],[40,8,43,8],[40,2,43,2],[44,2,47,2],[48,2,51,2],[48,8,51,8],[52,8,55,8],[40,3,43,3],[40,6,43,6],[40,7,43,7],[40,17,43,17],[40,18,43,18],[40,19,43,19],[40,20,43,20],[40,22,43,22],[40,23,43,23],[40,24,43,24],[40,10,43,10],[40,12,43,12],[40,9,43,9],[40,25,43,25],[40,26,43,26],[40,27,43,27],[40,28,43,28],[40,29,43,29],[40,30,43,30],[40,31,43,31],[40,32,43,32],[40,33,43,33],[40,34,43,34],[40,35,43,35],[40,36,43,36],[40,37,43,37],[40,38,43,38],[40,39,43,39],[40,40,43,40],[40,41,43,41],[40,42,43,42],[40,43,43,43],[40,44,43,44],[40,45,43,45],[40,46,43,46],[40,47,43,47],[40,48,43,48],[40,49,43,49],[40,50,43,50],[40,51,43,51],[40,52,43,52],[40,53,43,53],[40,54,43,54],[40,57,43,57],[40,58,43,58],[40,59,43,59],[40,60,43,60],[40,61,43,61],[40,62,43,62],[40,64,43,64],[40,65,43,65],[40,67,43,67],[40,68,43,68],[40,69,43,69],[40,71,43,71],[40,72,43,72],[40,73,43,73],[44,1,47,1],[44,3,47,3],[44,6,47,6],[44,7,47,7],[44,8,47,8],[44,9,47,9],[44,10,47,10],[44,12,47,12],[44,13,47,13],[44,14,47,14],[44,15,47,15],[44,17,47,17],[44,18,47,18],[44,19,47,19],[44,20,47,20],[44,22,47,22],[44,23,47,23],[44,24,47,24],[44,25,47,25],[44,26,47,26],[44,27,47,27],[44,28,47,28],[44,29,47,29],[44,30,47,30],[44,31,47,31],[44,32,47,32],[44,33,47,33],[44,34,47,34],[44,35,47,35],[44,36,47,36],[44,37,47,37],[44,38,47,38],[44,39,47,39],[44,40,47,40],[44,41,47,41],[44,42,47,42],[44,43,47,43],[44,44,47,44],[44,45,47,45],[44,46,47,46],[44,47,47,47],[44,48,47,48],[44,49,47,49],[44,50,47,50],[44,51,47,51],[44,52,47,52],[44,53,47,53],[44,54,47,54],[44,57,47,57],[44,58,47,58],[44,59,47,59],[44,60,47,60],[44,61,47,61],[44,62,47,62],[44,64,47,64],[44,65,47,65],[44,72,47,72],[44,73,47,73],[48,1,51,1],[48,3,51,3],[48,6,51,6],[48,7,51,7],[48,14,51,14],[48,9,51,9],[48,10,51,10],[48,12,51,12],[48,13,51,13],[52,9,55,9],[52,10,55,10],[52,12,55,12],[52,13,55,13],[48,15,51,15],[48,17,51,17],[48,18,51,18],[48,19,51,19],[48,20,51,20],[48,22,51,22],[48,23,51,23],[48,24,51,24],[48,25,51,25],[48,26,51,26],[48,27,51,27],[48,28,51,28],[48,29,51,29],[48,30,51,30],[48,31,51,31],[48,32,51,32],[48,33,51,33],[48,34,51,34],[48,35,51,35],[48,36,51,36],[48,37,51,37],[48,38,51,38],[48,39,51,39],[48,40,51,40],[48,41,51,41],[48,42,51,42],[48,43,51,43],[48,44,51,44],[48,45,51,45],[48,46,51,46],[48,47,51,47],[48,48,51,48],[48,49,51,49],[48,50,51,50],[48,51,51,51],[48,52,51,52],[48,53,51,53],[48,54,51,54],[48,57,51,57],[48,58,51,58],[48,59,51,59],[48,60,51,60],[48,61,51,61],[48,62,51,62],[48,64,51,64],[48,65,51,65],[48,67,51,67],[48,68,51,68],[48,69,51,69],[48,71,51,71],[48,72,51,72],[48,73,51,73],[52,1,55,1],[52,3,55,3],[52,6,55,6],[52,7,55,7],[52,14,55,14],[52,15,55,15],[52,17,55,17],[52,18,55,18],[52,19,55,19],[52,20,55,20],[52,22,55,22],[52,23,55,23],[52,24,55,24],[52,25,55,25],[52,26,55,26],[52,27,55,27],[52,28,55,28],[52,29,55,29],[52,30,55,30],[52,31,55,31],[52,32,55,32],[52,33,55,33],[52,34,55,34],[52,35,55,35],[52,36,55,36],[52,37,55,37],[52,38,55,38],[52,39,55,39],[52,40,55,40],[52,41,55,41],[52,42,55,42],[52,43,55,43],[52,44,55,44],[52,45,55,45],[52,46,55,46],[52,47,55,47],[52,48,55,48],[52,49,55,49],[52,50,55,50],[52,51,55,51],[52,52,55,52],[52,53,55,53],[52,54,55,54],[52,57,55,57],[52,58,55,58],[52,59,55,59],[52,60,55,60],[52,61,55,61],[52,62,55,62],[52,64,55,64],[52,65,55,65],[52,67,55,67],[52,68,55,68],[52,69,55,69],[52,71,55,71],[52,72,55,72],[52,73,55,73],[56,1,59,1],[56,3,59,3],[56,6,59,6],[56,7,59,7],[56,14,59,14],[56,15,59,15],[56,17,59,17],[56,18,59,18],[56,12,59,12],[56,13,59,13],[56,24,59,24],[56,25,59,25],[56,26,59,26],[56,27,59,27],[56,28,59,28],[56,29,59,29],[56,30,59,30],[56,31,59,31],[56,32,59,32],[56,33,59,33],[56,34,59,34],[56,35,59,35],[56,36,59,36],[60,12,63,12],[60,13,63,13],[56,2,59,2],[60,9,63,9],[60,10,63,10],[60,2,63,2],[56,8,59,8],[56,9,59,9],[56,10,59,10],[56,19,59,19],[56,20,59,20],[56,22,59,22],[56,23,59,23],[60,14,63,14],[60,15,63,15],[60,18,63,18],[60,19,63,19],[60,20,63,20],[60,22,63,22],[56,37,59,37],[56,38,59,38],[56,39,59,39],[56,40,59,40],[56,41,59,41],[56,42,59,42],[56,43,59,43],[56,44,59,44],[56,45,59,45],[56,46,59,46],[56,47,59,47],[56,48,59,48],[56,49,59,49],[56,50,59,50],[56,51,59,51],[56,52,59,52],[56,53,59,53],[56,54,59,54],[56,57,59,57],[56,58,59,58],[56,59,59,59],[56,60,59,60],[56,61,59,61],[56,62,59,62],[56,64,59,64],[56,65,59,65],[56,67,59,67],[56,68,59,68],[56,69,59,69],[56,66,59,66],[56,71,59,71],[56,72,59,72],[56,73,59,73],[60,1,63,1],[60,3,63,3],[60,6,63,6],[60,7,63,7],[60,8,63,8],[60,17,63,17],[60,23,63,23],[60,24,63,24],[60,25,63,25],[60,26,63,26],[60,27,63,27],[60,28,63,28],[60,29,63,29],[60,30,63,30],[60,31,63,31],[60,32,63,32],[60,33,63,33],[60,34,63,34],[60,35,63,35],[60,36,63,36],[60,37,63,37],[60,38,63,38],[60,39,63,39],[60,40,63,40],[60,41,63,41],[60,42,63,42],[60,43,63,43],[60,44,63,44],[60,45,63,45],[60,46,63,46],[60,47,63,47],[60,48,63,48],[60,49,63,49],[60,50,63,50],[60,51,63,51],[60,52,63,52],[60,53,63,53],[60,54,63,54],[60,57,63,57],[60,58,63,58],[60,59,63,59],[60,60,63,60],[60,61,63,61],[60,62,63,62],[60,64,63,64],[60,65,63,65],[60,67,63,67],[60,68,63,68],[60,69,63,69],[60,66,63,66],[60,71,63,71],[60,72,63,72],[60,73,63,73],[64,1,67,1],[64,3,67,3],[64,6,67,6],[64,7,67,7],[64,2,67,2],[64,8,67,8],[64,9,67,9],[64,10,67,10],[64,12,67,12],[64,13,67,13],[64,14,67,14],[64,15,67,15],[64,17,67,17],[64,18,67,18],[64,19,67,19],[64,20,67,20],[64,22,67,22],[64,23,67,23],[64,24,67,24],[64,25,67,25],[64,26,67,26],[64,27,67,27],[64,28,67,28],[64,29,67,29],[64,30,67,30],[64,31,67,31],[64,32,67,32],[64,33,67,33],[64,34,67,34],[64,35,67,35],[64,36,67,36],[64,37,67,37],[64,38,67,38],[64,39,67,39],[64,40,67,40],[64,41,67,41],[64,42,67,42],[64,43,67,43],[64,44,67,44],[64,45,67,45],[64,46,67,46],[64,47,67,47],[64,48,67,48],[64,49,67,49],[64,50,67,50],[64,51,67,51],[64,52,67,52],[64,53,67,53],[64,54,67,54],[64,57,67,57],[64,58,67,58],[64,59,67,59],[64,60,67,60],[64,61,67,61],[64,62,67,62],[64,64,67,64],[64,65,67,65]],"merged_total":3419,"flags":["merged_cut"]}
[null,{"$f":"Search!AE1","v":"MDOT HMA STA Worksheet v1.10 - FY 2022 [effective for contracts containing frequently used special provision 12SP501(U), 12SP501(V), 12SP501(W), 20SP501(R) and/or 20SP501(S)]"},null,null,null,null,null,null,{"$f":"Search!AE2","v":"1/14/22"}]
[null,"Control Section",{"$f":"IF(Menu!C5=0,\"\",Menu!C5)","v":""},null,"Binder Method",null,{"$f":"+Menu!F8","v":"Ignition"}]
[null,"Job Number",{"$f":"IF(Menu!C6=0,\"\",Menu!C6)","v":""},null,"Plant Location",null,{"$f":"IF(Menu!C12=0,\"\",Menu!C12)","v":""},null,null,null,"Property",null,null,null,null,"Binder ",null,"AV",null,"VMA",null,"Density"]
[null,"Testing Lab",{"$f":"IF(Menu!C7=0,\"\",Menu!C7)","v":""},null,"Plant ID",null,{"$f":"Menu!C13","v":"10-03"},null,null,null,"Target or Minimum Density",null,null,null,null,{"$f":"Menu!D17","v":"From JMF"},null,{"$f":"Menu!E17","v":3},null,{"$f":"Menu!F17","v":13},null,{"$f":"Menu!G17","v":92}]
[null,"Lab Location",{"$f":"IF(Menu!C8=0,\"\",Menu!C8)","v":""},null,"Shldr Mix/Vibe Res.",null,{"$f":"Menu!F6","v":"No"},null,null,null,"Dev. from Target - Full/Incentive Pay Rnge ",null,null,null,null,{"$f":"Menu!D18","v":"≤ 0.45"},null,{"$f":"Menu!E18","v":"≤ 1.00"},null,{"$f":"Menu!F18","v":"≤ 1.00"},null,{"$f":"Menu!G18","v":"92.00 ≤"},null,null,null,null,null,null,null,null,null,null,null,null,null,null,null,null,null,null,null,null,null,null,null,null,null,null,null,null,null,null,null,null,null,null,null,null,null,null,null,null,null,null,"Density"]
[null,"Mix Type",{"$f":"+Menu!F5","v":"2E03"},null,"Density QA",null,{"$f":"+Menu!F7","v":"Std QA"},null,null,null,"Dev. from Target - Disincentive Pay Rnge ",null,null,null,null,{"$f":"Menu!D19","v":"0.46 - 1.00"},null,{"$f":"Menu!E19","v":"1.01 - 2.00"},null,{"$f":"Menu!F19","v":"1.01 - 2.00"},null,{"$f":"Menu!G19","v":"90.00 - 92.00"},null,null,null,null,null,null,null,null,null,null,null,null,null,null,null,null,null,null,null,null,null,null,null,null,null,null,null,null,null,null,null,null,null,null,null,"STA #","VMA",null,null,null,null,null,"Density Incentive","Density Lower Limit","Density RQL Limit","i","ii","iii","iv","v"]
[null,"Mix Design #",{"$f":"IF(Menu!C9=0,\"\",Menu!C9)","v":""},null,"Unit Price (per ton)",null,{"$f":"+Menu!C10","v":0},null,null,null,"Dev. from Target - Section l.1.C",null,null,null,null,{"$f":"Menu!D20","v":"1.00 <"},null,{"$f":"Menu!E20","v":"2.00 <"},null,{"$f":"Menu!F20","v":"2.00 <"},null,{"$f":"Menu!G20","v":"< 90.00"},null,null,null,null,null,null,null,null,null,null,null,null,null,null,null,null,null,null,null,null,null,null,null,null,null,null,null,null,null,null,null,null,null,null,null,1,{"$f":"VLOOKUP(Search!N8,Search!N9:R10,3)","v":2.0099999999999998},null,null,null,null,null,{"$f":"VLOOKUP(Search!$N$14,Search!$N$15:$W$17,3)","v":94},{"$f":"VLOOKUP(Search!$N$14,Search!$N$15:$W$17,4)","v":92},{"$f":"VLOOKUP(Search!$N$14,Search!$N$15:$W$17,5)","v":90},{"$f":"VLOOKUP(Search!$N$14,Search!$N$15:$W$17,6)","v":105},{"$f":"VLOOKUP(Search!$N$14,Search!$N$15:$W$17,7)","v":2.5},{"$f":"VLOOKUP(Search!$N$14,Search!$N$15:$W$17,8)","v":130},{"$f":"VLOOKUP(Search!$N$14,Search!$N$15:$W$17,9)","v":10},{"$f":"VLOOKUP(Search!$N$14,Search!$N$15:$W$17,10)","v":820}]
[null,"Contractor",{"$f":"+Menu!F9","v":"Ace-Saginaw Paving Co"},null,"Contract Base Price (per ton)",null,{"$f":"+Menu!C11","v":0}]
[null,null,null,null,null,null,null,null,null,null,null,null,null,null,null,null,null,null,null,null,null,null,null,null,null,"Note: Pay Factor Rounding is performed on the OSPF"]
["STA #",null,null,null,null,null,null,null,"MDOT QA",null,null,null,null,"Contractor Random QC",null,null,null,null,"MDOT QA Dispute Resolution\n",null,null,null,null,"Mix \nP200/Pbe Ratio",null,"MDOT STA Quality Assurance Results",null,null,null,null,null,null,null,null,null,"Contractor STA Random Quality Control Results",null,null,null,null,null,null,null,null,null,"MDOT STA Dispute Claim Results"]
[null,null,null,null,null,null,null,null,null,null,null,null,null,null,null,null,null,null,"***Fill out only if there is a dispute***",null,null,null,null,null,null,"Binder Content",null,"Air Voids",null,"VMA",null,"Density",null,null,null,"Binder Content",null,"Air Voids",null,"VMA",null,"Density",null,null,null,"Binder Content",null,"Air Voids",null,"VMA",null,"Density",null,null,null,null,null,"STA Density Rounding",null,null,null,null,null,null,"QA OSPF",null,null,null,"Contractor OSPF",null,null,null,"Dispute OSPF"]
["NOTE: Select a Sublot # and then print or create a report","Sample Date","Mix Type","JMF ","STA #","STA Core #","STA Tons","Target Binder Content","QA Binder Content","QA AV","QAVMA","QA Density","QA Avg Density","QC Binder Content","QC AV","QC VMA","QC Density","QC STA Density","Dispute Binder Content","Dispute AV","DisputeVMA","DisputeDensity","Dispute Avg Density ","QA P200/Pbe Ratio","QC P200/Pbe Ratio","QA Bndr Dev. Target","QA Binder PF","QA AV Dev. Target","QA AV PF","QA VMA Dev. Target","QA VMA PF","QA Avg Density","QA Density PF","QA OSPF","QA STA Pay Adjustment","QC Bndr Dev. Target","QC Binder PF","QC AV Dev. Target","QC AV PF","QC VMA Dev. Target","QC VMA PF","QC Avg Density","QC Density PF","QC OSPF","QC STA Pay Adjustment","Dispute Bndr Dev. Target","Dispute Binder PF","Dispute AV Dev. Target","Dispute AV PF","Dispute VMA Dev. Target","Dispute VMA PF","Dispute Avg Density","Dispute Density PF","Dispute OSPF","Dispute STA Pay Adjustment",null,null,"QA","QA ASTM Rnd","QC","QC ASTM Rnd","Dispute","Dispute ASTM Rnd",null,"PF","PF ASTM Rnd","Price Used for Pay Adjustment","STA Pay Adj","PF","PF ASTM Rnd","Price for Pay Adjustment","STA Pay Adj","PF","PF ASTM Rnd","Price for Pay Adjustment","STA Pay Adj"]
[null,null,{"$f":"IF(B13=0,\"\",$C$6)","v":""},null,1,null,null,null,null,null,null,null,{"$f":"BG13","v":0},null,null,null,null,{"$f":"BI13","v":0},null,null,null,null,{"$f":"BK13","v":0},null,null,{"$f":"IF(I13=0,\"NA\",ABS(I13-$H13))","v":"NA"},{"$f":"IF(Z13=\"NA\",\"NA\",IF(Z13<0.46,105-(11.1111*Z13),IF(Z13<1.01,181.8181-(181.8181*Z13),\"TBD\")))","v":"NA"},{"$f":"IF(J13=0,\"NA\",ABS(J13-$R$4))","v":"NA"},{"$f":"IF(AB13=\"NA\",\"NA\",IF(J13<1,\"TBD\",IF(AB13<1.01,105-(5*AB13),IF(AB13<2.01,140-(40*AB13),\"TBD\"))))","v":"NA"},{"$f":"IF(K13=0,\"NA\",ABS(K13-$T$4))","v":"NA"},{"$f":"IF(AD13=\"NA\",\"NA\",IF(AD13<1.01,105-(5*AD13),IF(AD13<$BG$7,168-(69*AD13),\"TBD\")))","v":"NA"},{"$f":"IF(BG13=0,\"NA\",BG13)","v":"NA"},{"$f":"IF(Z13=\"NA\",\"NA\",IF(Search!$W$3=2,100,IF(AF13>$BM$7,105,IF(AF13>$BN$7,(($BQ$7*AF13)-$BR$7),IF(AF13>$BO$7,(($BS$7*AF13)-$BT$7),\"TBD\")))))","v":"NA"},{"$f":"IF(OR(AA13=\"TBD\",AC13=\"TBD\",AE13=\"TBD\",AG13=\"TBD\"),\"TBD\",IF(Z13=\"NA\",\"NA\",BN13))","v":"NA"},{"$f":"IF(Z13=\"NA\",\"NA\",IF(BP13=\"TBD\",\"TBD\",astmrnd(BP13,2)))","v":"NA"},{"$f":"IF(N13=0,\"NA\",ABS(N13-$H13))","v":"NA"},{"$f":"IF(AJ13=\"NA\",\"NA\",IF(AJ13<0.46,105-(11.1111*AJ13),IF(AJ13<1.01,181.8181-(181.8181*AJ13),\"TBD\")))","v":"NA"},{"$f":"IF(O13=0,\"NA\",ABS(O13-$R$4))","v":"NA"},{"$f":"IF(AL13=\"NA\",\"NA\",IF(O13<1,\"TBD\",IF(AL13<1.01,105-(5*AL13),IF(AL13<2.01,140-(40*AL13),\"TBD\"))))","v":"NA"},{"$f":"IF(P13=0,\"NA\",ABS(P13-$T$4))","v":"NA"},{"$f":"IF(AN13=\"NA\",\"NA\",IF(AN13<1.01,105-(5*AN13),IF(AN13<$BG$7,168-(69*AN13),\"TBD\")))","v":"NA"},{"$f":"IF(BI13=0,\"NA\",BI13)","v":"NA"},{"$f":"IF(AJ13=\"NA\",\"NA\",IF(Search!$W$3=2,100,IF(AP13>$BM$7,105,IF(AP13>$BN$7,(($BQ$7*AP13)-$BR$7),IF(AP13>$BO$7,(($BS$7*AP13)-$BT$7),\"TBD\")))))","v":"NA"},{"$f":"IF(OR(AK13=\"TBD\",AM13=\"TBD\",AO13=\"TBD\",AQ13=\"TBD\"),\"TBD\",IF(AJ13=\"NA\",\"NA\",BR13))","v":"NA"},{"$f":"IF(AJ13=\"NA\",\"NA\",IF(BT13=\"TBD\",\"TBD\",astmrnd(BT13,2)))","v":"NA"},{"$f":"IF(S13=0,\"NA\",ABS(S13-$H13))","v":"NA"},{"$f":"IF(AT13=\"NA\",\"NA\",IF(AT13<0.46,105-(11.1111*AT13),IF(AT13<1.01,181.8181-(181.8181*AT13),\"TBD\")))","v":"NA"},{"$f":"IF(T13=0,\"NA\",ABS(T13-$R$4))","v":"NA"},{"$f":"IF(AV13=\"NA\",\"NA\",IF(T13<1,\"TBD\",IF(AV13<1.01,105-(5*AV13),IF(AV13<2.01,140-(40*AV13),\"TBD\"))))","v":"NA"},{"$f":"IF(U13=0,\"NA\",ABS(U13-$T$4))","v":"NA"},{"$f":"IF(AX13=\"NA\",\"NA\",IF(AX13<1.01,105-(5*AX13),IF(AX13<$BG$7,168-(69*AX13),\"TBD\")))","v":"NA"},{"$f":"IF(BK13=0,\"NA\",BK13)","v":"NA"},{"$f":"IF(AT13=\"NA\",\"NA\",IF(Search!$W$3=2,100,IF(AZ13>$BM$7,105,IF(AZ13>$BN$7,(($BQ$7*AZ13)-$BR$7),IF(AZ13>$BO$7,(($BS$7*AZ13)-$BT$7),\"TBD\")))))","v":"NA"},{"$f":"IF(OR(AU13=\"TBD\",AW13=\"TBD\",AY13=\"TBD\",BA13=\"TBD\"),\"TBD\",IF(AT13=\"NA\",\"NA\",BV13))","v":"NA"},{"$f":"IF(AT13=\"NA\",\"NA\",IF(BX13=\"TBD\",\"TBD\",astmrnd(BX13,2)))","v":"NA"},null,null,{"$f":"IF(SUM(L13:L16)=0,0,AVERAGE(L13:L16))","v":0},{"$f":"IF(OR(Search!$W$3=4,Search!$W$3=5,BF13=0),0,astmrnd(BF13,2))","v":0},{"$f":"IF(SUM(Q13:Q16)=0,0,AVERAGE(Q13:Q16))","v":0},{"$f":"IF(OR(Search!$W$3=4,Search!$W$3=5,BH13=0),0,astmrnd(BH13,2))","v":0},{"$f":"IF(SUM(V13:V16)=0,0,AVERAGE(V13:V16))","v":0},{"$f":"IF(OR(Search!$W$3=4,Search!$W$3=5,BJ13=0),0,astmrnd(BJ13,2))","v":0},null,{"$f":"(AA13*0.15)+(AC13*0.3)+(AE13*0.15)+(AG13*0.4)","v":{"$error":"#VALUE!"}},{"$f":"IF(OR(AA13=\"TBD\",AC13=\"TBD\",AE13=\"TBD\",AG13=\"TBD\"),\"TBD\",astmrnd(BM13,0))","v":{"$error":"#VALUE!"}},{"$f":"IF(Menu!$C$10>Menu!$C$11,Menu!$C$10,IF(BN13>100,Menu!$C$10,Menu!$C$11))","v":{"$error":"#VALUE!"}},{"$f":"IF(AH13=\"TBD\",\"TBD\",((AH13-100)/100)*BO13*G13)","v":{"$error":"#VALUE!"}},{"$f":"(AK13*0.15)+(AM13*0.3)+(AO13*0.15)+(AQ13*0.4)","v":{"$error":"#VALUE!"}},{"$f":"IF(OR(AK13=\"TBD\",AM13=\"TBD\",AO13=\"TBD\",AQ13=\"TBD\"),\"TBD\",astmrnd(BQ13,0))","v":{"$error":"#VALUE!"}},{"$f":"IF(Menu!$C$10>Menu!$C$11,Menu!$C$10,IF(BR13>100,Menu!$C$10,Menu!$C$11))","v":{"$error":"#VALUE!"}},{"$f":"IF(AR13=\"TBD\",\"TBD\",((AR13-100)/100)*BS13*G13)","v":{"$error":"#VALUE!"}},{"$f":"(AU13*0.15)+(AW13*0.3)+(AY13*0.15)+(BA13*0.4)","v":{"$error":"#VALUE!"}},{"$f":"IF(OR(AU13=\"TBD\",AW13=\"TBD\",AY13=\"TBD\",BA13=\"TBD\"),\"TBD\",astmrnd(BU13,0))","v":{"$error":"#VALUE!"}},{"$f":"IF(Menu!$C$10>Menu!$C$11,Menu!$C$10,IF(BV13>100,Menu!$C$10,Menu!$C$11))","v":{"$error":"#VALUE!"}},{"$f":"IF(BB13=\"TBD\",\"TBD\",((BB13-100)/100)*BW13*G13)","v":{"$error":"#VALUE!"}}]
[null,null,null,null,1]
[null,null,null,null,1]
[null,null,null,null,1]
[null,null,{"$f":"IF(B17=0,\"\",$C$6)","v":""},null,2,null,null,null,null,null,null,null,{"$f":"BG17","v":0},null,null,null,null,{"$f":"BI17","v":0},null,null,null,null,{"$f":"BK17","v":0},null,null,{"$f":"IF(I17=0,\"NA\",ABS(I17-$H17))","v":"NA"},{"$f":"IF(Z17=\"NA\",\"NA\",IF(Z17<0.46,105-(11.1111*Z17),IF(Z17<1.01,181.8181-(181.8181*Z17),\"TBD\")))","v":"NA"},{"$f":"IF(J17=0,\"NA\",ABS(J17-$R$4))","v":"NA"},{"$f":"IF(AB17=\"NA\",\"NA\",IF(J17<1,\"TBD\",IF(AB17<1.01,105-(5*AB17),IF(AB17<2.01,140-(40*AB17),\"TBD\"))))","v":"NA"},{"$f":"IF(K17=0,\"NA\",ABS(K17-$T$4))","v":"NA"},{"$f":"IF(AD17=\"NA\",\"NA\",IF(AD17<1.01,105-(5*AD17),IF(AD17<$BG$7,168-(69*AD17),\"TBD\")))","v":"NA"},{"$f":"IF(BG17=0,\"NA\",BG17)","v":"NA"},{"$f":"IF(Z17=\"NA\",\"NA\",IF(Search!$W$3=2,100,IF(AF17>$BM$7,105,IF(AF17>$BN$7,(($BQ$7*AF17)-$BR$7),IF(AF17>$BO$7,(($BS$7*AF17)-$BT$7),\"TBD\")))))","v":"NA"},{"$f":"IF(OR(AA17=\"TBD\",AC17=\"TBD\",AE17=\"TBD\",AG17=\"TBD\"),\"TBD\",IF(Z17=\"NA\",\"NA\",BN17))","v":"NA"},{"$f":"IF(Z17=\"NA\",\"NA\",IF(BP17=\"TBD\",\"TBD\",astmrnd(BP17,2)))","v":"NA"},{"$f":"IF(N17=0,\"NA\",ABS(N17-$H17))","v":"NA"},{"$f":"IF(AJ17=\"NA\",\"NA\",IF(AJ17<0.46,105-(11.1111*AJ17),IF(AJ17<1.01,181.8181-(181.8181*AJ17),\"TBD\")))","v":"NA"},{"$f":"IF(O17=0,\"NA\",ABS(O17-$R$4))","v":"NA"},{"$f":"IF(AL17=\"NA\",\"NA\",IF(O17<1,\"TBD\",IF(AL17<1.01,105-(5*AL17),IF(AL17<2.01,140-(40*AL17),\"TBD\"))))","v":"NA"},{"$f":"IF(P17=0,\"NA\",ABS(P17-$T$4))","v":"NA"},{"$f":"IF(AN17=\"NA\",\"NA\",IF(AN17<1.01,105-(5*AN17),IF(AN17<$BG$7,168-(69*AN17),\"TBD\")))","v":"NA"},{"$f":"IF(BI17=0,\"NA\",BI17)","v":"NA"},{"$f":"IF(AJ17=\"NA\",\"NA\",IF(Search!$W$3=2,100,IF(AP17>$BM$7,105,IF(AP17>$BN$7,(($BQ$7*AP17)-$BR$7),IF(AP17>$BO$7,(($BS$7*AP17)-$BT$7),\"TBD\")))))","v":"NA"},{"$f":"IF(OR(AK17=\"TBD\",AM17=\"TBD\",AO17=\"TBD\",AQ17=\"TBD\"),\"TBD\",IF(AJ17=\"NA\",\"NA\",BR17))","v":"NA"},{"$f":"IF(AJ17=\"NA\",\"NA\",IF(BT17=\"TBD\",\"TBD\",astmrnd(BT17,2)))","v":"NA"},{"$f":"IF(S17=0,\"NA\",ABS(S17-$H17))","v":"NA"},{"$f":"IF(AT17=\"NA\",\"NA\",IF(AT17<0.46,105-(11.1111*AT17),IF(AT17<1.01,181.8181-(181.8181*AT17),\"TBD\")))","v":"NA"},{"$f":"IF(T17=0,\"NA\",ABS(T17-$R$4))","v":"NA"},{"$f":"IF(AV17=\"NA\",\"NA\",IF(T17<1,\"TBD\",IF(AV17<1.01,105-(5*AV17),IF(AV17<2.01,140-(40*AV17),\"TBD\"))))","v":"NA"},{"$f":"IF(U17=0,\"NA\",ABS(U17-$T$4))","v":"NA"},{"$f":"IF(AX17=\"NA\",\"NA\",IF(AX17<1.01,105-(5*AX17),IF(AX17<$BG$7,168-(69*AX17),\"TBD\")))","v":"NA"},{"$f":"IF(BK17=0,\"NA\",BK17)","v":"NA"},{"$f":"IF(AT17=\"NA\",\"NA\",IF(Search!$W$3=2,100,IF(AZ17>$BM$7,105,IF(AZ17>$BN$7,(($BQ$7*AZ17)-$BR$7),IF(AZ17>$BO$7,(($BS$7*AZ17)-$BT$7),\"TBD\")))))","v":"NA"},{"$f":"IF(OR(AU17=\"TBD\",AW17=\"TBD\",AY17=\"TBD\",BA17=\"TBD\"),\"TBD\",IF(AT17=\"NA\",\"NA\",BV17))","v":"NA"},{"$f":"IF(AT17=\"NA\",\"NA\",IF(BX17=\"TBD\",\"TBD\",astmrnd(BX17,2)))","v":"NA"},null,null,{"$f":"IF(SUM(L17:L20)=0,0,AVERAGE(L17:L20))","v":0},{"$f":"IF(OR(Search!$W$3=4,Search!$W$3=5,BF17=0),0,astmrnd(BF17,2))","v":0},{"$f":"IF(SUM(Q17:Q20)=0,0,AVERAGE(Q17:Q20))","v":0},{"$f":"IF(OR(Search!$W$3=4,Search!$W$3=5,BH17=0),0,astmrnd(BH17,2))","v":0},{"$f":"IF(SUM(V17:V20)=0,0,AVERAGE(V17:V20))","v":0},{"$f":"IF(OR(Search!$W$3=4,Search!$W$3=5,BJ17=0),0,astmrnd(BJ17,2))","v":0},null,{"$f":"(AA17*0.15)+(AC17*0.3)+(AE17*0.15)+(AG17*0.4)","v":{"$error":"#VALUE!"}},{"$f":"IF(OR(AA17=\"TBD\",AC17=\"TBD\",AE17=\"TBD\",AG17=\"TBD\"),\"TBD\",astmrnd(BM17,0))","v":{"$error":"#VALUE!"}},{"$f":"IF(Menu!$C$10>Menu!$C$11,Menu!$C$10,IF(BN17>100,Menu!$C$10,Menu!$C$11))","v":{"$error":"#VALUE!"}},{"$f":"IF(AH17=\"TBD\",\"TBD\",((AH17-100)/100)*BO17*G17)","v":{"$error":"#VALUE!"}},{"$f":"(AK17*0.15)+(AM17*0.3)+(AO17*0.15)+(AQ17*0.4)","v":{"$error":"#VALUE!"}},{"$f":"IF(OR(AK17=\"TBD\",AM17=\"TBD\",AO17=\"TBD\",AQ17=\"TBD\"),\"TBD\",astmrnd(BQ17,0))","v":{"$error":"#VALUE!"}},{"$f":"IF(Menu!$C$10>Menu!$C$11,Menu!$C$10,IF(BR17>100,Menu!$C$10,Menu!$C$11))","v":{"$error":"#VALUE!"}},{"$f":"IF(AR17=\"TBD\",\"TBD\",((AR17-100)/100)*BS17*G17)","v":{"$error":"#VALUE!"}},{"$f":"(AU17*0.15)+(AW17*0.3)+(AY17*0.15)+(BA17*0.4)","v":{"$error":"#VALUE!"}},{"$f":"IF(OR(AU17=\"TBD\",AW17=\"TBD\",AY17=\"TBD\",BA17=\"TBD\"),\"TBD\",astmrnd(BU17,0))","v":{"$error":"#VALUE!"}},{"$f":"IF(Menu!$C$10>Menu!$C$11,Menu!$C$10,IF(BV17>100,Menu!$C$10,Menu!$C$11))","v":{"$error":"#VALUE!"}},{"$f":"IF(BB17=\"TBD\",\"TBD\",((BB17-100)/100)*BW17*G17)","v":{"$error":"#VALUE!"}}]
[null,null,null,null,2]
[null,null,null,null,2]
[null,null,null,null,2]
[null,null,{"$f":"IF(B21=0,\"\",$C$6)","v":""},null,3,null,null,null,null,null,null,null,{"$f":"BG21","v":0},null,null,null,null,{"$f":"BI21","v":0},null,null,null,null,{"$f":"BK21","v":0},null,null,{"$f":"IF(I21=0,\"NA\",ABS(I21-$H21))","v":"NA"},{"$f":"IF(Z21=\"NA\",\"NA\",IF(Z21<0.46,105-(11.1111*Z21),IF(Z21<1.01,181.8181-(181.8181*Z21),\"TBD\")))","v":"NA"},{"$f":"IF(J21=0,\"NA\",ABS(J21-$R$4))","v":"NA"},{"$f":"IF(AB21=\"NA\",\"NA\",IF(J21<1,\"TBD\",IF(AB21<1.01,105-(5*AB21),IF(AB21<2.01,140-(40*AB21),\"TBD\"))))","v":"NA"},{"$f":"IF(K21=0,\"NA\",ABS(K21-$T$4))","v":"NA"},{"$f":"IF(AD21=\"NA\",\"NA\",IF(AD21<1.01,105-(5*AD21),IF(AD21<$BG$7,168-(69*AD21),\"TBD\")))","v":"NA"},{"$f":"IF(BG21=0,\"NA\",BG21)","v":"NA"},{"$f":"IF(Z21=\"NA\",\"NA\",IF(Search!$W$3=2,100,IF(AF21>$BM$7,105,IF(AF21>$BN$7,(($BQ$7*AF21)-$BR$7),IF(AF21>$BO$7,(($BS$7*AF21)-$BT$7),\"TBD\")))))","v":"NA"},{"$f":"IF(OR(AA21=\"TBD\",AC21=\"TBD\",AE21=\"TBD\",AG21=\"TBD\"),\"TBD\",IF(Z21=\"NA\",\"NA\",BN21))","v":"NA"},{"$f":"IF(Z21=\"NA\",\"NA\",IF(BP21=\"TBD\",\"TBD\",astmrnd(BP21,2)))","v":"NA"},{"$f":"IF(N21=0,\"NA\",ABS(N21-$H21))","v":"NA"},{"$f":"IF(AJ21=\"NA\",\"NA\",IF(AJ21<0.46,105-(11.1111*AJ21),IF(AJ21<1.01,181.8181-(181.8181*AJ21),\"TBD\")))","v":"NA"},{"$f":"IF(O21=0,\"NA\",ABS(O21-$R$4))","v":"NA"},{"$f":"IF(AL21=\"NA\",\"NA\",IF(O21<1,\"TBD\",IF(AL21<1.01,105-(5*AL21),IF(AL21<2.01,140-(40*AL21),\"TBD\"))))","v":"NA"},{"$f":"IF(P21=0,\"NA\",ABS(P21-$T$4))","v":"NA"},{"$f":"IF(AN21=\"NA\",\"NA\",IF(AN21<1.01,105-(5*AN21),IF(AN21<$BG$7,168-(69*AN21),\"TBD\")))","v":"NA"},{"$f":"IF(BI21=0,\"NA\",BI21)","v":"NA"},{"$f":"IF(AJ21=\"NA\",\"NA\",IF(Search!$W$3=2,100,IF(AP21>$BM$7,105,IF(AP21>$BN$7,(($BQ$7*AP21)-$BR$7),IF(AP21>$BO$7,(($BS$7*AP21)-$BT$7),\"TBD\")))))","v":"NA"},{"$f":"IF(OR(AK21=\"TBD\",AM21=\"TBD\",AO21=\"TBD\",AQ21=\"TBD\"),\"TBD\",IF(AJ21=\"NA\",\"NA\",BR21))","v":"NA"},{"$f":"IF(AJ21=\"NA\",\"NA\",IF(BT21=\"TBD\",\"TBD\",astmrnd(BT21,2)))","v":"NA"},{"$f":"IF(S21=0,\"NA\",ABS(S21-$H21))","v":"NA"},{"$f":"IF(AT21=\"NA\",\"NA\",IF(AT21<0.46,105-(11.1111*AT21),IF(AT21<1.01,181.8181-(181.8181*AT21),\"TBD\")))","v":"NA"},{"$f":"IF(T21=0,\"NA\",ABS(T21-$R$4))","v":"NA"},{"$f":"IF(AV21=\"NA\",\"NA\",IF(T21<1,\"TBD\",IF(AV21<1.01,105-(5*AV21),IF(AV21<2.01,140-(40*AV21),\"TBD\"))))","v":"NA"},{"$f":"IF(U21=0,\"NA\",ABS(U21-$T$4))","v":"NA"},{"$f":"IF(AX21=\"NA\",\"NA\",IF(AX21<1.01,105-(5*AX21),IF(AX21<$BG$7,168-(69*AX21),\"TBD\")))","v":"NA"},{"$f":"IF(BK21=0,\"NA\",BK21)","v":"NA"},{"$f":"IF(AT21=\"NA\",\"NA\",IF(Search!$W$3=2,100,IF(AZ21>$BM$7,105,IF(AZ21>$BN$7,(($BQ$7*AZ21)-$BR$7),IF(AZ21>$BO$7,(($BS$7*AZ21)-$BT$7),\"TBD\")))))","v":"NA"},{"$f":"IF(OR(AU21=\"TBD\",AW21=\"TBD\",AY21=\"TBD\",BA21=\"TBD\"),\"TBD\",IF(AT21=\"NA\",\"NA\",BV21))","v":"NA"},{"$f":"IF(AT21=\"NA\",\"NA\",IF(BX21=\"TBD\",\"TBD\",astmrnd(BX21,2)))","v":"NA"},null,null,{"$f":"IF(SUM(L21:L24)=0,0,AVERAGE(L21:L24))","v":0},{"$f":"IF(OR(Search!$W$3=4,Search!$W$3=5,BF21=0),0,astmrnd(BF21,2))","v":0},{"$f":"IF(SUM(Q21:Q24)=0,0,AVERAGE(Q21:Q24))","v":0},{"$f":"IF(OR(Search!$W$3=4,Search!$W$3=5,BH21=0),0,astmrnd(BH21,2))","v":0},{"$f":"IF(SUM(V21:V24)=0,0,AVERAGE(V21:V24))","v":0},{"$f":"IF(OR(Search!$W$3=4,Search!$W$3=5,BJ21=0),0,astmrnd(BJ21,2))","v":0},null,{"$f":"(AA21*0.15)+(AC21*0.3)+(AE21*0.15)+(AG21*0.4)","v":{"$error":"#VALUE!"}},{"$f":"IF(OR(AA21=\"TBD\",AC21=\"TBD\",AE21=\"TBD\",AG21=\"TBD\"),\"TBD\",astmrnd(BM21,0))","v":{"$error":"#VALUE!"}},{"$f":"IF(Menu!$C$10>Menu!$C$11,Menu!$C$10,IF(BN21>100,Menu!$C$10,Menu!$C$11))","v":{"$error":"#VALUE!"}},{"$f":"IF(AH21=\"TBD\",\"TBD\",((AH21-100)/100)*BO21*G21)","v":{"$error":"#VALUE!"}},{"$f":"(AK21*0.15)+(AM21*0.3)+(AO21*0.15)+(AQ21*0.4)","v":{"$error":"#VALUE!"}},{"$f":"IF(OR(AK21=\"TBD\",AM21=\"TBD\",AO21=\"TBD\",AQ21=\"TBD\"),\"TBD\",astmrnd(BQ21,0))","v":{"$error":"#VALUE!"}},{"$f":"IF(Menu!$C$10>Menu!$C$11,Menu!$C$10,IF(BR21>100,Menu!$C$10,Menu!$C$11))","v":{"$error":"#VALUE!"}},{"$f":"IF(AR21=\"TBD\",\"TBD\",((AR21-100)/100)*BS21*G21)","v":{"$error":"#VALUE!"}},{"$f":"(AU21*0.15)+(AW21*0.3)+(AY21*0.15)+(BA21*0.4)","v":{"$error":"#VALUE!"}},{"$f":"IF(OR(AU21=\"TBD\",AW21=\"TBD\",AY21=\"TBD\",BA21=\"TBD\"),\"TBD\",astmrnd(BU21,0))","v":{"$error":"#VALUE!"}},{"$f":"IF(Menu!$C$10>Menu!$C$11,Menu!$C$10,IF(BV21>100,Menu!$C$10,Menu!$C$11))","v":{"$error":"#VALUE!"}},{"$f":"IF(BB21=\"TBD\",\"TBD\",((BB21-100)/100)*BW21*G21)","v":{"$error":"#VALUE!"}}]
[null,null,null,null,3]
[null,null,null,null,3]
[null,null,null,null,3]
[null,null,{"$f":"IF(B25=0,\"\",$C$6)","v":""},null,4,null,null,null,null,null,null,null,{"$f":"BG25","v":0},null,null,null,null,{"$f":"BI25","v":0},null,null,null,null,{"$f":"BK25","v":0},null,null,{"$f":"IF(I25=0,\"NA\",ABS(I25-$H25))","v":"NA"},{"$f":"IF(Z25=\"NA\",\"NA\",IF(Z25<0.46,105-(11.1111*Z25),IF(Z25<1.01,181.8181-(181.8181*Z25),\"TBD\")))","v":"NA"},{"$f":"IF(J25=0,\"NA\",ABS(J25-$R$4))","v":"NA"},{"$f":"IF(AB25=\"NA\",\"NA\",IF(J25<1,\"TBD\",IF(AB25<1.01,105-(5*AB25),IF(AB25<2.01,140-(40*AB25),\"TBD\"))))","v":"NA"},{"$f":"IF(K25=0,\"NA\",ABS(K25-$T$4))","v":"NA"},{"$f":"IF(AD25=\"NA\",\"NA\",IF(AD25<1.01,105-(5*AD25),IF(AD25<$BG$7,168-(69*AD25),\"TBD\")))","v":"NA"},{"$f":"IF(BG25=0,\"NA\",BG25)","v":"NA"},{"$f":"IF(Z25=\"NA\",\"NA\",IF(Search!$W$3=2,100,IF(AF25>$BM$7,105,IF(AF25>$BN$7,(($BQ$7*AF25)-$BR$7),IF(AF25>$BO$7,(($BS$7*AF25)-$BT$7),\"TBD\")))))","v":"NA"},{"$f":"IF(OR(AA25=\"TBD\",AC25=\"TBD\",AE25=\"TBD\",AG25=\"TBD\"),\"TBD\",IF(Z25=\"NA\",\"NA\",BN25))","v":"NA"},{"$f":"IF(Z25=\"NA\",\"NA\",IF(BP25=\"TBD\",\"TBD\",astmrnd(BP25,2)))","v":"NA"},{"$f":"IF(N25=0,\"NA\",ABS(N25-$H25))","v":"NA"},{"$f":"IF(AJ25=\"NA\",\"NA\",IF(AJ25<0.46,105-(11.1111*AJ25),IF(AJ25<1.01,181.8181-(181.8181*AJ25),\"TBD\")))","v":"NA"},{"$f":"IF(O25=0,\"NA\",ABS(O25-$R$4))","v":"NA"},{"$f":"IF(AL25=\"NA\",\"NA\",IF(O25<1,\"TBD\",IF(AL25<1.01,105-(5*AL25),IF(AL25<2.01,140-(40*AL25),\"TBD\"))))","v":"NA"},{"$f":"IF(P25=0,\"NA\",ABS(P25-$T$4))","v":"NA"},{"$f":"IF(AN25=\"NA\",\"NA\",IF(AN25<1.01,105-(5*AN25),IF(AN25<$BG$7,168-(69*AN25),\"TBD\")))","v":"NA"},{"$f":"IF(BI25=0,\"NA\",BI25)","v":"NA"},{"$f":"IF(AJ25=\"NA\",\"NA\",IF(Search!$W$3=2,100,IF(AP25>$BM$7,105,IF(AP25>$BN$7,(($BQ$7*AP25)-$BR$7),IF(AP25>$BO$7,(($BS$7*AP25)-$BT$7),\"TBD\")))))","v":"NA"},{"$f":"IF(OR(AK25=\"TBD\",AM25=\"TBD\",AO25=\"TBD\",AQ25=\"TBD\"),\"TBD\",IF(AJ25=\"NA\",\"NA\",BR25))","v":"NA"},{"$f":"IF(AJ25=\"NA\",\"NA\",IF(BT25=\"TBD\",\"TBD\",astmrnd(BT25,2)))","v":"NA"},{"$f":"IF(S25=0,\"NA\",ABS(S25-$H25))","v":"NA"},{"$f":"IF(AT25=\"NA\",\"NA\",IF(AT25<0.46,105-(11.1111*AT25),IF(AT25<1.01,181.8181-(181.8181*AT25),\"TBD\")))","v":"NA"},{"$f":"IF(T25=0,\"NA\",ABS(T25-$R$4))","v":"NA"},{"$f":"IF(AV25=\"NA\",\"NA\",IF(T25<1,\"TBD\",IF(AV25<1.01,105-(5*AV25),IF(AV25<2.01,140-(40*AV25),\"TBD\"))))","v":"NA"},{"$f":"IF(U25=0,\"NA\",ABS(U25-$T$4))","v":"NA"},{"$f":"IF(AX25=\"NA\",\"NA\",IF(AX25<1.01,105-(5*AX25),IF(AX25<$BG$7,168-(69*AX25),\"TBD\")))","v":"NA"},{"$f":"IF(BK25=0,\"NA\",BK25)","v":"NA"},{"$f":"IF(AT25=\"NA\",\"NA\",IF(Search!$W$3=2,100,IF(AZ25>$BM$7,105,IF(AZ25>$BN$7,(($BQ$7*AZ25)-$BR$7),IF(AZ25>$BO$7,(($BS$7*AZ25)-$BT$7),\"TBD\")))))","v":"NA"},{"$f":"IF(OR(AU25=\"TBD\",AW25=\"TBD\",AY25=\"TBD\",BA25=\"TBD\"),\"TBD\",IF(AT25=\"NA\",\"NA\",BV25))","v":"NA"},{"$f":"IF(AT25=\"NA\",\"NA\",IF(BX25=\"TBD\",\"TBD\",astmrnd(BX25,2)))","v":"NA"},null,null,{"$f":"IF(SUM(L25:L28)=0,0,AVERAGE(L25:L28))","v":0},{"$f":"IF(OR(Search!$W$3=4,Search!$W$3=5,BF25=0),0,astmrnd(BF25,2))","v":0},{"$f":"IF(SUM(Q25:Q28)=0,0,AVERAGE(Q25:Q28))","v":0},{"$f":"IF(OR(Search!$W$3=4,Search!$W$3=5,BH25=0),0,astmrnd(BH25,2))","v":0},{"$f":"IF(SUM(V25:V28)=0,0,AVERAGE(V25:V28))","v":0},{"$f":"IF(OR(Search!$W$3=4,Search!$W$3=5,BJ25=0),0,astmrnd(BJ25,2))","v":0},null,{"$f":"(AA25*0.15)+(AC25*0.3)+(AE25*0.15)+(AG25*0.4)","v":{"$error":"#VALUE!"}},{"$f":"IF(OR(AA25=\"TBD\",AC25=\"TBD\",AE25=\"TBD\",AG25=\"TBD\"),\"TBD\",astmrnd(BM25,0))","v":{"$error":"#VALUE!"}},{"$f":"IF(Menu!$C$10>Menu!$C$11,Menu!$C$10,IF(BN25>100,Menu!$C$10,Menu!$C$11))","v":{"$error":"#VALUE!"}},{"$f":"IF(AH25=\"TBD\",\"TBD\",((AH25-100)/100)*BO25*G25)","v":{"$error":"#VALUE!"}},{"$f":"(AK25*0.15)+(AM25*0.3)+(AO25*0.15)+(AQ25*0.4)","v":{"$error":"#VALUE!"}},{"$f":"IF(OR(AK25=\"TBD\",AM25=\"TBD\",AO25=\"TBD\",AQ25=\"TBD\"),\"TBD\",astmrnd(BQ25,0))","v":{"$error":"#VALUE!"}},{"$f":"IF(Menu!$C$10>Menu!$C$11,Menu!$C$10,IF(BR25>100,Menu!$C$10,Menu!$C$11))","v":{"$error":"#VALUE!"}},{"$f":"IF(AR25=\"TBD\",\"TBD\",((AR25-100)/100)*BS25*G25)","v":{"$error":"#VALUE!"}},{"$f":"(AU25*0.15)+(AW25*0.3)+(AY25*0.15)+(BA25*0.4)","v":{"$error":"#VALUE!"}},{"$f":"IF(OR(AU25=\"TBD\",AW25=\"TBD\",AY25=\"TBD\",BA25=\"TBD\"),\"TBD\",astmrnd(BU25,0))","v":{"$error":"#VALUE!"}},{"$f":"IF(Menu!$C$10>Menu!$C$11,Menu!$C$10,IF(BV25>100,Menu!$C$10,Menu!$C$11))","v":{"$error":"#VALUE!"}},{"$f":"IF(BB25=\"TBD\",\"TBD\",((BB25-100)/100)*BW25*G25)","v":{"$error":"#VALUE!"}}]
[null,null,null,null,4]
[null,null,null,null,4]
[null,null,null,null,4]
[null,null,{"$f":"IF(B29=0,\"\",$C$6)","v":""},null,5,null,null,null,null,null,null,null,{"$f":"BG29","v":0},null,null,null,null,{"$f":"BI29","v":0},null,null,null,null,{"$f":"BK29","v":0},null,null,{"$f":"IF(I29=0,\"NA\",ABS(I29-$H29))","v":"NA"},{"$f":"IF(Z29=\"NA\",\"NA\",IF(Z29<0.46,105-(11.1111*Z29),IF(Z29<1.01,181.8181-(181.8181*Z29),\"TBD\")))","v":"NA"},{"$f":"IF(J29=0,\"NA\",ABS(J29-$R$4))","v":"NA"},{"$f":"IF(AB29=\"NA\",\"NA\",IF(J29<1,\"TBD\",IF(AB29<1.01,105-(5*AB29),IF(AB29<2.01,140-(40*AB29),\"TBD\"))))","v":"NA"},{"$f":"IF(K29=0,\"NA\",ABS(K29-$T$4))","v":"NA"},{"$f":"IF(AD29=\"NA\",\"NA\",IF(AD29<1.01,105-(5*AD29),IF(AD29<$BG$7,168-(69*AD29),\"TBD\")))","v":"NA"},{"$f":"IF(BG29=0,\"NA\",BG29)","v":"NA"},{"$f":"IF(Z29=\"NA\",\"NA\",IF(Search!$W$3=2,100,IF(AF29>$BM$7,105,IF(AF29>$BN$7,(($BQ$7*AF29)-$BR$7),IF(AF29>$BO$7,(($BS$7*AF29)-$BT$7),\"TBD\")))))","v":"NA"},{"$f":"IF(OR(AA29=\"TBD\",AC29=\"TBD\",AE29=\"TBD\",AG29=\"TBD\"),\"TBD\",IF(Z29=\"NA\",\"NA\",BN29))","v":"NA"},{"$f":"IF(Z29=\"NA\",\"NA\",IF(BP29=\"TBD\",\"TBD\",astmrnd(BP29,2)))","v":"NA"},{"$f":"IF(N29=0,\"NA\",ABS(N29-$H29))","v":"NA"},{"$f":"IF(AJ29=\"NA\",\"NA\",IF(AJ29<0.46,105-(11.1111*AJ29),IF(AJ29<1.01,181.8181-(181.8181*AJ29),\"TBD\")))","v":"NA"},{"$f":"IF(O29=0,\"NA\",ABS(O29-$R$4))","v":"NA"},{"$f":"IF(AL29=\"NA\",\"NA\",IF(O29<1,\"TBD\",IF(AL29<1.01,105-(5*AL29),IF(AL29<2.01,140-(40*AL29),\"TBD\"))))","v":"NA"},{"$f":"IF(P29=0,\"NA\",ABS(P29-$T$4))","v":"NA"},{"$f":"IF(AN29=\"NA\",\"NA\",IF(AN29<1.01,105-(5*AN29),IF(AN29<$BG$7,168-(69*AN29),\"TBD\")))","v":"NA"},{"$f":"IF(BI29=0,\"NA\",BI29)","v":"NA"},{"$f":"IF(AJ29=\"NA\",\"NA\",IF(Search!$W$3=2,100,IF(AP29>$BM$7,105,IF(AP29>$BN$7,(($BQ$7*AP29)-$BR$7),IF(AP29>$BO$7,(($BS$7*AP29)-$BT$7),\"TBD\")))))","v":"NA"},{"$f":"IF(OR(AK29=\"TBD\",AM29=\"TBD\",AO29=\"TBD\",AQ29=\"TBD\"),\"TBD\",IF(AJ29=\"NA\",\"NA\",BR29))","v":"NA"},{"$f":"IF(AJ29=\"NA\",\"NA\",IF(BT29=\"TBD\",\"TBD\",astmrnd(BT29,2)))","v":"NA"},{"$f":"IF(S29=0,\"NA\",ABS(S29-$H29))","v":"NA"},{"$f":"IF(AT29=\"NA\",\"NA\",IF(AT29<0.46,105-(11.1111*AT29),IF(AT29<1.01,181.8181-(181.8181*AT29),\"TBD\")))","v":"NA"},{"$f":"IF(T29=0,\"NA\",ABS(T29-$R$4))","v":"NA"},{"$f":"IF(AV29=\"NA\",\"NA\",IF(T29<1,\"TBD\",IF(AV29<1.01,105-(5*AV29),IF(AV29<2.01,140-(40*AV29),\"TBD\"))))","v":"NA"},{"$f":"IF(U29=0,\"NA\",ABS(U29-$T$4))","v":"NA"},{"$f":"IF(AX29=\"NA\",\"NA\",IF(AX29<1.01,105-(5*AX29),IF(AX29<$BG$7,168-(69*AX29),\"TBD\")))","v":"NA"},{"$f":"IF(BK29=0,\"NA\",BK29)","v":"NA"},{"$f":"IF(AT29=\"NA\",\"NA\",IF(Search!$W$3=2,100,IF(AZ29>$BM$7,105,IF(AZ29>$BN$7,(($BQ$7*AZ29)-$BR$7),IF(AZ29>$BO$7,(($BS$7*AZ29)-$BT$7),\"TBD\")))))","v":"NA"},{"$f":"IF(OR(AU29=\"TBD\",AW29=\"TBD\",AY29=\"TBD\",BA29=\"TBD\"),\"TBD\",IF(AT29=\"NA\",\"NA\",BV29))","v":"NA"},{"$f":"IF(AT29=\"NA\",\"NA\",IF(BX29=\"TBD\",\"TBD\",astmrnd(BX29,2)))","v":"NA"},null,null,{"$f":"IF(SUM(L29:L32)=0,0,AVERAGE(L29:L32))","v":0},{"$f":"IF(OR(Search!$W$3=4,Search!$W$3=5,BF29=0),0,astmrnd(BF29,2))","v":0},{"$f":"IF(SUM(Q29:Q32)=0,0,AVERAGE(Q29:Q32))","v":0},{"$f":"IF(OR(Search!$W$3=4,Search!$W$3=5,BH29=0),0,astmrnd(BH29,2))","v":0},{"$f":"IF(SUM(V29:V32)=0,0,AVERAGE(V29:V32))","v":0},{"$f":"IF(OR(Search!$W$3=4,Search!$W$3=5,BJ29=0),0,astmrnd(BJ29,2))","v":0},null,{"$f":"(AA29*0.15)+(AC29*0.3)+(AE29*0.15)+(AG29*0.4)","v":{"$error":"#VALUE!"}},{"$f":"IF(OR(AA29=\"TBD\",AC29=\"TBD\",AE29=\"TBD\",AG29=\"TBD\"),\"TBD\",astmrnd(BM29,0))","v":{"$error":"#VALUE!"}},{"$f":"IF(Menu!$C$10>Menu!$C$11,Menu!$C$10,IF(BN29>100,Menu!$C$10,Menu!$C$11))","v":{"$error":"#VALUE!"}},{"$f":"IF(AH29=\"TBD\",\"TBD\",((AH29-100)/100)*BO29*G29)","v":{"$error":"#VALUE!"}},{"$f":"(AK29*0.15)+(AM29*0.3)+(AO29*0.15)+(AQ29*0.4)","v":{"$error":"#VALUE!"}},{"$f":"IF(OR(AK29=\"TBD\",AM29=\"TBD\",AO29=\"TBD\",AQ29=\"TBD\"),\"TBD\",astmrnd(BQ29,0))","v":{"$error":"#VALUE!"}},{"$f":"IF(Menu!$C$10>Menu!$C$11,Menu!$C$10,IF(BR29>100,Menu!$C$10,Menu!$C$11))","v":{"$error":"#VALUE!"}},{"$f":"IF(AR29=\"TBD\",\"TBD\",((AR29-100)/100)*BS29*G29)","v":{"$error":"#VALUE!"}},{"$f":"(AU29*0.15)+(AW29*0.3)+(AY29*0.15)+(BA29*0.4)","v":{"$error":"#VALUE!"}},{"$f":"IF(OR(AU29=\"TBD\",AW29=\"TBD\",AY29=\"TBD\",BA29=\"TBD\"),\"TBD\",astmrnd(BU29,0))","v":{"$error":"#VALUE!"}},{"$f":"IF(Menu!$C$10>Menu!$C$11,Menu!$C$10,IF(BV29>100,Menu!$C$10,Menu!$C$11))","v":{"$error":"#VALUE!"}},{"$f":"IF(BB29=\"TBD\",\"TBD\",((BB29-100)/100)*BW29*G29)","v":{"$error":"#VALUE!"}}]
[null,null,null,null,5]
[null,null,null,null,5]
[null,null,null,null,5]
[null,null,{"$f":"IF(B33=0,\"\",$C$6)","v":""},null,6,null,null,null,null,null,null,null,{"$f":"BG33","v":0},null,null,null,null,{"$f":"BI33","v":0},null,null,null,null,{"$f":"BK33","v":0},null,null,{"$f":"IF(I33=0,\"NA\",ABS(I33-$H33))","v":"NA"},{"$f":"IF(Z33=\"NA\",\"NA\",IF(Z33<0.46,105-(11.1111*Z33),IF(Z33<1.01,181.8181-(181.8181*Z33),\"TBD\")))","v":"NA"},{"$f":"IF(J33=0,\"NA\",ABS(J33-$R$4))","v":"NA"},{"$f":"IF(AB33=\"NA\",\"NA\",IF(J33<1,\"TBD\",IF(AB33<1.01,105-(5*AB33),IF(AB33<2.01,140-(40*AB33),\"TBD\"))))","v":"NA"},{"$f":"IF(K33=0,\"NA\",ABS(K33-$T$4))","v":"NA"},{"$f":"IF(AD33=\"NA\",\"NA\",IF(AD33<1.01,105-(5*AD33),IF(AD33<$BG$7,168-(69*AD33),\"TBD\")))","v":"NA"},{"$f":"IF(BG33=0,\"NA\",BG33)","v":"NA"},{"$f":"IF(Z33=\"NA\",\"NA\",IF(Search!$W$3=2,100,IF(AF33>$BM$7,105,IF(AF33>$BN$7,(($BQ$7*AF33)-$BR$7),IF(AF33>$BO$7,(($BS$7*AF33)-$BT$7),\"TBD\")))))","v":"NA"},{"$f":"IF(OR(AA33=\"TBD\",AC33=\"TBD\",AE33=\"TBD\",AG33=\"TBD\"),\"TBD\",IF(Z33=\"NA\",\"NA\",BN33))","v":"NA"},{"$f":"IF(Z33=\"NA\",\"NA\",IF(BP33=\"TBD\",\"TBD\",astmrnd(BP33,2)))","v":"NA"},{"$f":"IF(N33=0,\"NA\",ABS(N33-$H33))","v":"NA"},{"$f":"IF(AJ33=\"NA\",\"NA\",IF(AJ33<0.46,105-(11.1111*AJ33),IF(AJ33<1.01,181.8181-(181.8181*AJ33),\"TBD\")))","v":"NA"},{"$f":"IF(O33=0,\"NA\",ABS(O33-$R$4))","v":"NA"},{"$f":"IF(AL33=\"NA\",\"NA\",IF(O33<1,\"TBD\",IF(AL33<1.01,105-(5*AL33),IF(AL33<2.01,140-(40*AL33),\"TBD\"))))","v":"NA"},{"$f":"IF(P33=0,\"NA\",ABS(P33-$T$4))","v":"NA"},{"$f":"IF(AN33=\"NA\",\"NA\",IF(AN33<1.01,105-(5*AN33),IF(AN33<$BG$7,168-(69*AN33),\"TBD\")))","v":"NA"},{"$f":"IF(BI33=0,\"NA\",BI33)","v":"NA"},{"$f":"IF(AJ33=\"NA\",\"NA\",IF(Search!$W$3=2,100,IF(AP33>$BM$7,105,IF(AP33>$BN$7,(($BQ$7*AP33)-$BR$7),IF(AP33>$BO$7,(($BS$7*AP33)-$BT$7),\"TBD\")))))","v":"NA"},{"$f":"IF(OR(AK33=\"TBD\",AM33=\"TBD\",AO33=\"TBD\",AQ33=\"TBD\"),\"TBD\",IF(AJ33=\"NA\",\"NA\",BR33))","v":"NA"},{"$f":"IF(AJ33=\"NA\",\"NA\",IF(BT33=\"TBD\",\"TBD\",astmrnd(BT33,2)))","v":"NA"},{"$f":"IF(S33=0,\"NA\",ABS(S33-$H33))","v":"NA"},{"$f":"IF(AT33=\"NA\",\"NA\",IF(AT33<0.46,105-(11.1111*AT33),IF(AT33<1.01,181.8181-(181.8181*AT33),\"TBD\")))","v":"NA"},{"$f":"IF(T33=0,\"NA\",ABS(T33-$R$4))","v":"NA"},{"$f":"IF(AV33=\"NA\",\"NA\",IF(T33<1,\"TBD\",IF(AV33<1.01,105-(5*AV33),IF(AV33<2.01,140-(40*AV33),\"TBD\"))))","v":"NA"},{"$f":"IF(U33=0,\"NA\",ABS(U33-$T$4))","v":"NA"},{"$f":"IF(AX33=\"NA\",\"NA\",IF(AX33<1.01,105-(5*AX33),IF(AX33<$BG$7,168-(69*AX33),\"TBD\")))","v":"NA"},{"$f":"IF(BK33=0,\"NA\",BK33)","v":"NA"},{"$f":"IF(AT33=\"NA\",\"NA\",IF(Search!$W$3=2,100,IF(AZ33>$BM$7,105,IF(AZ33>$BN$7,(($BQ$7*AZ33)-$BR$7),IF(AZ33>$BO$7,(($BS$7*AZ33)-$BT$7),\"TBD\")))))","v":"NA"},{"$f":"IF(OR(AU33=\"TBD\",AW33=\"TBD\",AY33=\"TBD\",BA33=\"TBD\"),\"TBD\",IF(AT33=\"NA\",\"NA\",BV33))","v":"NA"},{"$f":"IF(AT33=\"NA\",\"NA\",IF(BX33=\"TBD\",\"TBD\",astmrnd(BX33,2)))","v":"NA"},null,null,{"$f":"IF(SUM(L33:L36)=0,0,AVERAGE(L33:L36))","v":0},{"$f":"IF(OR(Search!$W$3=4,Search!$W$3=5,BF33=0),0,astmrnd(BF33,2))","v":0},{"$f":"IF(SUM(Q33:Q36)=0,0,AVERAGE(Q33:Q36))","v":0},{"$f":"IF(OR(Search!$W$3=4,Search!$W$3=5,BH33=0),0,astmrnd(BH33,2))","v":0},{"$f":"IF(SUM(V33:V36)=0,0,AVERAGE(V33:V36))","v":0},{"$f":"IF(OR(Search!$W$3=4,Search!$W$3=5,BJ33=0),0,astmrnd(BJ33,2))","v":0},null,{"$f":"(AA33*0.15)+(AC33*0.3)+(AE33*0.15)+(AG33*0.4)","v":{"$error":"#VALUE!"}},{"$f":"IF(OR(AA33=\"TBD\",AC33=\"TBD\",AE33=\"TBD\",AG33=\"TBD\"),\"TBD\",astmrnd(BM33,0))","v":{"$error":"#VALUE!"}},{"$f":"IF(Menu!$C$10>Menu!$C$11,Menu!$C$10,IF(BN33>100,Menu!$C$10,Menu!$C$11))","v":{"$error":"#VALUE!"}},{"$f":"IF(AH33=\"TBD\",\"TBD\",((AH33-100)/100)*BO33*G33)","v":{"$error":"#VALUE!"}},{"$f":"(AK33*0.15)+(AM33*0.3)+(AO33*0.15)+(AQ33*0.4)","v":{"$error":"#VALUE!"}},{"$f":"IF(OR(AK33=\"TBD\",AM33=\"TBD\",AO33=\"TBD\",AQ33=\"TBD\"),\"TBD\",astmrnd(BQ33,0))","v":{"$error":"#VALUE!"}},{"$f":"IF(Menu!$C$10>Menu!$C$11,Menu!$C$10,IF(BR33>100,Menu!$C$10,Menu!$C$11))","v":{"$error":"#VALUE!"}},{"$f":"IF(AR33=\"TBD\",\"TBD\",((AR33-100)/100)*BS33*G33)","v":{"$error":"#VALUE!"}},{"$f":"(AU33*0.15)+(AW33*0.3)+(AY33*0.15)+(BA33*0.4)","v":{"$error":"#VALUE!"}},{"$f":"IF(OR(AU33=\"TBD\",AW33=\"TBD\",AY33=\"TBD\",BA33=\"TBD\"),\"TBD\",astmrnd(BU33,0))","v":{"$error":"#VALUE!"}},{"$f":"IF(Menu!$C$10>Menu!$C$11,Menu!$C$10,IF(BV33>100,Menu!$C$10,Menu!$C$11))","v":{"$error":"#VALUE!"}},{"$f":"IF(BB33=\"TBD\",\"TBD\",((BB33-100)/100)*BW33*G33)","v":{"$error":"#VALUE!"}}]
[null,null,null,null,6]
[null,null,null,null,6]
[null,null,null,null,6]
[null,null,{"$f":"IF(B37=0,\"\",$C$6)","v":""},null,7,null,null,null,null,null,null,null,{"$f":"BG37","v":0},null,null,null,null,{"$f":"BI37","v":0},null,null,null,null,{"$f":"BK37","v":0},null,null,{"$f":"IF(I37=0,\"NA\",ABS(I37-$H37))","v":"NA"},{"$f":"IF(Z37=\"NA\",\"NA\",IF(Z37<0.46,105-(11.1111*Z37),IF(Z37<1.01,181.8181-(181.8181*Z37),\"TBD\")))","v":"NA"},{"$f":"IF(J37=0,\"NA\",ABS(J37-$R$4))","v":"NA"},{"$f":"IF(AB37=\"NA\",\"NA\",IF(J37<1,\"TBD\",IF(AB37<1.01,105-(5*AB37),IF(AB37<2.01,140-(40*AB37),\"TBD\"))))","v":"NA"},{"$f":"IF(K37=0,\"NA\",ABS(K37-$T$4))","v":"NA"},{"$f":"IF(AD37=\"NA\",\"NA\",IF(AD37<1.01,105-(5*AD37),IF(AD37<$BG$7,168-(69*AD37),\"TBD\")))","v":"NA"},{"$f":"IF(BG37=0,\"NA\",BG37)","v":"NA"},{"$f":"IF(Z37=\"NA\",\"NA\",IF(Search!$W$3=2,100,IF(AF37>$BM$7,105,IF(AF37>$BN$7,(($BQ$7*AF37)-$BR$7),IF(AF37>$BO$7,(($BS$7*AF37)-$BT$7),\"TBD\")))))","v":"NA"},{"$f":"IF(OR(AA37=\"TBD\",AC37=\"TBD\",AE37=\"TBD\",AG37=\"TBD\"),\"TBD\",IF(Z37=\"NA\",\"NA\",BN37))","v":"NA"},{"$f":"IF(Z37=\"NA\",\"NA\",IF(BP37=\"TBD\",\"TBD\",astmrnd(BP37,2)))","v":"NA"},{"$f":"IF(N37=0,\"NA\",ABS(N37-$H37))","v":"NA"},{"$f":"IF(AJ37=\"NA\",\"NA\",IF(AJ37<0.46,105-(11.1111*AJ37),IF(AJ37<1.01,181.8181-(181.8181*AJ37),\"TBD\")))","v":"NA"},{"$f":"IF(O37=0,\"NA\",ABS(O37-$R$4))","v":"NA"},{"$f":"IF(AL37=\"NA\",\"NA\",IF(O37<1,\"TBD\",IF(AL37<1.01,105-(5*AL37),IF(AL37<2.01,140-(40*AL37),\"TBD\"))))","v":"NA"},{"$f":"IF(P37=0,\"NA\",ABS(P37-$T$4))","v":"NA"},{"$f":"IF(AN37=\"NA\",\"NA\",IF(AN37<1.01,105-(5*AN37),IF(AN37<$BG$7,168-(69*AN37),\"TBD\")))","v":"NA"},{"$f":"IF(BI37=0,\"NA\",BI37)","v":"NA"},{"$f":"IF(AJ37=\"NA\",\"NA\",IF(Search!$W$3=2,100,IF(AP37>$BM$7,105,IF(AP37>$BN$7,(($BQ$7*AP37)-$BR$7),IF(AP37>$BO$7,(($BS$7*AP37)-$BT$7),\"TBD\")))))","v":"NA"},{"$f":"IF(OR(AK37=\"TBD\",AM37=\"TBD\",AO37=\"TBD\",AQ37=\"TBD\"),\"TBD\",IF(AJ37=\"NA\",\"NA\",BR37))","v":"NA"},{"$f":"IF(AJ37=\"NA\",\"NA\",IF(BT37=\"TBD\",\"TBD\",astmrnd(BT37,2)))","v":"NA"},{"$f":"IF(S37=0,\"NA\",ABS(S37-$H37))","v":"NA"},{"$f":"IF(AT37=\"NA\",\"NA\",IF(AT37<0.46,105-(11.1111*AT37),IF(AT37<1.01,181.8181-(181.8181*AT37),\"TBD\")))","v":"NA"},{"$f":"IF(T37=0,\"NA\",ABS(T37-$R$4))","v":"NA"},{"$f":"IF(AV37=\"NA\",\"NA\",IF(T37<1,\"TBD\",IF(AV37<1.01,105-(5*AV37),IF(AV37<2.01,140-(40*AV37),\"TBD\"))))","v":"NA"},{"$f":"IF(U37=0,\"NA\",ABS(U37-$T$4))","v":"NA"},{"$f":"IF(AX37=\"NA\",\"NA\",IF(AX37<1.01,105-(5*AX37),IF(AX37<$BG$7,168-(69*AX37),\"TBD\")))","v":"NA"},{"$f":"IF(BK37=0,\"NA\",BK37)","v":"NA"},{"$f":"IF(AT37=\"NA\",\"NA\",IF(Search!$W$3=2,100,IF(AZ37>$BM$7,105,IF(AZ37>$BN$7,(($BQ$7*AZ37)-$BR$7),IF(AZ37>$BO$7,(($BS$7*AZ37)-$BT$7),\"TBD\")))))","v":"NA"},{"$f":"IF(OR(AU37=\"TBD\",AW37=\"TBD\",AY37=\"TBD\",BA37=\"TBD\"),\"TBD\",IF(AT37=\"NA\",\"NA\",BV37))","v":"NA"},{"$f":"IF(AT37=\"NA\",\"NA\",IF(BX37=\"TBD\",\"TBD\",astmrnd(BX37,2)))","v":"NA"},null,null,{"$f":"IF(SUM(L37:L40)=0,0,AVERAGE(L37:L40))","v":0},{"$f":"IF(OR(Search!$W$3=4,Search!$W$3=5,BF37=0),0,astmrnd(BF37,2))","v":0},{"$f":"IF(SUM(Q37:Q40)=0,0,AVERAGE(Q37:Q40))","v":0},{"$f":"IF(OR(Search!$W$3=4,Search!$W$3=5,BH37=0),0,astmrnd(BH37,2))","v":0},{"$f":"IF(SUM(V37:V40)=0,0,AVERAGE(V37:V40))","v":0},{"$f":"IF(OR(Search!$W$3=4,Search!$W$3=5,BJ37=0),0,astmrnd(BJ37,2))","v":0},null,{"$f":"(AA37*0.15)+(AC37*0.3)+(AE37*0.15)+(AG37*0.4)","v":{"$error":"#VALUE!"}},{"$f":"IF(OR(AA37=\"TBD\",AC37=\"TBD\",AE37=\"TBD\",AG37=\"TBD\"),\"TBD\",astmrnd(BM37,0))","v":{"$error":"#VALUE!"}},{"$f":"IF(Menu!$C$10>Menu!$C$11,Menu!$C$10,IF(BN37>100,Menu!$C$10,Menu!$C$11))","v":{"$error":"#VALUE!"}},{"$f":"IF(AH37=\"TBD\",\"TBD\",((AH37-100)/100)*BO37*G37)","v":{"$error":"#VALUE!"}},{"$f":"(AK37*0.15)+(AM37*0.3)+(AO37*0.15)+(AQ37*0.4)","v":{"$error":"#VALUE!"}},{"$f":"IF(OR(AK37=\"TBD\",AM37=\"TBD\",AO37=\"TBD\",AQ37=\"TBD\"),\"TBD\",astmrnd(BQ37,0))","v":{"$error":"#VALUE!"}},{"$f":"IF(Menu!$C$10>Menu!$C$11,Menu!$C$10,IF(BR37>100,Menu!$C$10,Menu!$C$11))","v":{"$error":"#VALUE!"}},{"$f":"IF(AR37=\"TBD\",\"TBD\",((AR37-100)/100)*BS37*G37)","v":{"$error":"#VALUE!"}},{"$f":"(AU37*0.15)+(AW37*0.3)+(AY37*0.15)+(BA37*0.4)","v":{"$error":"#VALUE!"}},{"$f":"IF(OR(AU37=\"TBD\",AW37=\"TBD\",AY37=\"TBD\",BA37=\"TBD\"),\"TBD\",astmrnd(BU37,0))","v":{"$error":"#VALUE!"}},{"$f":"IF(Menu!$C$10>Menu!$C$11,Menu!$C$10,IF(BV37>100,Menu!$C$10,Menu!$C$11))","v":{"$error":"#VALUE!"}},{"$f":"IF(BB37=\"TBD\",\"TBD\",((BB37-100)/100)*BW37*G37)","v":{"$error":"#VALUE!"}}]
[null,null,null,null,7]
[null,null,null,null,7]
[null,null,null,null,7]
[null,null,{"$f":"IF(B41=0,\"\",$C$6)","v":""},null,8,null,null,null,null,null,null,null,{"$f":"BG41","v":0},null,null,null,null,{"$f":"BI41","v":0},null,null,null,null,{"$f":"BK41","v":0},null,null,{"$f":"IF(I41=0,\"NA\",ABS(I41-$H41))","v":"NA"},{"$f":"IF(Z41=\"NA\",\"NA\",IF(Z41<0.46,105-(11.1111*Z41),IF(Z41<1.01,181.8181-(181.8181*Z41),\"TBD\")))","v":"NA"},{"$f":"IF(J41=0,\"NA\",ABS(J41-$R$4))","v":"NA"},{"$f":"IF(AB41=\"NA\",\"NA\",IF(J41<1,\"TBD\",IF(AB41<1.01,105-(5*AB41),IF(AB41<2.01,140-(40*AB41),\"TBD\"))))","v":"NA"},{"$f":"IF(K41=0,\"NA\",ABS(K41-$T$4))","v":"NA"},{"$f":"IF(AD41=\"NA\",\"NA\",IF(AD41<1.01,105-(5*AD41),IF(AD41<$BG$7,168-(69*AD41),\"TBD\")))","v":"NA"},{"$f":"IF(BG41=0,\"NA\",BG41)","v":"NA"},{"$f":"IF(Z41=\"NA\",\"NA\",IF(Search!$W$3=2,100,IF(AF41>$BM$7,105,IF(AF41>$BN$7,(($BQ$7*AF41)-$BR$7),IF(AF41>$BO$7,(($BS$7*AF41)-$BT$7),\"TBD\")))))","v":"NA"},{"$f":"IF(OR(AA41=\"TBD\",AC41=\"TBD\",AE41=\"TBD\",AG41=\"TBD\"),\"TBD\",IF(Z41=\"NA\",\"NA\",BN41))","v":"NA"},{"$f":"IF(Z41=\"NA\",\"NA\",IF(BP41=\"TBD\",\"TBD\",astmrnd(BP41,2)))","v":"NA"},{"$f":"IF(N41=0,\"NA\",ABS(N41-$H41))","v":"NA"},{"$f":"IF(AJ41=\"NA\",\"NA\",IF(AJ41<0.46,105-(11.1111*AJ41),IF(AJ41<1.01,181.8181-(181.8181*AJ41),\"TBD\")))","v":"NA"},{"$f":"IF(O41=0,\"NA\",ABS(O41-$R$4))","v":"NA"},{"$f":"IF(AL41=\"NA\",\"NA\",IF(O41<1,\"TBD\",IF(AL41<1.01,105-(5*AL41),IF(AL41<2.01,140-(40*AL41),\"TBD\"))))","v":"NA"},{"$f":"IF(P41=0,\"NA\",ABS(P41-$T$4))","v":"NA"},{"$f":"IF(AN41=\"NA\",\"NA\",IF(AN41<1.01,105-(5*AN41),IF(AN41<$BG$7,168-(69*AN41),\"TBD\")))","v":"NA"},{"$f":"IF(BI41=0,\"NA\",BI41)","v":"NA"},{"$f":"IF(AJ41=\"NA\",\"NA\",IF(Search!$W$3=2,100,IF(AP41>$BM$7,105,IF(AP41>$BN$7,(($BQ$7*AP41)-$BR$7),IF(AP41>$BO$7,(($BS$7*AP41)-$BT$7),\"TBD\")))))","v":"NA"},{"$f":"IF(OR(AK41=\"TBD\",AM41=\"TBD\",AO41=\"TBD\",AQ41=\"TBD\"),\"TBD\",IF(AJ41=\"NA\",\"NA\",BR41))","v":"NA"},{"$f":"IF(AJ41=\"NA\",\"NA\",IF(BT41=\"TBD\",\"TBD\",astmrnd(BT41,2)))","v":"NA"},{"$f":"IF(S41=0,\"NA\",ABS(S41-$H41))","v":"NA"},{"$f":"IF(AT41=\"NA\",\"NA\",IF(AT41<0.46,105-(11.1111*AT41),IF(AT41<1.01,181.8181-(181.8181*AT41),\"TBD\")))","v":"NA"},{"$f":"IF(T41=0,\"NA\",ABS(T41-$R$4))","v":"NA"},{"$f":"IF(AV41=\"NA\",\"NA\",IF(T41<1,\"TBD\",IF(AV41<1.01,105-(5*AV41),IF(AV41<2.01,140-(40*AV41),\"TBD\"))))","v":"NA"},{"$f":"IF(U41=0,\"NA\",ABS(U41-$T$4))","v":"NA"},{"$f":"IF(AX41=\"NA\",\"NA\",IF(AX41<1.01,105-(5*AX41),IF(AX41<$BG$7,168-(69*AX41),\"TBD\")))","v":"NA"},{"$f":"IF(BK41=0,\"NA\",BK41)","v":"NA"},{"$f":"IF(AT41=\"NA\",\"NA\",IF(Search!$W$3=2,100,IF(AZ41>$BM$7,105,IF(AZ41>$BN$7,(($BQ$7*AZ41)-$BR$7),IF(AZ41>$BO$7,(($BS$7*AZ41)-$BT$7),\"TBD\")))))","v":"NA"},{"$f":"IF(OR(AU41=\"TBD\",AW41=\"TBD\",AY41=\"TBD\",BA41=\"TBD\"),\"TBD\",IF(AT41=\"NA\",\"NA\",BV41))","v":"NA"},{"$f":"IF(AT41=\"NA\",\"NA\",IF(BX41=\"TBD\",\"TBD\",astmrnd(BX41,2)))","v":"NA"},null,null,{"$f":"IF(SUM(L41:L44)=0,0,AVERAGE(L41:L44))","v":0},{"$f":"IF(OR(Search!$W$3=4,Search!$W$3=5,BF41=0),0,astmrnd(BF41,2))","v":0},{"$f":"IF(SUM(Q41:Q44)=0,0,AVERAGE(Q41:Q44))","v":0},{"$f":"IF(OR(Search!$W$3=4,Search!$W$3=5,BH41=0),0,astmrnd(BH41,2))","v":0},{"$f":"IF(SUM(V41:V44)=0,0,AVERAGE(V41:V44))","v":0},{"$f":"IF(OR(Search!$W$3=4,Search!$W$3=5,BJ41=0),0,astmrnd(BJ41,2))","v":0},null,{"$f":"(AA41*0.15)+(AC41*0.3)+(AE41*0.15)+(AG41*0.4)","v":{"$error":"#VALUE!"}},{"$f":"IF(OR(AA41=\"TBD\",AC41=\"TBD\",AE41=\"TBD\",AG41=\"TBD\"),\"TBD\",astmrnd(BM41,0))","v":{"$error":"#VALUE!"}},{"$f":"IF(Menu!$C$10>Menu!$C$11,Menu!$C$10,IF(BN41>100,Menu!$C$10,Menu!$C$11))","v":{"$error":"#VALUE!"}},{"$f":"IF(AH41=\"TBD\",\"TBD\",((AH41-100)/100)*BO41*G41)","v":{"$error":"#VALUE!"}},{"$f":"(AK41*0.15)+(AM41*0.3)+(AO41*0.15)+(AQ41*0.4)","v":{"$error":"#VALUE!"}},{"$f":"IF(OR(AK41=\"TBD\",AM41=\"TBD\",AO41=\"TBD\",AQ41=\"TBD\"),\"TBD\",astmrnd(BQ41,0))","v":{"$error":"#VALUE!"}},{"$f":"IF(Menu!$C$10>Menu!$C$11,Menu!$C$10,IF(BR41>100,Menu!$C$10,Menu!$C$11))","v":{"$error":"#VALUE!"}},{"$f":"IF(AR41=\"TBD\",\"TBD\",((AR41-100)/100)*BS41*G41)","v":{"$error":"#VALUE!"}},{"$f":"(AU41*0.15)+(AW41*0.3)+(AY41*0.15)+(BA41*0.4)","v":{"$error":"#VALUE!"}},{"$f":"IF(OR(AU41=\"TBD\",AW41=\"TBD\",AY41=\"TBD\",BA41=\"TBD\"),\"TBD\",astmrnd(BU41,0))","v":{"$error":"#VALUE!"}},{"$f":"IF(Menu!$C$10>Menu!$C$11,Menu!$C$10,IF(BV41>100,Menu!$C$10,Menu!$C$11))","v":{"$error":"#VALUE!"}},{"$f":"IF(BB41=\"TBD\",\"TBD\",((BB41-100)/100)*BW41*G41)","v":{"$error":"#VALUE!"}}]
[null,null,null,null,8]
[null,null,null,null,8]
[null,null,null,null,8]
[null,null,{"$f":"IF(B45=0,\"\",$C$6)","v":""},null,9,null,null,null,null,null,null,null,{"$f":"BG45","v":0},null,null,null,null,{"$f":"BI45","v":0},null,null,null,null,{"$f":"BK45","v":0},null,null,{"$f":"IF(I45=0,\"NA\",ABS(I45-$H45))","v":"NA"},{"$f":"IF(Z45=\"NA\",\"NA\",IF(Z45<0.46,105-(11.1111*Z45),IF(Z45<1.01,181.8181-(181.8181*Z45),\"TBD\")))","v":"NA"},{"$f":"IF(J45=0,\"NA\",ABS(J45-$R$4))","v":"NA"},{"$f":"IF(AB45=\"NA\",\"NA\",IF(J45<1,\"TBD\",IF(AB45<1.01,105-(5*AB45),IF(AB45<2.01,140-(40*AB45),\"TBD\"))))","v":"NA"},{"$f":"IF(K45=0,\"NA\",ABS(K45-$T$4))","v":"NA"},{"$f":"IF(AD45=\"NA\",\"NA\",IF(AD45<1.01,105-(5*AD45),IF(AD45<$BG$7,168-(69*AD45),\"TBD\")))","v":"NA"},{"$f":"IF(BG45=0,\"NA\",BG45)","v":"NA"},{"$f":"IF(Z45=\"NA\",\"NA\",IF(Search!$W$3=2,100,IF(AF45>$BM$7,105,IF(AF45>$BN$7,(($BQ$7*AF45)-$BR$7),IF(AF45>$BO$7,(($BS$7*AF45)-$BT$7),\"TBD\")))))","v":"NA"},{"$f":"IF(OR(AA45=\"TBD\",AC45=\"TBD\",AE45=\"TBD\",AG45=\"TBD\"),\"TBD\",IF(Z45=\"NA\",\"NA\",BN45))","v":"NA"},{"$f":"IF(Z45=\"NA\",\"NA\",IF(BP45=\"TBD\",\"TBD\",astmrnd(BP45,2)))","v":"NA"},{"$f":"IF(N45=0,\"NA\",ABS(N45-$H45))","v":"NA"},{"$f":"IF(AJ45=\"NA\",\"NA\",IF(AJ45<0.46,105-(11.1111*AJ45),IF(AJ45<1.01,181.8181-(181.8181*AJ45),\"TBD\")))","v":"NA"},{"$f":"IF(O45=0,\"NA\",ABS(O45-$R$4))","v":"NA"},{"$f":"IF(AL45=\"NA\",\"NA\",IF(O45<1,\"TBD\",IF(AL45<1.01,105-(5*AL45),IF(AL45<2.01,140-(40*AL45),\"TBD\"))))","v":"NA"},{"$f":"IF(P45=0,\"NA\",ABS(P45-$T$4))","v":"NA"},{"$f":"IF(AN45=\"NA\",\"NA\",IF(AN45<1.01,105-(5*AN45),IF(AN45<$BG$7,168-(69*AN45),\"TBD\")))","v":"NA"},{"$f":"IF(BI45=0,\"NA\",BI45)","v":"NA"},{"$f":"IF(AJ45=\"NA\",\"NA\",IF(Search!$W$3=2,100,IF(AP45>$BM$7,105,IF(AP45>$BN$7,(($BQ$7*AP45)-$BR$7),IF(AP45>$BO$7,(($BS$7*AP45)-$BT$7),\"TBD\")))))","v":"NA"},{"$f":"IF(OR(AK45=\"TBD\",AM45=\"TBD\",AO45=\"TBD\",AQ45=\"TBD\"),\"TBD\",IF(AJ45=\"NA\",\"NA\",BR45))","v":"NA"},{"$f":"IF(AJ45=\"NA\",\"NA\",IF(BT45=\"TBD\",\"TBD\",astmrnd(BT45,2)))","v":"NA"},{"$f":"IF(S45=0,\"NA\",ABS(S45-$H45))","v":"NA"},{"$f":"IF(AT45=\"NA\",\"NA\",IF(AT45<0.46,105-(11.1111*AT45),IF(AT45<1.01,181.8181-(181.8181*AT45),\"TBD\")))","v":"NA"},{"$f":"IF(T45=0,\"NA\",ABS(T45-$R$4))","v":"NA"},{"$f":"IF(AV45=\"NA\",\"NA\",IF(T45<1,\"TBD\",IF(AV45<1.01,105-(5*AV45),IF(AV45<2.01,140-(40*AV45),\"TBD\"))))","v":"NA"},{"$f":"IF(U45=0,\"NA\",ABS(U45-$T$4))","v":"NA"},{"$f":"IF(AX45=\"NA\",\"NA\",IF(AX45<1.01,105-(5*AX45),IF(AX45<$BG$7,168-(69*AX45),\"TBD\")))","v":"NA"},{"$f":"IF(BK45=0,\"NA\",BK45)","v":"NA"},{"$f":"IF(AT45=\"NA\",\"NA\",IF(Search!$W$3=2,100,IF(AZ45>$BM$7,105,IF(AZ45>$BN$7,(($BQ$7*AZ45)-$BR$7),IF(AZ45>$BO$7,(($BS$7*AZ45)-$BT$7),\"TBD\")))))","v":"NA"},{"$f":"IF(OR(AU45=\"TBD\",AW45=\"TBD\",AY45=\"TBD\",BA45=\"TBD\"),\"TBD\",IF(AT45=\"NA\",\"NA\",BV45))","v":"NA"},{"$f":"IF(AT45=\"NA\",\"NA\",IF(BX45=\"TBD\",\"TBD\",astmrnd(BX45,2)))","v":"NA"},null,null,{"$f":"IF(SUM(L45:L48)=0,0,AVERAGE(L45:L48))","v":0},{"$f":"IF(OR(Search!$W$3=4,Search!$W$3=5,BF45=0),0,astmrnd(BF45,2))","v":0},{"$f":"IF(SUM(Q45:Q48)=0,0,AVERAGE(Q45:Q48))","v":0},{"$f":"IF(OR(Search!$W$3=4,Search!$W$3=5,BH45=0),0,astmrnd(BH45,2))","v":0},{"$f":"IF(SUM(V45:V48)=0,0,AVERAGE(V45:V48))","v":0},{"$f":"IF(OR(Search!$W$3=4,Search!$W$3=5,BJ45=0),0,astmrnd(BJ45,2))","v":0},null,{"$f":"(AA45*0.15)+(AC45*0.3)+(AE45*0.15)+(AG45*0.4)","v":{"$error":"#VALUE!"}},{"$f":"IF(OR(AA45=\"TBD\",AC45=\"TBD\",AE45=\"TBD\",AG45=\"TBD\"),\"TBD\",astmrnd(BM45,0))","v":{"$error":"#VALUE!"}},{"$f":"IF(Menu!$C$10>Menu!$C$11,Menu!$C$10,IF(BN45>100,Menu!$C$10,Menu!$C$11))","v":{"$error":"#VALUE!"}},{"$f":"IF(AH45=\"TBD\",\"TBD\",((AH45-100)/100)*BO45*G45)","v":{"$error":"#VALUE!"}},{"$f":"(AK45*0.15)+(AM45*0.3)+(AO45*0.15)+(AQ45*0.4)","v":{"$error":"#VALUE!"}},{"$f":"IF(OR(AK45=\"TBD\",AM45=\"TBD\",AO45=\"TBD\",AQ45=\"TBD\"),\"TBD\",astmrnd(BQ45,0))","v":{"$error":"#VALUE!"}},{"$f":"IF(Menu!$C$10>Menu!$C$11,Menu!$C$10,IF(BR45>100,Menu!$C$10,Menu!$C$11))","v":{"$error":"#VALUE!"}},{"$f":"IF(AR45=\"TBD\",\"TBD\",((AR45-100)/100)*BS45*G45)","v":{"$error":"#VALUE!"}},{"$f":"(AU45*0.15)+(AW45*0.3)+(AY45*0.15)+(BA45*0.4)","v":{"$error":"#VALUE!"}},{"$f":"IF(OR(AU45=\"TBD\",AW45=\"TBD\",AY45=\"TBD\",BA45=\"TBD\"),\"TBD\",astmrnd(BU45,0))","v":{"$error":"#VALUE!"}},{"$f":"IF(Menu!$C$10>Menu!$C$11,Menu!$C$10,IF(BV45>100,Menu!$C$10,Menu!$C$11))","v":{"$error":"#VALUE!"}},{"$f":"IF(BB45=\"TBD\",\"TBD\",((BB45-100)/100)*BW45*G45)","v":{"$error":"#VALUE!"}}]
[null,null,null,null,9]
[null,null,null,null,9]
[null,null,null,null,9]
[null,null,{"$f":"IF(B49=0,\"\",$C$6)","v":""},null,10,null,null,null,null,null,null,null,{"$f":"BG49","v":0},null,null,null,null,{"$f":"BI49","v":0},null,null,null,null,{"$f":"BK49","v":0},null,null,{"$f":"IF(I49=0,\"NA\",ABS(I49-$H49))","v":"NA"},{"$f":"IF(Z49=\"NA\",\"NA\",IF(Z49<0.46,105-(11.1111*Z49),IF(Z49<1.01,181.8181-(181.8181*Z49),\"TBD\")))","v":"NA"},{"$f":"IF(J49=0,\"NA\",ABS(J49-$R$4))","v":"NA"},{"$f":"IF(AB49=\"NA\",\"NA\",IF(J49<1,\"TBD\",IF(AB49<1.01,105-(5*AB49),IF(AB49<2.01,140-(40*AB49),\"TBD\"))))","v":"NA"},{"$f":"IF(K49=0,\"NA\",ABS(K49-$T$4))","v":"NA"},{"$f":"IF(AD49=\"NA\",\"NA\",IF(AD49<1.01,105-(5*AD49),IF(AD49<$BG$7,168-(69*AD49),\"TBD\")))","v":"NA"},{"$f":"IF(BG49=0,\"NA\",BG49)","v":"NA"},{"$f":"IF(Z49=\"NA\",\"NA\",IF(Search!$W$3=2,100,IF(AF49>$BM$7,105,IF(AF49>$BN$7,(($BQ$7*AF49)-$BR$7),IF(AF49>$BO$7,(($BS$7*AF49)-$BT$7),\"TBD\")))))","v":"NA"},{"$f":"IF(OR(AA49=\"TBD\",AC49=\"TBD\",AE49=\"TBD\",AG49=\"TBD\"),\"TBD\",IF(Z49=\"NA\",\"NA\",BN49))","v":"NA"},{"$f":"IF(Z49=\"NA\",\"NA\",IF(BP49=\"TBD\",\"TBD\",astmrnd(BP49,2)))","v":"NA"},{"$f":"IF(N49=0,\"NA\",ABS(N49-$H49))","v":"NA"},{"$f":"IF(AJ49=\"NA\",\"NA\",IF(AJ49<0.46,105-(11.1111*AJ49),IF(AJ49<1.01,181.8181-(181.8181*AJ49),\"TBD\")))","v":"NA"},{"$f":"IF(O49=0,\"NA\",ABS(O49-$R$4))","v":"NA"},{"$f":"IF(AL49=\"NA\",\"NA\",IF(O49<1,\"TBD\",IF(AL49<1.01,105-(5*AL49),IF(AL49<2.01,140-(40*AL49),\"TBD\"))))","v":"NA"},{"$f":"IF(P49=0,\"NA\",ABS(P49-$T$4))","v":"NA"},{"$f":"IF(AN49=\"NA\",\"NA\",IF(AN49<1.01,105-(5*AN49),IF(AN49<$BG$7,168-(69*AN49),\"TBD\")))","v":"NA"},{"$f":"IF(BI49=0,\"NA\",BI49)","v":"NA"},{"$f":"IF(AJ49=\"NA\",\"NA\",IF(Search!$W$3=2,100,IF(AP49>$BM$7,105,IF(AP49>$BN$7,(($BQ$7*AP49)-$BR$7),IF(AP49>$BO$7,(($BS$7*AP49)-$BT$7),\"TBD\")))))","v":"NA"},{"$f":"IF(OR(AK49=\"TBD\",AM49=\"TBD\",AO49=\"TBD\",AQ49=\"TBD\"),\"TBD\",IF(AJ49=\"NA\",\"NA\",BR49))","v":"NA"},{"$f":"IF(AJ49=\"NA\",\"NA\",IF(BT49=\"TBD\",\"TBD\",astmrnd(BT49,2)))","v":"NA"},{"$f":"IF(S49=0,\"NA\",ABS(S49-$H49))","v":"NA"},{"$f":"IF(AT49=\"NA\",\"NA\",IF(AT49<0.46,105-(11.1111*AT49),IF(AT49<1.01,181.8181-(181.8181*AT49),\"TBD\")))","v":"NA"},{"$f":"IF(T49=0,\"NA\",ABS(T49-$R$4))","v":"NA"},{"$f":"IF(AV49=\"NA\",\"NA\",IF(T49<1,\"TBD\",IF(AV49<1.01,105-(5*AV49),IF(AV49<2.01,140-(40*AV49),\"TBD\"))))","v":"NA"},{"$f":"IF(U49=0,\"NA\",ABS(U49-$T$4))","v":"NA"},{"$f":"IF(AX49=\"NA\",\"NA\",IF(AX49<1.01,105-(5*AX49),IF(AX49<$BG$7,168-(69*AX49),\"TBD\")))","v":"NA"},{"$f":"IF(BK49=0,\"NA\",BK49)","v":"NA"},{"$f":"IF(AT49=\"NA\",\"NA\",IF(Search!$W$3=2,100,IF(AZ49>$BM$7,105,IF(AZ49>$BN$7,(($BQ$7*AZ49)-$BR$7),IF(AZ49>$BO$7,(($BS$7*AZ49)-$BT$7),\"TBD\")))))","v":"NA"},{"$f":"IF(OR(AU49=\"TBD\",AW49=\"TBD\",AY49=\"TBD\",BA49=\"TBD\"),\"TBD\",IF(AT49=\"NA\",\"NA\",BV49))","v":"NA"},{"$f":"IF(AT49=\"NA\",\"NA\",IF(BX49=\"TBD\",\"TBD\",astmrnd(BX49,2)))","v":"NA"},null,null,{"$f":"IF(SUM(L49:L52)=0,0,AVERAGE(L49:L52))","v":0},{"$f":"IF(OR(Search!$W$3=4,Search!$W$3=5,BF49=0),0,astmrnd(BF49,2))","v":0},{"$f":"IF(SUM(Q49:Q52)=0,0,AVERAGE(Q49:Q52))","v":0},{"$f":"IF(OR(Search!$W$3=4,Search!$W$3=5,BH49=0),0,astmrnd(BH49,2))","v":0},{"$f":"IF(SUM(V49:V52)=0,0,AVERAGE(V49:V52))","v":0},{"$f":"IF(OR(Search!$W$3=4,Search!$W$3=5,BJ49=0),0,astmrnd(BJ49,2))","v":0},null,{"$f":"(AA49*0.15)+(AC49*0.3)+(AE49*0.15)+(AG49*0.4)","v":{"$error":"#VALUE!"}},{"$f":"IF(OR(AA49=\"TBD\",AC49=\"TBD\",AE49=\"TBD\",AG49=\"TBD\"),\"TBD\",astmrnd(BM49,0))","v":{"$error":"#VALUE!"}},{"$f":"IF(Menu!$C$10>Menu!$C$11,Menu!$C$10,IF(BN49>100,Menu!$C$10,Menu!$C$11))","v":{"$error":"#VALUE!"}},{"$f":"IF(AH49=\"TBD\",\"TBD\",((AH49-100)/100)*BO49*G49)","v":{"$error":"#VALUE!"}},{"$f":"(AK49*0.15)+(AM49*0.3)+(AO49*0.15)+(AQ49*0.4)","v":{"$error":"#VALUE!"}},{"$f":"IF(OR(AK49=\"TBD\",AM49=\"TBD\",AO49=\"TBD\",AQ49=\"TBD\"),\"TBD\",astmrnd(BQ49,0))","v":{"$error":"#VALUE!"}},{"$f":"IF(Menu!$C$10>Menu!$C$11,Menu!$C$10,IF(BR49>100,Menu!$C$10,Menu!$C$11))","v":{"$error":"#VALUE!"}},{"$f":"IF(AR49=\"TBD\",\"TBD\",((AR49-100)/100)*BS49*G49)","v":{"$error":"#VALUE!"}},{"$f":"(AU49*0.15)+(AW49*0.3)+(AY49*0.15)+(BA49*0.4)","v":{"$error":"#VALUE!"}},{"$f":"IF(OR(AU49=\"TBD\",AW49=\"TBD\",AY49=\"TBD\",BA49=\"TBD\"),\"TBD\",astmrnd(BU49,0))","v":{"$error":"#VALUE!"}},{"$f":"IF(Menu!$C$10>Menu!$C$11,Menu!$C$10,IF(BV49>100,Menu!$C$10,Menu!$C$11))","v":{"$error":"#VALUE!"}},{"$f":"IF(BB49=\"TBD\",\"TBD\",((BB49-100)/100)*BW49*G49)","v":{"$error":"#VALUE!"}}]
[null,null,null,null,10]
[null,null,null,null,10]
[null,null,null,null,10]
[null,null,{"$f":"IF(B53=0,\"\",$C$6)","v":""},null,11,null,null,null,null,null,null,null,{"$f":"BG53","v":0},null,null,null,null,{"$f":"BI53","v":0},null,null,null,null,{"$f":"BK53","v":0},null,null,{"$f":"IF(I53=0,\"NA\",ABS(I53-$H53))","v":"NA"},{"$f":"IF(Z53=\"NA\",\"NA\",IF(Z53<0.46,105-(11.1111*Z53),IF(Z53<1.01,181.8181-(181.8181*Z53),\"TBD\")))","v":"NA"},{"$f":"IF(J53=0,\"NA\",ABS(J53-$R$4))","v":"NA"},{"$f":"IF(AB53=\"NA\",\"NA\",IF(J53<1,\"TBD\",IF(AB53<1.01,105-(5*AB53),IF(AB53<2.01,140-(40*AB53),\"TBD\"))))","v":"NA"},{"$f":"IF(K53=0,\"NA\",ABS(K53-$T$4))","v":"NA"},{"$f":"IF(AD53=\"NA\",\"NA\",IF(AD53<1.01,105-(5*AD53),IF(AD53<$BG$7,168-(69*AD53),\"TBD\")))","v":"NA"},{"$f":"IF(BG53=0,\"NA\",BG53)","v":"NA"},{"$f":"IF(Z53=\"NA\",\"NA\",IF(Search!$W$3=2,100,IF(AF53>$BM$7,105,IF(AF53>$BN$7,(($BQ$7*AF53)-$BR$7),IF(AF53>$BO$7,(($BS$7*AF53)-$BT$7),\"TBD\")))))","v":"NA"},{"$f":"IF(OR(AA53=\"TBD\",AC53=\"TBD\",AE53=\"TBD\",AG53=\"TBD\"),\"TBD\",IF(Z53=\"NA\",\"NA\",BN53))","v":"NA"},{"$f":"IF(Z53=\"NA\",\"NA\",IF(BP53=\"TBD\",\"TBD\",astmrnd(BP53,2)))","v":"NA"},{"$f":"IF(N53=0,\"NA\",ABS(N53-$H53))","v":"NA"},{"$f":"IF(AJ53=\"NA\",\"NA\",IF(AJ53<0.46,105-(11.1111*AJ53),IF(AJ53<1.01,181.8181-(181.8181*AJ53),\"TBD\")))","v":"NA"},{"$f":"IF(O53=0,\"NA\",ABS(O53-$R$4))","v":"NA"},{"$f":"IF(AL53=\"NA\",\"NA\",IF(O53<1,\"TBD\",IF(AL53<1.01,105-(5*AL53),IF(AL53<2.01,140-(40*AL53),\"TBD\"))))","v":"NA"},{"$f":"IF(P53=0,\"NA\",ABS(P53-$T$4))","v":"NA"},{"$f":"IF(AN53=\"NA\",\"NA\",IF(AN53<1.01,105-(5*AN53),IF(AN53<$BG$7,168-(69*AN53),\"TBD\")))","v":"NA"},{"$f":"IF(BI53=0,\"NA\",BI53)","v":"NA"},{"$f":"IF(AJ53=\"NA\",\"NA\",IF(Search!$W$3=2,100,IF(AP53>$BM$7,105,IF(AP53>$BN$7,(($BQ$7*AP53)-$BR$7),IF(AP53>$BO$7,(($BS$7*AP53)-$BT$7),\"TBD\")))))","v":"NA"},{"$f":"IF(OR(AK53=\"TBD\",AM53=\"TBD\",AO53=\"TBD\",AQ53=\"TBD\"),\"TBD\",IF(AJ53=\"NA\",\"NA\",BR53))","v":"NA"},{"$f":"IF(AJ53=\"NA\",\"NA\",IF(BT53=\"TBD\",\"TBD\",astmrnd(BT53,2)))","v":"NA"},{"$f":"IF(S53=0,\"NA\",ABS(S53-$H53))","v":"NA"},{"$f":"IF(AT53=\"NA\",\"NA\",IF(AT53<0.46,105-(11.1111*AT53),IF(AT53<1.01,181.8181-(181.8181*AT53),\"TBD\")))","v":"NA"},{"$f":"IF(T53=0,\"NA\",ABS(T53-$R$4))","v":"NA"},{"$f":"IF(AV53=\"NA\",\"NA\",IF(T53<1,\"TBD\",IF(AV53<1.01,105-(5*AV53),IF(AV53<2.01,140-(40*AV53),\"TBD\"))))","v":"NA"},{"$f":"IF(U53=0,\"NA\",ABS(U53-$T$4))","v":"NA"},{"$f":"IF(AX53=\"NA\",\"NA\",IF(AX53<1.01,105-(5*AX53),IF(AX53<$BG$7,168-(69*AX53),\"TBD\")))","v":"NA"},{"$f":"IF(BK53=0,\"NA\",BK53)","v":"NA"},{"$f":"IF(AT53=\"NA\",\"NA\",IF(Search!$W$3=2,100,IF(AZ53>$BM$7,105,IF(AZ53>$BN$7,(($BQ$7*AZ53)-$BR$7),IF(AZ53>$BO$7,(($BS$7*AZ53)-$BT$7),\"TBD\")))))","v":"NA"},{"$f":"IF(OR(AU53=\"TBD\",AW53=\"TBD\",AY53=\"TBD\",BA53=\"TBD\"),\"TBD\",IF(AT53=\"NA\",\"NA\",BV53))","v":"NA"},{"$f":"IF(AT53=\"NA\",\"NA\",IF(BX53=\"TBD\",\"TBD\",astmrnd(BX53,2)))","v":"NA"},null,null,{"$f":"IF(SUM(L53:L56)=0,0,AVERAGE(L53:L56))","v":0},{"$f":"IF(OR(Search!$W$3=4,Search!$W$3=5,BF53=0),0,astmrnd(BF53,2))","v":0},{"$f":"IF(SUM(Q53:Q56)=0,0,AVERAGE(Q53:Q56))","v":0},{"$f":"IF(OR(Search!$W$3=4,Search!$W$3=5,BH53=0),0,astmrnd(BH53,2))","v":0},{"$f":"IF(SUM(V53:V56)=0,0,AVERAGE(V53:V56))","v":0},{"$f":"IF(OR(Search!$W$3=4,Search!$W$3=5,BJ53=0),0,astmrnd(BJ53,2))","v":0},null,{"$f":"(AA53*0.15)+(AC53*0.3)+(AE53*0.15)+(AG53*0.4)","v":{"$error":"#VALUE!"}},{"$f":"IF(OR(AA53=\"TBD\",AC53=\"TBD\",AE53=\"TBD\",AG53=\"TBD\"),\"TBD\",astmrnd(BM53,0))","v":{"$error":"#VALUE!"}},{"$f":"IF(Menu!$C$10>Menu!$C$11,Menu!$C$10,IF(BN53>100,Menu!$C$10,Menu!$C$11))","v":{"$error":"#VALUE!"}},{"$f":"IF(AH53=\"TBD\",\"TBD\",((AH53-100)/100)*BO53*G53)","v":{"$error":"#VALUE!"}},{"$f":"(AK53*0.15)+(AM53*0.3)+(AO53*0.15)+(AQ53*0.4)","v":{"$error":"#VALUE!"}},{"$f":"IF(OR(AK53=\"TBD\",AM53=\"TBD\",AO53=\"TBD\",AQ53=\"TBD\"),\"TBD\",astmrnd(BQ53,0))","v":{"$error":"#VALUE!"}},{"$f":"IF(Menu!$C$10>Menu!$C$11,Menu!$C$10,IF(BR53>100,Menu!$C$10,Menu!$C$11))","v":{"$error":"#VALUE!"}},{"$f":"IF(AR53=\"TBD\",\"TBD\",((AR53-100)/100)*BS53*G53)","v":{"$error":"#VALUE!"}},{"$f":"(AU53*0.15)+(AW53*0.3)+(AY53*0.15)+(BA53*0.4)","v":{"$error":"#VALUE!"}},{"$f":"IF(OR(AU53=\"TBD\",AW53=\"TBD\",AY53=\"TBD\",BA53=\"TBD\"),\"TBD\",astmrnd(BU53,0))","v":{"$error":"#VALUE!"}},{"$f":"IF(Menu!$C$10>Menu!$C$11,Menu!$C$10,IF(BV53>100,Menu!$C$10,Menu!$C$11))","v":{"$error":"#VALUE!"}},{"$f":"IF(BB53=\"TBD\",\"TBD\",((BB53-100)/100)*BW53*G53)","v":{"$error":"#VALUE!"}}]
[null,null,null,null,11]
[null,null,null,null,11]
[null,null,null,null,11]
[null,null,{"$f":"IF(B57=0,\"\",$C$6)","v":""},null,12,null,null,null,null,null,null,null,{"$f":"BG57","v":0},null,null,null,null,{"$f":"BI57","v":0},null,null,null,null,{"$f":"BK57","v":0},null,null,{"$f":"IF(I57=0,\"NA\",ABS(I57-$H57))","v":"NA"},{"$f":"IF(Z57=\"NA\",\"NA\",IF(Z57<0.46,105-(11.1111*Z57),IF(Z57<1.01,181.8181-(181.8181*Z57),\"TBD\")))","v":"NA"},{"$f":"IF(J57=0,\"NA\",ABS(J57-$R$4))","v":"NA"},{"$f":"IF(AB57=\"NA\",\"NA\",IF(J57<1,\"TBD\",IF(AB57<1.01,105-(5*AB57),IF(AB57<2.01,140-(40*AB57),\"TBD\"))))","v":"NA"},{"$f":"IF(K57=0,\"NA\",ABS(K57-$T$4))","v":"NA"},{"$f":"IF(AD57=\"NA\",\"NA\",IF(AD57<1.01,105-(5*AD57),IF(AD57<$BG$7,168-(69*AD57),\"TBD\")))","v":"NA"},{"$f":"IF(BG57=0,\"NA\",BG57)","v":"NA"},{"$f":"IF(Z57=\"NA\",\"NA\",IF(Search!$W$3=2,100,IF(AF57>$BM$7,105,IF(AF57>$BN$7,(($BQ$7*AF57)-$BR$7),IF(AF57>$BO$7,(($BS$7*AF57)-$BT$7),\"TBD\")))))","v":"NA"},{"$f":"IF(OR(AA57=\"TBD\",AC57=\"TBD\",AE57=\"TBD\",AG57=\"TBD\"),\"TBD\",IF(Z57=\"NA\",\"NA\",BN57))","v":"NA"},{"$f":"IF(Z57=\"NA\",\"NA\",IF(BP57=\"TBD\",\"TBD\",astmrnd(BP57,2)))","v":"NA"},{"$f":"IF(N57=0,\"NA\",ABS(N57-$H57))","v":"NA"},{"$f":"IF(AJ57=\"NA\",\"NA\",IF(AJ57<0.46,105-(11.1111*AJ57),IF(AJ57<1.01,181.8181-(181.8181*AJ57),\"TBD\")))","v":"NA"},{"$f":"IF(O57=0,\"NA\",ABS(O57-$R$4))","v":"NA"},{"$f":"IF(AL57=\"NA\",\"NA\",IF(O57<1,\"TBD\",IF(AL57<1.01,105-(5*AL57),IF(AL57<2.01,140-(40*AL57),\"TBD\"))))","v":"NA"},{"$f":"IF(P57=0,\"NA\",ABS(P57-$T$4))","v":"NA"},{"$f":"IF(AN57=\"NA\",\"NA\",IF(AN57<1.01,105-(5*AN57),IF(AN57<$BG$7,168-(69*AN57),\"TBD\")))","v":"NA"},{"$f":"IF(BI57=0,\"NA\",BI57)","v":"NA"},{"$f":"IF(AJ57=\"NA\",\"NA\",IF(Search!$W$3=2,100,IF(AP57>$BM$7,105,IF(AP57>$BN$7,(($BQ$7*AP57)-$BR$7),IF(AP57>$BO$7,(($BS$7*AP57)-$BT$7),\"TBD\")))))","v":"NA"},{"$f":"IF(OR(AK57=\"TBD\",AM57=\"TBD\",AO57=\"TBD\",AQ57=\"TBD\"),\"TBD\",IF(AJ57=\"NA\",\"NA\",BR57))","v":"NA"},{"$f":"IF(AJ57=\"NA\",\"NA\",IF(BT57=\"TBD\",\"TBD\",astmrnd(BT57,2)))","v":"NA"},{"$f":"IF(S57=0,\"NA\",ABS(S57-$H57))","v":"NA"},{"$f":"IF(AT57=\"NA\",\"NA\",IF(AT57<0.46,105-(11.1111*AT57),IF(AT57<1.01,181.8181-(181.8181*AT57),\"TBD\")))","v":"NA"},{"$f":"IF(T57=0,\"NA\",ABS(T57-$R$4))","v":"NA"},{"$f":"IF(AV57=\"NA\",\"NA\",IF(T57<1,\"TBD\",IF(AV57<1.01,105-(5*AV57),IF(AV57<2.01,140-(40*AV57),\"TBD\"))))","v":"NA"},{"$f":"IF(U57=0,\"NA\",ABS(U57-$T$4))","v":"NA"},{"$f":"IF(AX57=\"NA\",\"NA\",IF(AX57<1.01,105-(5*AX57),IF(AX57<$BG$7,168-(69*AX57),\"TBD\")))","v":"NA"},{"$f":"IF(BK57=0,\"NA\",BK57)","v":"NA"},{"$f":"IF(AT57=\"NA\",\"NA\",IF(Search!$W$3=2,100,IF(AZ57>$BM$7,105,IF(AZ57>$BN$7,(($BQ$7*AZ57)-$BR$7),IF(AZ57>$BO$7,(($BS$7*AZ57)-$BT$7),\"TBD\")))))","v":"NA"},{"$f":"IF(OR(AU57=\"TBD\",AW57=\"TBD\",AY57=\"TBD\",BA57=\"TBD\"),\"TBD\",IF(AT57=\"NA\",\"NA\",BV57))","v":"NA"},{"$f":"IF(AT57=\"NA\",\"NA\",IF(BX57=\"TBD\",\"TBD\",astmrnd(BX57,2)))","v":"NA"},null,null,{"$f":"IF(SUM(L57:L60)=0,0,AVERAGE(L57:L60))","v":0},{"$f":"IF(OR(Search!$W$3=4,Search!$W$3=5,BF57=0),0,astmrnd(BF57,2))","v":0},{"$f":"IF(SUM(Q57:Q60)=0,0,AVERAGE(Q57:Q60))","v":0},{"$f":"IF(OR(Search!$W$3=4,Search!$W$3=5,BH57=0),0,astmrnd(BH57,2))","v":0},{"$f":"IF(SUM(V57:V60)=0,0,AVERAGE(V57:V60))","v":0},{"$f":"IF(OR(Search!$W$3=4,Search!$W$3=5,BJ57=0),0,astmrnd(BJ57,2))","v":0},null,{"$f":"(AA57*0.15)+(AC57*0.3)+(AE57*0.15)+(AG57*0.4)","v":{"$error":"#VALUE!"}},{"$f":"IF(OR(AA57=\"TBD\",AC57=\"TBD\",AE57=\"TBD\",AG57=\"TBD\"),\"TBD\",astmrnd(BM57,0))","v":{"$error":"#VALUE!"}},{"$f":"IF(Menu!$C$10>Menu!$C$11,Menu!$C$10,IF(BN57>100,Menu!$C$10,Menu!$C$11))","v":{"$error":"#VALUE!"}},{"$f":"IF(AH57=\"TBD\",\"TBD\",((AH57-100)/100)*BO57*G57)","v":{"$error":"#VALUE!"}},{"$f":"(AK57*0.15)+(AM57*0.3)+(AO57*0.15)+(AQ57*0.4)","v":{"$error":"#VALUE!"}},{"$f":"IF(OR(AK57=\"TBD\",AM57=\"TBD\",AO57=\"TBD\",AQ57=\"TBD\"),\"TBD\",astmrnd(BQ57,0))","v":{"$error":"#VALUE!"}},{"$f":"IF(Menu!$C$10>Menu!$C$11,Menu!$C$10,IF(BR57>100,Menu!$C$10,Menu!$C$11))","v":{"$error":"#VALUE!"}},{"$f":"IF(AR57=\"TBD\",\"TBD\",((AR57-100)/100)*BS57*G57)","v":{"$error":"#VALUE!"}},{"$f":"(AU57*0.15)+(AW57*0.3)+(AY57*0.15)+(BA57*0.4)","v":{"$error":"#VALUE!"}},{"$f":"IF(OR(AU57=\"TBD\",AW57=\"TBD\",AY57=\"TBD\",BA57=\"TBD\"),\"TBD\",astmrnd(BU57,0))","v":{"$error":"#VALUE!"}},{"$f":"IF(Menu!$C$10>Menu!$C$11,Menu!$C$10,IF(BV57>100,Menu!$C$10,Menu!$C$11))","v":{"$error":"#VALUE!"}},{"$f":"IF(BB57=\"TBD\",\"TBD\",((BB57-100)/100)*BW57*G57)","v":{"$error":"#VALUE!"}}]
[null,null,null,null,12]
[null,null,null,null,12]
[null,null,null,null,12]
[null,null,{"$f":"IF(B61=0,\"\",$C$6)","v":""},null,13,null,null,null,null,null,null,null,{"$f":"BG61","v":0},null,null,null,null,{"$f":"BI61","v":0},null,null,null,null,{"$f":"BK61","v":0},null,null,{"$f":"IF(I61=0,\"NA\",ABS(I61-$H61))","v":"NA"},{"$f":"IF(Z61=\"NA\",\"NA\",IF(Z61<0.46,105-(11.1111*Z61),IF(Z61<1.01,181.8181-(181.8181*Z61),\"TBD\")))","v":"NA"},{"$f":"IF(J61=0,\"NA\",ABS(J61-$R$4))","v":"NA"},{"$f":"IF(AB61=\"NA\",\"NA\",IF(J61<1,\"TBD\",IF(AB61<1.01,105-(5*AB61),IF(AB61<2.01,140-(40*AB61),\"TBD\"))))","v":"NA"},{"$f":"IF(K61=0,\"NA\",ABS(K61-$T$4))","v":"NA"},{"$f":"IF(AD61=\"NA\",\"NA\",IF(AD61<1.01,105-(5*AD61),IF(AD61<$BG$7,168-(69*AD61),\"TBD\")))","v":"NA"},{"$f":"IF(BG61=0,\"NA\",BG61)","v":"NA"},{"$f":"IF(Z61=\"NA\",\"NA\",IF(Search!$W$3=2,100,IF(AF61>$BM$7,105,IF(AF61>$BN$7,(($BQ$7*AF61)-$BR$7),IF(AF61>$BO$7,(($BS$7*AF61)-$BT$7),\"TBD\")))))","v":"NA"},{"$f":"IF(OR(AA61=\"TBD\",AC61=\"TBD\",AE61=\"TBD\",AG61=\"TBD\"),\"TBD\",IF(Z61=\"NA\",\"NA\",BN61))","v":"NA"},{"$f":"IF(Z61=\"NA\",\"NA\",IF(BP61=\"TBD\",\"TBD\",astmrnd(BP61,2)))","v":"NA"},{"$f":"IF(N61=0,\"NA\",ABS(N61-$H61))","v":"NA"},{"$f":"IF(AJ61=\"NA\",\"NA\",IF(AJ61<0.46,105-(11.1111*AJ61),IF(AJ61<1.01,181.8181-(181.8181*AJ61),\"TBD\")))","v":"NA"},{"$f":"IF(O61=0,\"NA\",ABS(O61-$R$4))","v":"NA"},{"$f":"IF(AL61=\"NA\",\"NA\",IF(O61<1,\"TBD\",IF(AL61<1.01,105-(5*AL61),IF(AL61<2.01,140-(40*AL61),\"TBD\"))))","v":"NA"},{"$f":"IF(P61=0,\"NA\",ABS(P61-$T$4))","v":"NA"},{"$f":"IF(AN61=\"NA\",\"NA\",IF(AN61<1.01,105-(5*AN61),IF(AN61<$BG$7,168-(69*AN61),\"TBD\")))","v":"NA"},{"$f":"IF(BI61=0,\"NA\",BI61)","v":"NA"},{"$f":"IF(AJ61=\"NA\",\"NA\",IF(Search!$W$3=2,100,IF(AP61>$BM$7,105,IF(AP61>$BN$7,(($BQ$7*AP61)-$BR$7),IF(AP61>$BO$7,(($BS$7*AP61)-$BT$7),\"TBD\")))))","v":"NA"},{"$f":"IF(OR(AK61=\"TBD\",AM61=\"TBD\",AO61=\"TBD\",AQ61=\"TBD\"),\"TBD\",IF(AJ61=\"NA\",\"NA\",BR61))","v":"NA"},{"$f":"IF(AJ61=\"NA\",\"NA\",IF(BT61=\"TBD\",\"TBD\",astmrnd(BT61,2)))","v":"NA"},{"$f":"IF(S61=0,\"NA\",ABS(S61-$H61))","v":"NA"},{"$f":"IF(AT61=\"NA\",\"NA\",IF(AT61<0.46,105-(11.1111*AT61),IF(AT61<1.01,181.8181-(181.8181*AT61),\"TBD\")))","v":"NA"},{"$f":"IF(T61=0,\"NA\",ABS(T61-$R$4))","v":"NA"},{"$f":"IF(AV61=\"NA\",\"NA\",IF(T61<1,\"TBD\",IF(AV61<1.01,105-(5*AV61),IF(AV61<2.01,140-(40*AV61),\"TBD\"))))","v":"NA"},{"$f":"IF(U61=0,\"NA\",ABS(U61-$T$4))","v":"NA"},{"$f":"IF(AX61=\"NA\",\"NA\",IF(AX61<1.01,105-(5*AX61),IF(AX61<$BG$7,168-(69*AX61),\"TBD\")))","v":"NA"},{"$f":"IF(BK61=0,\"NA\",BK61)","v":"NA"},{"$f":"IF(AT61=\"NA\",\"NA\",IF(Search!$W$3=2,100,IF(AZ61>$BM$7,105,IF(AZ61>$BN$7,(($BQ$7*AZ61)-$BR$7),IF(AZ61>$BO$7,(($BS$7*AZ61)-$BT$7),\"TBD\")))))","v":"NA"},{"$f":"IF(OR(AU61=\"TBD\",AW61=\"TBD\",AY61=\"TBD\",BA61=\"TBD\"),\"TBD\",IF(AT61=\"NA\",\"NA\",BV61))","v":"NA"},{"$f":"IF(AT61=\"NA\",\"NA\",IF(BX61=\"TBD\",\"TBD\",astmrnd(BX61,2)))","v":"NA"},null,null,{"$f":"IF(SUM(L61:L64)=0,0,AVERAGE(L61:L64))","v":0},{"$f":"IF(OR(Search!$W$3=4,Search!$W$3=5,BF61=0),0,astmrnd(BF61,2))","v":0},{"$f":"IF(SUM(Q61:Q64)=0,0,AVERAGE(Q61:Q64))","v":0},{"$f":"IF(OR(Search!$W$3=4,Search!$W$3=5,BH61=0),0,astmrnd(BH61,2))","v":0},{"$f":"IF(SUM(V61:V64)=0,0,AVERAGE(V61:V64))","v":0},{"$f":"IF(OR(Search!$W$3=4,Search!$W$3=5,BJ61=0),0,astmrnd(BJ61,2))","v":0},null,{"$f":"(AA61*0.15)+(AC61*0.3)+(AE61*0.15)+(AG61*0.4)","v":{"$error":"#VALUE!"}},{"$f":"IF(OR(AA61=\"TBD\",AC61=\"TBD\",AE61=\"TBD\",AG61=\"TBD\"),\"TBD\",astmrnd(BM61,0))","v":{"$error":"#VALUE!"}},{"$f":"IF(Menu!$C$10>Menu!$C$11,Menu!$C$10,IF(BN61>100,Menu!$C$10,Menu!$C$11))","v":{"$error":"#VALUE!"}},{"$f":"IF(AH61=\"TBD\",\"TBD\",((AH61-100)/100)*BO61*G61)","v":{"$error":"#VALUE!"}},{"$f":"(AK61*0.15)+(AM61*0.3)+(AO61*0.15)+(AQ61*0.4)","v":{"$error":"#VALUE!"}},{"$f":"IF(OR(AK61=\"TBD\",AM61=\"TBD\",AO61=\"TBD\",AQ61=\"TBD\"),\"TBD\",astmrnd(BQ61,0))","v":{"$error":"#VALUE!"}},{"$f":"IF(Menu!$C$10>Menu!$C$11,Menu!$C$10,IF(BR61>100,Menu!$C$10,Menu!$C$11))","v":{"$error":"#VALUE!"}},{"$f":"IF(AR61=\"TBD\",\"TBD\",((AR61-100)/100)*BS61*G61)","v":{"$error":"#VALUE!"}},{"$f":"(AU61*0.15)+(AW61*0.3)+(AY61*0.15)+(BA61*0.4)","v":{"$error":"#VALUE!"}},{"$f":"IF(OR(AU61=\"TBD\",AW61=\"TBD\",AY61=\"TBD\",BA61=\"TBD\"),\"TBD\",astmrnd(BU61,0))","v":{"$error":"#VALUE!"}},{"$f":"IF(Menu!$C$10>Menu!$C$11,Menu!$C$10,IF(BV61>100,Menu!$C$10,Menu!$C$11))","v":{"$error":"#VALUE!"}},{"$f":"IF(BB61=\"TBD\",\"TBD\",((BB61-100)/100)*BW61*G61)","v":{"$error":"#VALUE!"}}]
[null,null,null,null,13]
[null,null,null,null,13]
[null,null,null,null,13]
[null,null,{"$f":"IF(B65=0,\"\",$C$6)","v":""},null,14,null,null,null,null,null,null,null,{"$f":"BG65","v":0},null,null,null,null,{"$f":"BI65","v":0},null,null,null,null,{"$f":"BK65","v":0},null,null,{"$f":"IF(I65=0,\"NA\",ABS(I65-$H65))","v":"NA"},{"$f":"IF(Z65=\"NA\",\"NA\",IF(Z65<0.46,105-(11.1111*Z65),IF(Z65<1.01,181.8181-(181.8181*Z65),\"TBD\")))","v":"NA"},{"$f":"IF(J65=0,\"NA\",ABS(J65-$R$4))","v":"NA"},{"$f":"IF(AB65=\"NA\",\"NA\",IF(J65<1,\"TBD\",IF(AB65<1.01,105-(5*AB65),IF(AB65<2.01,140-(40*AB65),\"TBD\"))))","v":"NA"},{"$f":"IF(K65=0,\"NA\",ABS(K65-$T$4))","v":"NA"},{"$f":"IF(AD65=\"NA\",\"NA\",IF(AD65<1.01,105-(5*AD65),IF(AD65<$BG$7,168-(69*AD65),\"TBD\")))","v":"NA"},{"$f":"IF(BG65=0,\"NA\",BG65)","v":"NA"},{"$f":"IF(Z65=\"NA\",\"NA\",IF(Search!$W$3=2,100,IF(AF65>$BM$7,105,IF(AF65>$BN$7,(($BQ$7*AF65)-$BR$7),IF(AF65>$BO$7,(($BS$7*AF65)-$BT$7),\"TBD\")))))","v":"NA"},{"$f":"IF(OR(AA65=\"TBD\",AC65=\"TBD\",AE65=\"TBD\",AG65=\"TBD\"),\"TBD\",IF(Z65=\"NA\",\"NA\",BN65))","v":"NA"},{"$f":"IF(Z65=\"NA\",\"NA\",IF(BP65=\"TBD\",\"TBD\",astmrnd(BP65,2)))","v":"NA"},{"$f":"IF(N65=0,\"NA\",ABS(N65-$H65))","v":"NA"},{"$f":"IF(AJ65=\"NA\",\"NA\",IF(AJ65<0.46,105-(11.1111*AJ65),IF(AJ65<1.01,181.8181-(181.8181*AJ65),\"TBD\")))","v":"NA"},{"$f":"IF(O65=0,\"NA\",ABS(O65-$R$4))","v":"NA"},{"$f":"IF(AL65=\"NA\",\"NA\",IF(O65<1,\"TBD\",IF(AL65<1.01,105-(5*AL65),IF(AL65<2.01,140-(40*AL65),\"TBD\"))))","v":"NA"},{"$f":"IF(P65=0,\"NA\",ABS(P65-$T$4))","v":"NA"},{"$f":"IF(AN65=\"NA\",\"NA\",IF(AN65<1.01,105-(5*AN65),IF(AN65<$BG$7,168-(69*AN65),\"TBD\")))","v":"NA"},{"$f":"IF(BI65=0,\"NA\",BI65)","v":"NA"},{"$f":"IF(AJ65=\"NA\",\"NA\",IF(Search!$W$3=2,100,IF(AP65>$BM$7,105,IF(AP65>$BN$7,(($BQ$7*AP65)-$BR$7),IF(AP65>$BO$7,(($BS$7*AP65)-$BT$7),\"TBD\")))))","v":"NA"},{"$f":"IF(OR(AK65=\"TBD\",AM65=\"TBD\",AO65=\"TBD\",AQ65=\"TBD\"),\"TBD\",IF(AJ65=\"NA\",\"NA\",BR65))","v":"NA"},{"$f":"IF(AJ65=\"NA\",\"NA\",IF(BT65=\"TBD\",\"TBD\",astmrnd(BT65,2)))","v":"NA"},{"$f":"IF(S65=0,\"NA\",ABS(S65-$H65))","v":"NA"},{"$f":"IF(AT65=\"NA\",\"NA\",IF(AT65<0.46,105-(11.1111*AT65),IF(AT65<1.01,181.8181-(181.8181*AT65),\"TBD\")))","v":"NA"},{"$f":"IF(T65=0,\"NA\",ABS(T65-$R$4))","v":"NA"},{"$f":"IF(AV65=\"NA\",\"NA\",IF(T65<1,\"TBD\",IF(AV65<1.01,105-(5*AV65),IF(AV65<2.01,140-(40*AV65),\"TBD\"))))","v":"NA"},{"$f":"IF(U65=0,\"NA\",ABS(U65-$T$4))","v":"NA"},{"$f":"IF(AX65=\"NA\",\"NA\",IF(AX65<1.01,105-(5*AX65),IF(AX65<$BG$7,168-(69*AX65),\"TBD\")))","v":"NA"},{"$f":"IF(BK65=0,\"NA\",BK65)","v":"NA"},{"$f":"IF(AT65=\"NA\",\"NA\",IF(Search!$W$3=2,100,IF(AZ65>$BM$7,105,IF(AZ65>$BN$7,(($BQ$7*AZ65)-$BR$7),IF(AZ65>$BO$7,(($BS$7*AZ65)-$BT$7),\"TBD\")))))","v":"NA"},{"$f":"IF(OR(AU65=\"TBD\",AW65=\"TBD\",AY65=\"TBD\",BA65=\"TBD\"),\"TBD\",IF(AT65=\"NA\",\"NA\",BV65))","v":"NA"},{"$f":"IF(AT65=\"NA\",\"NA\",IF(BX65=\"TBD\",\"TBD\",astmrnd(BX65,2)))","v":"NA"},null,null,{"$f":"IF(SUM(L65:L68)=0,0,AVERAGE(L65:L68))","v":0},{"$f":"IF(OR(Search!$W$3=4,Search!$W$3=5,BF65=0),0,astmrnd(BF65,2))","v":0},{"$f":"IF(SUM(Q65:Q68)=0,0,AVERAGE(Q65:Q68))","v":0},{"$f":"IF(OR(Search!$W$3=4,Search!$W$3=5,BH65=0),0,astmrnd(BH65,2))","v":0},{"$f":"IF(SUM(V65:V68)=0,0,AVERAGE(V65:V68))","v":0},{"$f":"IF(OR(Search!$W$3=4,Search!$W$3=5,BJ65=0),0,astmrnd(BJ65,2))","v":0},null,{"$f":"(AA65*0.15)+(AC65*0.3)+(AE65*0.15)+(AG65*0.4)","v":{"$error":"#VALUE!"}},{"$f":"IF(OR(AA65=\"TBD\",AC65=\"TBD\",AE65=\"TBD\",AG65=\"TBD\"),\"TBD\",astmrnd(BM65,0))","v":{"$error":"#VALUE!"}},{"$f":"IF(Menu!$C$10>Menu!$C$11,Menu!$C$10,IF(BN65>100,Menu!$C$10,Menu!$C$11))","v":{"$error":"#VALUE!"}},{"$f":"IF(AH65=\"TBD\",\"TBD\",((AH65-100)/100)*BO65*G65)","v":{"$error":"#VALUE!"}},{"$f":"(AK65*0.15)+(AM65*0.3)+(AO65*0.15)+(AQ65*0.4)","v":{"$error":"#VALUE!"}},{"$f":"IF(OR(AK65=\"TBD\",AM65=\"TBD\",AO65=\"TBD\",AQ65=\"TBD\"),\"TBD\",astmrnd(BQ65,0))","v":{"$error":"#VALUE!"}},{"$f":"IF(Menu!$C$10>Menu!$C$11,Menu!$C$10,IF(BR65>100,Menu!$C$10,Menu!$C$11))","v":{"$error":"#VALUE!"}},{"$f":"IF(AR65=\"TBD\",\"TBD\",((AR65-100)/100)*BS65*G65)","v":{"$error":"#VALUE!"}},{"$f":"(AU65*0.15)+(AW65*0.3)+(AY65*0.15)+(BA65*0.4)","v":{"$error":"#VALUE!"}},{"$f":"IF(OR(AU65=\"TBD\",AW65=\"TBD\",AY65=\"TBD\",BA65=\"TBD\"),\"TBD\",astmrnd(BU65,0))","v":{"$error":"#VALUE!"}},{"$f":"IF(Menu!$C$10>Menu!$C$11,Menu!$C$10,IF(BV65>100,Menu!$C$10,Menu!$C$11))","v":{"$error":"#VALUE!"}},{"$f":"IF(BB65=\"TBD\",\"TBD\",((BB65-100)/100)*BW65*G65)","v":{"$error":"#VALUE!"}}]
[null,null,null,null,14]
[null,null,null,null,14]
[null,null,null,null,14]
[null,null,{"$f":"IF(B69=0,\"\",$C$6)","v":""},null,15,null,null,null,null,null,null,null,{"$f":"BG69","v":0},null,null,null,null,{"$f":"BI69","v":0},null,null,null,null,{"$f":"BK69","v":0},null,null,{"$f":"IF(I69=0,\"NA\",ABS(I69-$H69))","v":"NA"},{"$f":"IF(Z69=\"NA\",\"NA\",IF(Z69<0.46,105-(11.1111*Z69),IF(Z69<1.01,181.8181-(181.8181*Z69),\"TBD\")))","v":"NA"},{"$f":"IF(J69=0,\"NA\",ABS(J69-$R$4))","v":"NA"},{"$f":"IF(AB69=\"NA\",\"NA\",IF(J69<1,\"TBD\",IF(AB69<1.01,105-(5*AB69),IF(AB69<2.01,140-(40*AB69),\"TBD\"))))","v":"NA"},{"$f":"IF(K69=0,\"NA\",ABS(K69-$T$4))","v":"NA"},{"$f":"IF(AD69=\"NA\",\"NA\",IF(AD69<1.01,105-(5*AD69),IF(AD69<$BG$7,168-(69*AD69),\"TBD\")))","v":"NA"},{"$f":"IF(BG69=0,\"NA\",BG69)","v":"NA"},{"$f":"IF(Z69=\"NA\",\"NA\",IF(Search!$W$3=2,100,IF(AF69>$BM$7,105,IF(AF69>$BN$7,(($BQ$7*AF69)-$BR$7),IF(AF69>$BO$7,(($BS$7*AF69)-$BT$7),\"TBD\")))))","v":"NA"},{"$f":"IF(OR(AA69=\"TBD\",AC69=\"TBD\",AE69=\"TBD\",AG69=\"TBD\"),\"TBD\",IF(Z69=\"NA\",\"NA\",BN69))","v":"NA"},{"$f":"IF(Z69=\"NA\",\"NA\",IF(BP69=\"TBD\",\"TBD\",astmrnd(BP69,2)))","v":"NA"},{"$f":"IF(N69=0,\"NA\",ABS(N69-$H69))","v":"NA"},{"$f":"IF(AJ69=\"NA\",\"NA\",IF(AJ69<0.46,105-(11.1111*AJ69),IF(AJ69<1.01,181.8181-(181.8181*AJ69),\"TBD\")))","v":"NA"},{"$f":"IF(O69=0,\"NA\",ABS(O69-$R$4))","v":"NA"},{"$f":"IF(AL69=\"NA\",\"NA\",IF(O69<1,\"TBD\",IF(AL69<1.01,105-(5*AL69),IF(AL69<2.01,140-(40*AL69),\"TBD\"))))","v":"NA"},{"$f":"IF(P69=0,\"NA\",ABS(P69-$T$4))","v":"NA"},{"$f":"IF(AN69=\"NA\",\"NA\",IF(AN69<1.01,105-(5*AN69),IF(AN69<$BG$7,168-(69*AN69),\"TBD\")))","v":"NA"},{"$f":"IF(BI69=0,\"NA\",BI69)","v":"NA"},{"$f":"IF(AJ69=\"NA\",\"NA\",IF(Search!$W$3=2,100,IF(AP69>$BM$7,105,IF(AP69>$BN$7,(($BQ$7*AP69)-$BR$7),IF(AP69>$BO$7,(($BS$7*AP69)-$BT$7),\"TBD\")))))","v":"NA"},{"$f":"IF(OR(AK69=\"TBD\",AM69=\"TBD\",AO69=\"TBD\",AQ69=\"TBD\"),\"TBD\",IF(AJ69=\"NA\",\"NA\",BR69))","v":"NA"},{"$f":"IF(AJ69=\"NA\",\"NA\",IF(BT69=\"TBD\",\"TBD\",astmrnd(BT69,2)))","v":"NA"},{"$f":"IF(S69=0,\"NA\",ABS(S69-$H69))","v":"NA"},{"$f":"IF(AT69=\"NA\",\"NA\",IF(AT69<0.46,105-(11.1111*AT69),IF(AT69<1.01,181.8181-(181.8181*AT69),\"TBD\")))","v":"NA"},{"$f":"IF(T69=0,\"NA\",ABS(T69-$R$4))","v":"NA"},{"$f":"IF(AV69=\"NA\",\"NA\",IF(T69<1,\"TBD\",IF(AV69<1.01,105-(5*AV69),IF(AV69<2.01,140-(40*AV69),\"TBD\"))))","v":"NA"},{"$f":"IF(U69=0,\"NA\",ABS(U69-$T$4))","v":"NA"},{"$f":"IF(AX69=\"NA\",\"NA\",IF(AX69<1.01,105-(5*AX69),IF(AX69<$BG$7,168-(69*AX69),\"TBD\")))","v":"NA"},{"$f":"IF(BK69=0,\"NA\",BK69)","v":"NA"},{"$f":"IF(AT69=\"NA\",\"NA\",IF(Search!$W$3=2,100,IF(AZ69>$BM$7,105,IF(AZ69>$BN$7,(($BQ$7*AZ69)-$BR$7),IF(AZ69>$BO$7,(($BS$7*AZ69)-$BT$7),\"TBD\")))))","v":"NA"},{"$f":"IF(OR(AU69=\"TBD\",AW69=\"TBD\",AY69=\"TBD\",BA69=\"TBD\"),\"TBD\",IF(AT69=\"NA\",\"NA\",BV69))","v":"NA"},{"$f":"IF(AT69=\"NA\",\"NA\",IF(BX69=\"TBD\",\"TBD\",astmrnd(BX69,2)))","v":"NA"},null,null,{"$f":"IF(SUM(L69:L72)=0,0,AVERAGE(L69:L72))","v":0},{"$f":"IF(OR(Search!$W$3=4,Search!$W$3=5,BF69=0),0,astmrnd(BF69,2))","v":0},{"$f":"IF(SUM(Q69:Q72)=0,0,AVERAGE(Q69:Q72))","v":0},{"$f":"IF(OR(Search!$W$3=4,Search!$W$3=5,BH69=0),0,astmrnd(BH69,2))","v":0},{"$f":"IF(SUM(V69:V72)=0,0,AVERAGE(V69:V72))","v":0},{"$f":"IF(OR(Search!$W$3=4,Search!$W$3=5,BJ69=0),0,astmrnd(BJ69,2))","v":0},null,{"$f":"(AA69*0.15)+(AC69*0.3)+(AE69*0.15)+(AG69*0.4)","v":{"$error":"#VALUE!"}},{"$f":"IF(OR(AA69=\"TBD\",AC69=\"TBD\",AE69=\"TBD\",AG69=\"TBD\"),\"TBD\",astmrnd(BM69,0))","v":{"$error":"#VALUE!"}},{"$f":"IF(Menu!$C$10>Menu!$C$11,Menu!$C$10,IF(BN69>100,Menu!$C$10,Menu!$C$11))","v":{"$error":"#VALUE!"}},{"$f":"IF(AH69=\"TBD\",\"TBD\",((AH69-100)/100)*BO69*G69)","v":{"$error":"#VALUE!"}},{"$f":"(AK69*0.15)+(AM69*0.3)+(AO69*0.15)+(AQ69*0.4)","v":{"$error":"#VALUE!"}},{"$f":"IF(OR(AK69=\"TBD\",AM69=\"TBD\",AO69=\"TBD\",AQ69=\"TBD\"),\"TBD\",astmrnd(BQ69,0))","v":{"$error":"#VALUE!"}},{"$f":"IF(Menu!$C$10>Menu!$C$11,Menu!$C$10,IF(BR69>100,Menu!$C$10,Menu!$C$11))","v":{"$error":"#VALUE!"}},{"$f":"IF(AR69=\"TBD\",\"TBD\",((AR69-100)/100)*BS69*G69)","v":{"$error":"#VALUE!"}},{"$f":"(AU69*0.15)+(AW69*0.3)+(AY69*0.15)+(BA69*0.4)","v":{"$error":"#VALUE!"}},{"$f":"IF(OR(AU69=\"TBD\",AW69=\"TBD\",AY69=\"TBD\",BA69=\"TBD\"),\"TBD\",astmrnd(BU69,0))","v":{"$error":"#VALUE!"}},{"$f":"IF(Menu!$C$10>Menu!$C$11,Menu!$C$10,IF(BV69>100,Menu!$C$10,Menu!$C$11))","v":{"$error":"#VALUE!"}},{"$f":"IF(BB69=\"TBD\",\"TBD\",((BB69-100)/100)*BW69*G69)","v":{"$error":"#VALUE!"}}]
[null,null,null,null,15]
[null,null,null,null,15]
[null,null,null,null,15]
[null,null,{"$f":"IF(B73=0,\"\",$C$6)","v":""},null,16,null,null,null,null,null,null,null,{"$f":"BG73","v":0},null,null,null,null,{"$f":"BI73","v":0},null,null,null,null,{"$f":"BK73","v":0},null,null,{"$f":"IF(I73=0,\"NA\",ABS(I73-$H73))","v":"NA"},{"$f":"IF(Z73=\"NA\",\"NA\",IF(Z73<0.46,105-(11.1111*Z73),IF(Z73<1.01,181.8181-(181.8181*Z73),\"TBD\")))","v":"NA"},{"$f":"IF(J73=0,\"NA\",ABS(J73-$R$4))","v":"NA"},{"$f":"IF(AB73=\"NA\",\"NA\",IF(J73<1,\"TBD\",IF(AB73<1.01,105-(5*AB73),IF(AB73<2.01,140-(40*AB73),\"TBD\"))))","v":"NA"},{"$f":"IF(K73=0,\"NA\",ABS(K73-$T$4))","v":"NA"},{"$f":"IF(AD73=\"NA\",\"NA\",IF(AD73<1.01,105-(5*AD73),IF(AD73<$BG$7,168-(69*AD73),\"TBD\")))","v":"NA"},{"$f":"IF(BG73=0,\"NA\",BG73)","v":"NA"},{"$f":"IF(Z73=\"NA\",\"NA\",IF(Search!$W$3=2,100,IF(AF73>$BM$7,105,IF(AF73>$BN$7,(($BQ$7*AF73)-$BR$7),IF(AF73>$BO$7,(($BS$7*AF73)-$BT$7),\"TBD\")))))","v":"NA"},{"$f":"IF(OR(AA73=\"TBD\",AC73=\"TBD\",AE73=\"TBD\",AG73=\"TBD\"),\"TBD\",IF(Z73=\"NA\",\"NA\",BN73))","v":"NA"},{"$f":"IF(Z73=\"NA\",\"NA\",IF(BP73=\"TBD\",\"TBD\",astmrnd(BP73,2)))","v":"NA"},{"$f":"IF(N73=0,\"NA\",ABS(N73-$H73))","v":"NA"},{"$f":"IF(AJ73=\"NA\",\"NA\",IF(AJ73<0.46,105-(11.1111*AJ73),IF(AJ73<1.01,181.8181-(181.8181*AJ73),\"TBD\")))","v":"NA"},{"$f":"IF(O73=0,\"NA\",ABS(O73-$R$4))","v":"NA"},{"$f":"IF(AL73=\"NA\",\"NA\",IF(O73<1,\"TBD\",IF(AL73<1.01,105-(5*AL73),IF(AL73<2.01,140-(40*AL73),\"TBD\"))))","v":"NA"},{"$f":"IF(P73=0,\"NA\",ABS(P73-$T$4))","v":"NA"},{"$f":"IF(AN73=\"NA\",\"NA\",IF(AN73<1.01,105-(5*AN73),IF(AN73<$BG$7,168-(69*AN73),\"TBD\")))","v":"NA"},{"$f":"IF(BI73=0,\"NA\",BI73)","v":"NA"},{"$f":"IF(AJ73=\"NA\",\"NA\",IF(Search!$W$3=2,100,IF(AP73>$BM$7,105,IF(AP73>$BN$7,(($BQ$7*AP73)-$BR$7),IF(AP73>$BO$7,(($BS$7*AP73)-$BT$7),\"TBD\")))))","v":"NA"},{"$f":"IF(OR(AK73=\"TBD\",AM73=\"TBD\",AO73=\"TBD\",AQ73=\"TBD\"),\"TBD\",IF(AJ73=\"NA\",\"NA\",BR73))","v":"NA"},{"$f":"IF(AJ73=\"NA\",\"NA\",IF(BT73=\"TBD\",\"TBD\",astmrnd(BT73,2)))","v":"NA"},{"$f":"IF(S73=0,\"NA\",ABS(S73-$H73))","v":"NA"},{"$f":"IF(AT73=\"NA\",\"NA\",IF(AT73<0.46,105-(11.1111*AT73),IF(AT73<1.01,181.8181-(181.8181*AT73),\"TBD\")))","v":"NA"},{"$f":"IF(T73=0,\"NA\",ABS(T73-$R$4))","v":"NA"},{"$f":"IF(AV73=\"NA\",\"NA\",IF(T73<1,\"TBD\",IF(AV73<1.01,105-(5*AV73),IF(AV73<2.01,140-(40*AV73),\"TBD\"))))","v":"NA"},{"$f":"IF(U73=0,\"NA\",ABS(U73-$T$4))","v":"NA"},{"$f":"IF(AX73=\"NA\",\"NA\",IF(AX73<1.01,105-(5*AX73),IF(AX73<$BG$7,168-(69*AX73),\"TBD\")))","v":"NA"},{"$f":"IF(BK73=0,\"NA\",BK73)","v":"NA"},{"$f":"IF(AT73=\"NA\",\"NA\",IF(Search!$W$3=2,100,IF(AZ73>$BM$7,105,IF(AZ73>$BN$7,(($BQ$7*AZ73)-$BR$7),IF(AZ73>$BO$7,(($BS$7*AZ73)-$BT$7),\"TBD\")))))","v":"NA"},{"$f":"IF(OR(AU73=\"TBD\",AW73=\"TBD\",AY73=\"TBD\",BA73=\"TBD\"),\"TBD\",IF(AT73=\"NA\",\"NA\",BV73))","v":"NA"},{"$f":"IF(AT73=\"NA\",\"NA\",IF(BX73=\"TBD\",\"TBD\",astmrnd(BX73,2)))","v":"NA"},null,null,{"$f":"IF(SUM(L73:L76)=0,0,AVERAGE(L73:L76))","v":0},{"$f":"IF(OR(Search!$W$3=4,Search!$W$3=5,BF73=0),0,astmrnd(BF73,2))","v":0},{"$f":"IF(SUM(Q73:Q76)=0,0,AVERAGE(Q73:Q76))","v":0},{"$f":"IF(OR(Search!$W$3=4,Search!$W$3=5,BH73=0),0,astmrnd(BH73,2))","v":0},{"$f":"IF(SUM(V73:V76)=0,0,AVERAGE(V73:V76))","v":0},{"$f":"IF(OR(Search!$W$3=4,Search!$W$3=5,BJ73=0),0,astmrnd(BJ73,2))","v":0},null,{"$f":"(AA73*0.15)+(AC73*0.3)+(AE73*0.15)+(AG73*0.4)","v":{"$error":"#VALUE!"}},{"$f":"IF(OR(AA73=\"TBD\",AC73=\"TBD\",AE73=\"TBD\",AG73=\"TBD\"),\"TBD\",astmrnd(BM73,0))","v":{"$error":"#VALUE!"}},{"$f":"IF(Menu!$C$10>Menu!$C$11,Menu!$C$10,IF(BN73>100,Menu!$C$10,Menu!$C$11))","v":{"$error":"#VALUE!"}},{"$f":"IF(AH73=\"TBD\",\"TBD\",((AH73-100)/100)*BO73*G73)","v":{"$error":"#VALUE!"}},{"$f":"(AK73*0.15)+(AM73*0.3)+(AO73*0.15)+(AQ73*0.4)","v":{"$error":"#VALUE!"}},{"$f":"IF(OR(AK73=\"TBD\",AM73=\"TBD\",AO73=\"TBD\",AQ73=\"TBD\"),\"TBD\",astmrnd(BQ73,0))","v":{"$error":"#VALUE!"}},{"$f":"IF(Menu!$C$10>Menu!$C$11,Menu!$C$10,IF(BR73>100,Menu!$C$10,Menu!$C$11))","v":{"$error":"#VALUE!"}},{"$f":"IF(AR73=\"TBD\",\"TBD\",((AR73-100)/100)*BS73*G73)","v":{"$error":"#VALUE!"}},{"$f":"(AU73*0.15)+(AW73*0.3)+(AY73*0.15)+(BA73*0.4)","v":{"$error":"#VALUE!"}},{"$f":"IF(OR(AU73=\"TBD\",AW73=\"TBD\",AY73=\"TBD\",BA73=\"TBD\"),\"TBD\",astmrnd(BU73,0))","v":{"$error":"#VALUE!"}},{"$f":"IF(Menu!$C$10>Menu!$C$11,Menu!$C$10,IF(BV73>100,Menu!$C$10,Menu!$C$11))","v":{"$error":"#VALUE!"}},{"$f":"IF(BB73=\"TBD\",\"TBD\",((BB73-100)/100)*BW73*G73)","v":{"$error":"#VALUE!"}}]
[null,null,null,null,16]
[null,null,null,null,16]
[null,null,null,null,16]
[null,null,{"$f":"IF(B77=0,\"\",$C$6)","v":""},null,17,null,null,null,null,null,null,null,{"$f":"BG77","v":0},null,null,null,null,{"$f":"BI77","v":0},null,null,null,null,{"$f":"BK77","v":0},null,null,{"$f":"IF(I77=0,\"NA\",ABS(I77-$H77))","v":"NA"},{"$f":"IF(Z77=\"NA\",\"NA\",IF(Z77<0.46,105-(11.1111*Z77),IF(Z77<1.01,181.8181-(181.8181*Z77),\"TBD\")))","v":"NA"},{"$f":"IF(J77=0,\"NA\",ABS(J77-$R$4))","v":"NA"},{"$f":"IF(AB77=\"NA\",\"NA\",IF(J77<1,\"TBD\",IF(AB77<1.01,105-(5*AB77),IF(AB77<2.01,140-(40*AB77),\"TBD\"))))","v":"NA"},{"$f":"IF(K77=0,\"NA\",ABS(K77-$T$4))","v":"NA"},{"$f":"IF(AD77=\"NA\",\"NA\",IF(AD77<1.01,105-(5*AD77),IF(AD77<$BG$7,168-(69*AD77),\"TBD\")))","v":"NA"},{"$f":"IF(BG77=0,\"NA\",BG77)","v":"NA"},{"$f":"IF(Z77=\"NA\",\"NA\",IF(Search!$W$3=2,100,IF(AF77>$BM$7,105,IF(AF77>$BN$7,(($BQ$7*AF77)-$BR$7),IF(AF77>$BO$7,(($BS$7*AF77)-$BT$7),\"TBD\")))))","v":"NA"},{"$f":"IF(OR(AA77=\"TBD\",AC77=\"TBD\",AE77=\"TBD\",AG77=\"TBD\"),\"TBD\",IF(Z77=\"NA\",\"NA\",BN77))","v":"NA"},{"$f":"IF(Z77=\"NA\",\"NA\",IF(BP77=\"TBD\",\"TBD\",astmrnd(BP77,2)))","v":"NA"},{"$f":"IF(N77=0,\"NA\",ABS(N77-$H77))","v":"NA"},{"$f":"IF(AJ77=\"NA\",\"NA\",IF(AJ77<0.46,105-(11.1111*AJ77),IF(AJ77<1.01,181.8181-(181.8181*AJ77),\"TBD\")))","v":"NA"},{"$f":"IF(O77=0,\"NA\",ABS(O77-$R$4))","v":"NA"},{"$f":"IF(AL77=\"NA\",\"NA\",IF(O77<1,\"TBD\",IF(AL77<1.01,105-(5*AL77),IF(AL77<2.01,140-(40*AL77),\"TBD\"))))","v":"NA"},{"$f":"IF(P77=0,\"NA\",ABS(P77-$T$4))","v":"NA"},{"$f":"IF(AN77=\"NA\",\"NA\",IF(AN77<1.01,105-(5*AN77),IF(AN77<$BG$7,168-(69*AN77),\"TBD\")))","v":"NA"},{"$f":"IF(BI77=0,\"NA\",BI77)","v":"NA"},{"$f":"IF(AJ77=\"NA\",\"NA\",IF(Search!$W$3=2,100,IF(AP77>$BM$7,105,IF(AP77>$BN$7,(($BQ$7*AP77)-$BR$7),IF(AP77>$BO$7,(($BS$7*AP77)-$BT$7),\"TBD\")))))","v":"NA"},{"$f":"IF(OR(AK77=\"TBD\",AM77=\"TBD\",AO77=\"TBD\",AQ77=\"TBD\"),\"TBD\",IF(AJ77=\"NA\",\"NA\",BR77))","v":"NA"},{"$f":"IF(AJ77=\"NA\",\"NA\",IF(BT77=\"TBD\",\"TBD\",astmrnd(BT77,2)))","v":"NA"},{"$f":"IF(S77=0,\"NA\",ABS(S77-$H77))","v":"NA"},{"$f":"IF(AT77=\"NA\",\"NA\",IF(AT77<0.46,105-(11.1111*AT77),IF(AT77<1.01,181.8181-(181.8181*AT77),\"TBD\")))","v":"NA"},{"$f":"IF(T77=0,\"NA\",ABS(T77-$R$4))","v":"NA"},{"$f":"IF(AV77=\"NA\",\"NA\",IF(T77<1,\"TBD\",IF(AV77<1.01,105-(5*AV77),IF(AV77<2.01,140-(40*AV77),\"TBD\"))))","v":"NA"},{"$f":"IF(U77=0,\"NA\",ABS(U77-$T$4))","v":"NA"},{"$f":"IF(AX77=\"NA\",\"NA\",IF(AX77<1.01,105-(5*AX77),IF(AX77<$BG$7,168-(69*AX77),\"TBD\")))","v":"NA"},{"$f":"IF(BK77=0,\"NA\",BK77)","v":"NA"},{"$f":"IF(AT77=\"NA\",\"NA\",IF(Search!$W$3=2,100,IF(AZ77>$BM$7,105,IF(AZ77>$BN$7,(($BQ$7*AZ77)-$BR$7),IF(AZ77>$BO$7,(($BS$7*AZ77)-$BT$7),\"TBD\")))))","v":"NA"},{"$f":"IF(OR(AU77=\"TBD\",AW77=\"TBD\",AY77=\"TBD\",BA77=\"TBD\"),\"TBD\",IF(AT77=\"NA\",\"NA\",BV77))","v":"NA"},{"$f":"IF(AT77=\"NA\",\"NA\",IF(BX77=\"TBD\",\"TBD\",astmrnd(BX77,2)))","v":"NA"},null,null,{"$f":"IF(SUM(L77:L80)=0,0,AVERAGE(L77:L80))","v":0},{"$f":"IF(OR(Search!$W$3=4,Search!$W$3=5,BF77=0),0,astmrnd(BF77,2))","v":0},{"$f":"IF(SUM(Q77:Q80)=0,0,AVERAGE(Q77:Q80))","v":0},{"$f":"IF(OR(Search!$W$3=4,Search!$W$3=5,BH77=0),0,astmrnd(BH77,2))","v":0},{"$f":"IF(SUM(V77:V80)=0,0,AVERAGE(V77:V80))","v":0},{"$f":"IF(OR(Search!$W$3=4,Search!$W$3=5,BJ77=0),0,astmrnd(BJ77,2))","v":0},null,{"$f":"(AA77*0.15)+(AC77*0.3)+(AE77*0.15)+(AG77*0.4)","v":{"$error":"#VALUE!"}},{"$f":"IF(OR(AA77=\"TBD\",AC77=\"TBD\",AE77=\"TBD\",AG77=\"TBD\"),\"TBD\",astmrnd(BM77,0))","v":{"$error":"#VALUE!"}},{"$f":"IF(Menu!$C$10>Menu!$C$11,Menu!$C$10,IF(BN77>100,Menu!$C$10,Menu!$C$11))","v":{"$error":"#VALUE!"}},{"$f":"IF(AH77=\"TBD\",\"TBD\",((AH77-100)/100)*BO77*G77)","v":{"$error":"#VALUE!"}},{"$f":"(AK77*0.15)+(AM77*0.3)+(AO77*0.15)+(AQ77*0.4)","v":{"$error":"#VALUE!"}},{"$f":"IF(OR(AK77=\"TBD\",AM77=\"TBD\",AO77=\"TBD\",AQ77=\"TBD\"),\"TBD\",astmrnd(BQ77,0))","v":{"$error":"#VALUE!"}},{"$f":"IF(Menu!$C$10>Menu!$C$11,Menu!$C$10,IF(BR77>100,Menu!$C$10,Menu!$C$11))","v":{"$error":"#VALUE!"}},{"$f":"IF(AR77=\"TBD\",\"TBD\",((AR77-100)/100)*BS77*G77)","v":{"$error":"#VALUE!"}},{"$f":"(AU77*0.15)+(AW77*0.3)+(AY77*0.15)+(BA77*0.4)","v":{"$error":"#VALUE!"}},{"$f":"IF(OR(AU77=\"TBD\",AW77=\"TBD\",AY77=\"TBD\",BA77=\"TBD\"),\"TBD\",astmrnd(BU77,0))","v":{"$error":"#VALUE!"}},{"$f":"IF(Menu!$C$10>Menu!$C$11,Menu!$C$10,IF(BV77>100,Menu!$C$10,Menu!$C$11))","v":{"$error":"#VALUE!"}},{"$f":"IF(BB77=\"TBD\",\"TBD\",((BB77-100)/100)*BW77*G77)","v":{"$error":"#VALUE!"}}]
[null,null,null,null,17]
[null,null,null,null,17]
[null,null,null,null,17]
[null,null,{"$f":"IF(B81=0,\"\",$C$6)","v":""},null,18,null,null,null,null,null,null,null,{"$f":"BG81","v":0},null,null,null,null,{"$f":"BI81","v":0},null,null,null,null,{"$f":"BK81","v":0},null,null,{"$f":"IF(I81=0,\"NA\",ABS(I81-$H81))","v":"NA"},{"$f":"IF(Z81=\"NA\",\"NA\",IF(Z81<0.46,105-(11.1111*Z81),IF(Z81<1.01,181.8181-(181.8181*Z81),\"TBD\")))","v":"NA"},{"$f":"IF(J81=0,\"NA\",ABS(J81-$R$4))","v":"NA"},{"$f":"IF(AB81=\"NA\",\"NA\",IF(J81<1,\"TBD\",IF(AB81<1.01,105-(5*AB81),IF(AB81<2.01,140-(40*AB81),\"TBD\"))))","v":"NA"},{"$f":"IF(K81=0,\"NA\",ABS(K81-$T$4))","v":"NA"},{"$f":"IF(AD81=\"NA\",\"NA\",IF(AD81<1.01,105-(5*AD81),IF(AD81<$BG$7,168-(69*AD81),\"TBD\")))","v":"NA"},{"$f":"IF(BG81=0,\"NA\",BG81)","v":"NA"},{"$f":"IF(Z81=\"NA\",\"NA\",IF(Search!$W$3=2,100,IF(AF81>$BM$7,105,IF(AF81>$BN$7,(($BQ$7*AF81)-$BR$7),IF(AF81>$BO$7,(($BS$7*AF81)-$BT$7),\"TBD\")))))","v":"NA"},{"$f":"IF(OR(AA81=\"TBD\",AC81=\"TBD\",AE81=\"TBD\",AG81=\"TBD\"),\"TBD\",IF(Z81=\"NA\",\"NA\",BN81))","v":"NA"},{"$f":"IF(Z81=\"NA\",\"NA\",IF(BP81=\"TBD\",\"TBD\",astmrnd(BP81,2)))","v":"NA"},{"$f":"IF(N81=0,\"NA\",ABS(N81-$H81))","v":"NA"},{"$f":"IF(AJ81=\"NA\",\"NA\",IF(AJ81<0.46,105-(11.1111*AJ81),IF(AJ81<1.01,181.8181-(181.8181*AJ81),\"TBD\")))","v":"NA"},{"$f":"IF(O81=0,\"NA\",ABS(O81-$R$4))","v":"NA"},{"$f":"IF(AL81=\"NA\",\"NA\",IF(O81<1,\"TBD\",IF(AL81<1.01,105-(5*AL81),IF(AL81<2.01,140-(40*AL81),\"TBD\"))))","v":"NA"},{"$f":"IF(P81=0,\"NA\",ABS(P81-$T$4))","v":"NA"},{"$f":"IF(AN81=\"NA\",\"NA\",IF(AN81<1.01,105-(5*AN81),IF(AN81<$BG$7,168-(69*AN81),\"TBD\")))","v":"NA"},{"$f":"IF(BI81=0,\"NA\",BI81)","v":"NA"},{"$f":"IF(AJ81=\"NA\",\"NA\",IF(Search!$W$3=2,100,IF(AP81>$BM$7,105,IF(AP81>$BN$7,(($BQ$7*AP81)-$BR$7),IF(AP81>$BO$7,(($BS$7*AP81)-$BT$7),\"TBD\")))))","v":"NA"},{"$f":"IF(OR(AK81=\"TBD\",AM81=\"TBD\",AO81=\"TBD\",AQ81=\"TBD\"),\"TBD\",IF(AJ81=\"NA\",\"NA\",BR81))","v":"NA"},{"$f":"IF(AJ81=\"NA\",\"NA\",IF(BT81=\"TBD\",\"TBD\",astmrnd(BT81,2)))","v":"NA"},{"$f":"IF(S81=0,\"NA\",ABS(S81-$H81))","v":"NA"},{"$f":"IF(AT81=\"NA\",\"NA\",IF(AT81<0.46,105-(11.1111*AT81),IF(AT81<1.01,181.8181-(181.8181*AT81),\"TBD\")))","v":"NA"},{"$f":"IF(T81=0,\"NA\",ABS(T81-$R$4))","v":"NA"},{"$f":"IF(AV81=\"NA\",\"NA\",IF(T81<1,\"TBD\",IF(AV81<1.01,105-(5*AV81),IF(AV81<2.01,140-(40*AV81),\"TBD\"))))","v":"NA"},{"$f":"IF(U81=0,\"NA\",ABS(U81-$T$4))","v":"NA"},{"$f":"IF(AX81=\"NA\",\"NA\",IF(AX81<1.01,105-(5*AX81),IF(AX81<$BG$7,168-(69*AX81),\"TBD\")))","v":"NA"},{"$f":"IF(BK81=0,\"NA\",BK81)","v":"NA"},{"$f":"IF(AT81=\"NA\",\"NA\",IF(Search!$W$3=2,100,IF(AZ81>$BM$7,105,IF(AZ81>$BN$7,(($BQ$7*AZ81)-$BR$7),IF(AZ81>$BO$7,(($BS$7*AZ81)-$BT$7),\"TBD\")))))","v":"NA"},{"$f":"IF(OR(AU81=\"TBD\",AW81=\"TBD\",AY81=\"TBD\",BA81=\"TBD\"),\"TBD\",IF(AT81=\"NA\",\"NA\",BV81))","v":"NA"},{"$f":"IF(AT81=\"NA\",\"NA\",IF(BX81=\"TBD\",\"TBD\",astmrnd(BX81,2)))","v":"NA"},null,null,{"$f":"IF(SUM(L81:L84)=0,0,AVERAGE(L81:L84))","v":0},{"$f":"IF(OR(Search!$W$3=4,Search!$W$3=5,BF81=0),0,astmrnd(BF81,2))","v":0},{"$f":"IF(SUM(Q81:Q84)=0,0,AVERAGE(Q81:Q84))","v":0},{"$f":"IF(OR(Search!$W$3=4,Search!$W$3=5,BH81=0),0,astmrnd(BH81,2))","v":0},{"$f":"IF(SUM(V81:V84)=0,0,AVERAGE(V81:V84))","v":0},{"$f":"IF(OR(Search!$W$3=4,Search!$W$3=5,BJ81=0),0,astmrnd(BJ81,2))","v":0},null,{"$f":"(AA81*0.15)+(AC81*0.3)+(AE81*0.15)+(AG81*0.4)","v":{"$error":"#VALUE!"}},{"$f":"IF(OR(AA81=\"TBD\",AC81=\"TBD\",AE81=\"TBD\",AG81=\"TBD\"),\"TBD\",astmrnd(BM81,0))","v":{"$error":"#VALUE!"}},{"$f":"IF(Menu!$C$10>Menu!$C$11,Menu!$C$10,IF(BN81>100,Menu!$C$10,Menu!$C$11))","v":{"$error":"#VALUE!"}},{"$f":"IF(AH81=\"TBD\",\"TBD\",((AH81-100)/100)*BO81*G81)","v":{"$error":"#VALUE!"}},{"$f":"(AK81*0.15)+(AM81*0.3)+(AO81*0.15)+(AQ81*0.4)","v":{"$error":"#VALUE!"}},{"$f":"IF(OR(AK81=\"TBD\",AM81=\"TBD\",AO81=\"TBD\",AQ81=\"TBD\"),\"TBD\",astmrnd(BQ81,0))","v":{"$error":"#VALUE!"}},{"$f":"IF(Menu!$C$10>Menu!$C$11,Menu!$C$10,IF(BR81>100,Menu!$C$10,Menu!$C$11))","v":{"$error":"#VALUE!"}},{"$f":"IF(AR81=\"TBD\",\"TBD\",((AR81-100)/100)*BS81*G81)","v":{"$error":"#VALUE!"}},{"$f":"(AU81*0.15)+(AW81*0.3)+(AY81*0.15)+(BA81*0.4)","v":{"$error":"#VALUE!"}},{"$f":"IF(OR(AU81=\"TBD\",AW81=\"TBD\",AY81=\"TBD\",BA81=\"TBD\"),\"TBD\",astmrnd(BU81,0))","v":{"$error":"#VALUE!"}},{"$f":"IF(Menu!$C$10>Menu!$C$11,Menu!$C$10,IF(BV81>100,Menu!$C$10,Menu!$C$11))","v":{"$error":"#VALUE!"}},{"$f":"IF(BB81=\"TBD\",\"TBD\",((BB81-100)/100)*BW81*G81)","v":{"$error":"#VALUE!"}}]
[null,null,null,null,18]
[null,null,null,null,18]
[null,null,null,null,18]
[null,null,{"$f":"IF(B85=0,\"\",$C$6)","v":""},null,19,null,null,null,null,null,null,null,{"$f":"BG85","v":0},null,null,null,null,{"$f":"BI85","v":0},null,null,null,null,{"$f":"BK85","v":0},null,null,{"$f":"IF(I85=0,\"NA\",ABS(I85-$H85))","v":"NA"},{"$f":"IF(Z85=\"NA\",\"NA\",IF(Z85<0.46,105-(11.1111*Z85),IF(Z85<1.01,181.8181-(181.8181*Z85),\"TBD\")))","v":"NA"},{"$f":"IF(J85=0,\"NA\",ABS(J85-$R$4))","v":"NA"},{"$f":"IF(AB85=\"NA\",\"NA\",IF(J85<1,\"TBD\",IF(AB85<1.01,105-(5*AB85),IF(AB85<2.01,140-(40*AB85),\"TBD\"))))","v":"NA"},{"$f":"IF(K85=0,\"NA\",ABS(K85-$T$4))","v":"NA"},{"$f":"IF(AD85=\"NA\",\"NA\",IF(AD85<1.01,105-(5*AD85),IF(AD85<$BG$7,168-(69*AD85),\"TBD\")))","v":"NA"},{"$f":"IF(BG85=0,\"NA\",BG85)","v":"NA"},{"$f":"IF(Z85=\"NA\",\"NA\",IF(Search!$W$3=2,100,IF(AF85>$BM$7,105,IF(AF85>$BN$7,(($BQ$7*AF85)-$BR$7),IF(AF85>$BO$7,(($BS$7*AF85)-$BT$7),\"TBD\")))))","v":"NA"},{"$f":"IF(OR(AA85=\"TBD\",AC85=\"TBD\",AE85=\"TBD\",AG85=\"TBD\"),\"TBD\",IF(Z85=\"NA\",\"NA\",BN85))","v":"NA"},{"$f":"IF(Z85=\"NA\",\"NA\",IF(BP85=\"TBD\",\"TBD\",astmrnd(BP85,2)))","v":"NA"},{"$f":"IF(N85=0,\"NA\",ABS(N85-$H85))","v":"NA"},{"$f":"IF(AJ85=\"NA\",\"NA\",IF(AJ85<0.46,105-(11.1111*AJ85),IF(AJ85<1.01,181.8181-(181.8181*AJ85),\"TBD\")))","v":"NA"},{"$f":"IF(O85=0,\"NA\",ABS(O85-$R$4))","v":"NA"},{"$f":"IF(AL85=\"NA\",\"NA\",IF(O85<1,\"TBD\",IF(AL85<1.01,105-(5*AL85),IF(AL85<2.01,140-(40*AL85),\"TBD\"))))","v":"NA"},{"$f":"IF(P85=0,\"NA\",ABS(P85-$T$4))","v":"NA"},{"$f":"IF(AN85=\"NA\",\"NA\",IF(AN85<1.01,105-(5*AN85),IF(AN85<$BG$7,168-(69*AN85),\"TBD\")))","v":"NA"},{"$f":"IF(BI85=0,\"NA\",BI85)","v":"NA"},{"$f":"IF(AJ85=\"NA\",\"NA\",IF(Search!$W$3=2,100,IF(AP85>$BM$7,105,IF(AP85>$BN$7,(($BQ$7*AP85)-$BR$7),IF(AP85>$BO$7,(($BS$7*AP85)-$BT$7),\"TBD\")))))","v":"NA"},{"$f":"IF(OR(AK85=\"TBD\",AM85=\"TBD\",AO85=\"TBD\",AQ85=\"TBD\"),\"TBD\",IF(AJ85=\"NA\",\"NA\",BR85))","v":"NA"},{"$f":"IF(AJ85=\"NA\",\"NA\",IF(BT85=\"TBD\",\"TBD\",astmrnd(BT85,2)))","v":"NA"},{"$f":"IF(S85=0,\"NA\",ABS(S85-$H85))","v":"NA"},{"$f":"IF(AT85=\"NA\",\"NA\",IF(AT85<0.46,105-(11.1111*AT85),IF(AT85<1.01,181.8181-(181.8181*AT85),\"TBD\")))","v":"NA"},{"$f":"IF(T85=0,\"NA\",ABS(T85-$R$4))","v":"NA"},{"$f":"IF(AV85=\"NA\",\"NA\",IF(T85<1,\"TBD\",IF(AV85<1.01,105-(5*AV85),IF(AV85<2.01,140-(40*AV85),\"TBD\"))))","v":"NA"},{"$f":"IF(U85=0,\"NA\",ABS(U85-$T$4))","v":"NA"},{"$f":"IF(AX85=\"NA\",\"NA\",IF(AX85<1.01,105-(5*AX85),IF(AX85<$BG$7,168-(69*AX85),\"TBD\")))","v":"NA"},{"$f":"IF(BK85=0,\"NA\",BK85)","v":"NA"},{"$f":"IF(AT85=\"NA\",\"NA\",IF(Search!$W$3=2,100,IF(AZ85>$BM$7,105,IF(AZ85>$BN$7,(($BQ$7*AZ85)-$BR$7),IF(AZ85>$BO$7,(($BS$7*AZ85)-$BT$7),\"TBD\")))))","v":"NA"},{"$f":"IF(OR(AU85=\"TBD\",AW85=\"TBD\",AY85=\"TBD\",BA85=\"TBD\"),\"TBD\",IF(AT85=\"NA\",\"NA\",BV85))","v":"NA"},{"$f":"IF(AT85=\"NA\",\"NA\",IF(BX85=\"TBD\",\"TBD\",astmrnd(BX85,2)))","v":"NA"},null,null,{"$f":"IF(SUM(L85:L88)=0,0,AVERAGE(L85:L88))","v":0},{"$f":"IF(OR(Search!$W$3=4,Search!$W$3=5,BF85=0),0,astmrnd(BF85,2))","v":0},{"$f":"IF(SUM(Q85:Q88)=0,0,AVERAGE(Q85:Q88))","v":0},{"$f":"IF(OR(Search!$W$3=4,Search!$W$3=5,BH85=0),0,astmrnd(BH85,2))","v":0},{"$f":"IF(SUM(V85:V88)=0,0,AVERAGE(V85:V88))","v":0},{"$f":"IF(OR(Search!$W$3=4,Search!$W$3=5,BJ85=0),0,astmrnd(BJ85,2))","v":0},null,{"$f":"(AA85*0.15)+(AC85*0.3)+(AE85*0.15)+(AG85*0.4)","v":{"$error":"#VALUE!"}},{"$f":"IF(OR(AA85=\"TBD\",AC85=\"TBD\",AE85=\"TBD\",AG85=\"TBD\"),\"TBD\",astmrnd(BM85,0))","v":{"$error":"#VALUE!"}},{"$f":"IF(Menu!$C$10>Menu!$C$11,Menu!$C$10,IF(BN85>100,Menu!$C$10,Menu!$C$11))","v":{"$error":"#VALUE!"}},{"$f":"IF(AH85=\"TBD\",\"TBD\",((AH85-100)/100)*BO85*G85)","v":{"$error":"#VALUE!"}},{"$f":"(AK85*0.15)+(AM85*0.3)+(AO85*0.15)+(AQ85*0.4)","v":{"$error":"#VALUE!"}},{"$f":"IF(OR(AK85=\"TBD\",AM85=\"TBD\",AO85=\"TBD\",AQ85=\"TBD\"),\"TBD\",astmrnd(BQ85,0))","v":{"$error":"#VALUE!"}},{"$f":"IF(Menu!$C$10>Menu!$C$11,Menu!$C$10,IF(BR85>100,Menu!$C$10,Menu!$C$11))","v":{"$error":"#VALUE!"}},{"$f":"IF(AR85=\"TBD\",\"TBD\",((AR85-100)/100)*BS85*G85)","v":{"$error":"#VALUE!"}},{"$f":"(AU85*0.15)+(AW85*0.3)+(AY85*0.15)+(BA85*0.4)","v":{"$error":"#VALUE!"}},{"$f":"IF(OR(AU85=\"TBD\",AW85=\"TBD\",AY85=\"TBD\",BA85=\"TBD\"),\"TBD\",astmrnd(BU85,0))","v":{"$error":"#VALUE!"}},{"$f":"IF(Menu!$C$10>Menu!$C$11,Menu!$C$10,IF(BV85>100,Menu!$C$10,Menu!$C$11))","v":{"$error":"#VALUE!"}},{"$f":"IF(BB85=\"TBD\",\"TBD\",((BB85-100)/100)*BW85*G85)","v":{"$error":"#VALUE!"}}]
[null,null,null,null,19]
[null,null,null,null,19]
[null,null,null,null,19]
[null,null,{"$f":"IF(B89=0,\"\",$C$6)","v":""},null,20,null,null,null,null,null,null,null,{"$f":"BG89","v":0},null,null,null,null,{"$f":"BI89","v":0},null,null,null,null,{"$f":"BK89","v":0},null,null,{"$f":"IF(I89=0,\"NA\",ABS(I89-$H89))","v":"NA"},{"$f":"IF(Z89=\"NA\",\"NA\",IF(Z89<0.46,105-(11.1111*Z89),IF(Z89<1.01,181.8181-(181.8181*Z89),\"TBD\")))","v":"NA"},{"$f":"IF(J89=0,\"NA\",ABS(J89-$R$4))","v":"NA"},{"$f":"IF(AB89=\"NA\",\"NA\",IF(J89<1,\"TBD\",IF(AB89<1.01,105-(5*AB89),IF(AB89<2.01,140-(40*AB89),\"TBD\"))))","v":"NA"},{"$f":"IF(K89=0,\"NA\",ABS(K89-$T$4))","v":"NA"},{"$f":"IF(AD89=\"NA\",\"NA\",IF(AD89<1.01,105-(5*AD89),IF(AD89<$BG$7,168-(69*AD89),\"TBD\")))","v":"NA"},{"$f":"IF(BG89=0,\"NA\",BG89)","v":"NA"},{"$f":"IF(Z89=\"NA\",\"NA\",IF(Search!$W$3=2,100,IF(AF89>$BM$7,105,IF(AF89>$BN$7,(($BQ$7*AF89)-$BR$7),IF(AF89>$BO$7,(($BS$7*AF89)-$BT$7),\"TBD\")))))","v":"NA"},{"$f":"IF(OR(AA89=\"TBD\",AC89=\"TBD\",AE89=\"TBD\",AG89=\"TBD\"),\"TBD\",IF(Z89=\"NA\",\"NA\",BN89))","v":"NA"},{"$f":"IF(Z89=\"NA\",\"NA\",IF(BP89=\"TBD\",\"TBD\",astmrnd(BP89,2)))","v":"NA"},{"$f":"IF(N89=0,\"NA\",ABS(N89-$H89))","v":"NA"},{"$f":"IF(AJ89=\"NA\",\"NA\",IF(AJ89<0.46,105-(11.1111*AJ89),IF(AJ89<1.01,181.8181-(181.8181*AJ89),\"TBD\")))","v":"NA"},{"$f":"IF(O89=0,\"NA\",ABS(O89-$R$4))","v":"NA"},{"$f":"IF(AL89=\"NA\",\"NA\",IF(O89<1,\"TBD\",IF(AL89<1.01,105-(5*AL89),IF(AL89<2.01,140-(40*AL89),\"TBD\"))))","v":"NA"},{"$f":"IF(P89=0,\"NA\",ABS(P89-$T$4))","v":"NA"},{"$f":"IF(AN89=\"NA\",\"NA\",IF(AN89<1.01,105-(5*AN89),IF(AN89<$BG$7,168-(69*AN89),\"TBD\")))","v":"NA"},{"$f":"IF(BI89=0,\"NA\",BI89)","v":"NA"},{"$f":"IF(AJ89=\"NA\",\"NA\",IF(Search!$W$3=2,100,IF(AP89>$BM$7,105,IF(AP89>$BN$7,(($BQ$7*AP89)-$BR$7),IF(AP89>$BO$7,(($BS$7*AP89)-$BT$7),\"TBD\")))))","v":"NA"},{"$f":"IF(OR(AK89=\"TBD\",AM89=\"TBD\",AO89=\"TBD\",AQ89=\"TBD\"),\"TBD\",IF(AJ89=\"NA\",\"NA\",BR89))","v":"NA"},{"$f":"IF(AJ89=\"NA\",\"NA\",IF(BT89=\"TBD\",\"TBD\",astmrnd(BT89,2)))","v":"NA"},{"$f":"IF(S89=0,\"NA\",ABS(S89-$H89))","v":"NA"},{"$f":"IF(AT89=\"NA\",\"NA\",IF(AT89<0.46,105-(11.1111*AT89),IF(AT89<1.01,181.8181-(181.8181*AT89),\"TBD\")))","v":"NA"},{"$f":"IF(T89=0,\"NA\",ABS(T89-$R$4))","v":"NA"},{"$f":"IF(AV89=\"NA\",\"NA\",IF(T89<1,\"TBD\",IF(AV89<1.01,105-(5*AV89),IF(AV89<2.01,140-(40*AV89),\"TBD\"))))","v":"NA"},{"$f":"IF(U89=0,\"NA\",ABS(U89-$T$4))","v":"NA"},{"$f":"IF(AX89=\"NA\",\"NA\",IF(AX89<1.01,105-(5*AX89),IF(AX89<$BG$7,168-(69*AX89),\"TBD\")))","v":"NA"},{"$f":"IF(BK89=0,\"NA\",BK89)","v":"NA"},{"$f":"IF(AT89=\"NA\",\"NA\",IF(Search!$W$3=2,100,IF(AZ89>$BM$7,105,IF(AZ89>$BN$7,(($BQ$7*AZ89)-$BR$7),IF(AZ89>$BO$7,(($BS$7*AZ89)-$BT$7),\"TBD\")))))","v":"NA"},{"$f":"IF(OR(AU89=\"TBD\",AW89=\"TBD\",AY89=\"TBD\",BA89=\"TBD\"),\"TBD\",IF(AT89=\"NA\",\"NA\",BV89))","v":"NA"},{"$f":"IF(AT89=\"NA\",\"NA\",IF(BX89=\"TBD\",\"TBD\",astmrnd(BX89,2)))","v":"NA"},null,null,{"$f":"IF(SUM(L89:L92)=0,0,AVERAGE(L89:L92))","v":0},{"$f":"IF(OR(Search!$W$3=4,Search!$W$3=5,BF89=0),0,astmrnd(BF89,2))","v":0},{"$f":"IF(SUM(Q89:Q92)=0,0,AVERAGE(Q89:Q92))","v":0},{"$f":"IF(OR(Search!$W$3=4,Search!$W$3=5,BH89=0),0,astmrnd(BH89,2))","v":0},{"$f":"IF(SUM(V89:V92)=0,0,AVERAGE(V89:V92))","v":0},{"$f":"IF(OR(Search!$W$3=4,Search!$W$3=5,BJ89=0),0,astmrnd(BJ89,2))","v":0},null,{"$f":"(AA89*0.15)+(AC89*0.3)+(AE89*0.15)+(AG89*0.4)","v":{"$error":"#VALUE!"}},{"$f":"IF(OR(AA89=\"TBD\",AC89=\"TBD\",AE89=\"TBD\",AG89=\"TBD\"),\"TBD\",astmrnd(BM89,0))","v":{"$error":"#VALUE!"}},{"$f":"IF(Menu!$C$10>Menu!$C$11,Menu!$C$10,IF(BN89>100,Menu!$C$10,Menu!$C$11))","v":{"$error":"#VALUE!"}},{"$f":"IF(AH89=\"TBD\",\"TBD\",((AH89-100)/100)*BO89*G89)","v":{"$error":"#VALUE!"}},{"$f":"(AK89*0.15)+(AM89*0.3)+(AO89*0.15)+(AQ89*0.4)","v":{"$error":"#VALUE!"}},{"$f":"IF(OR(AK89=\"TBD\",AM89=\"TBD\",AO89=\"TBD\",AQ89=\"TBD\"),\"TBD\",astmrnd(BQ89,0))","v":{"$error":"#VALUE!"}},{"$f":"IF(Menu!$C$10>Menu!$C$11,Menu!$C$10,IF(BR89>100,Menu!$C$10,Menu!$C$11))","v":{"$error":"#VALUE!"}},{"$f":"IF(AR89=\"TBD\",\"TBD\",((AR89-100)/100)*BS89*G89)","v":{"$error":"#VALUE!"}},{"$f":"(AU89*0.15)+(AW89*0.3)+(AY89*0.15)+(BA89*0.4)","v":{"$error":"#VALUE!"}},{"$f":"IF(OR(AU89=\"TBD\",AW89=\"TBD\",AY89=\"TBD\",BA89=\"TBD\"),\"TBD\",astmrnd(BU89,0))","v":{"$error":"#VALUE!"}},{"$f":"IF(Menu!$C$10>Menu!$C$11,Menu!$C$10,IF(BV89>100,Menu!$C$10,Menu!$C$11))","v":{"$error":"#VALUE!"}},{"$f":"IF(BB89=\"TBD\",\"TBD\",((BB89-100)/100)*BW89*G89)","v":{"$error":"#VALUE!"}}]
[null,null,null,null,20]
[null,null,null,null,20]
[null,null,null,null,20]
[null,null,{"$f":"IF(B93=0,\"\",$C$6)","v":""},null,21,null,null,null,null,null,null,null,{"$f":"BG93","v":0},null,null,null,null,{"$f":"BI93","v":0},null,null,null,null,{"$f":"BK93","v":0},null,null,{"$f":"IF(I93=0,\"NA\",ABS(I93-$H93))","v":"NA"},{"$f":"IF(Z93=\"NA\",\"NA\",IF(Z93<0.46,105-(11.1111*Z93),IF(Z93<1.01,181.8181-(181.8181*Z93),\"TBD\")))","v":"NA"},{"$f":"IF(J93=0,\"NA\",ABS(J93-$R$4))","v":"NA"},{"$f":"IF(AB93=\"NA\",\"NA\",IF(J93<1,\"TBD\",IF(AB93<1.01,105-(5*AB93),IF(AB93<2.01,140-(40*AB93),\"TBD\"))))","v":"NA"},{"$f":"IF(K93=0,\"NA\",ABS(K93-$T$4))","v":"NA"},{"$f":"IF(AD93=\"NA\",\"NA\",IF(AD93<1.01,105-(5*AD93),IF(AD93<$BG$7,168-(69*AD93),\"TBD\")))","v":"NA"},{"$f":"IF(BG93=0,\"NA\",BG93)","v":"NA"},{"$f":"IF(Z93=\"NA\",\"NA\",IF(Search!$W$3=2,100,IF(AF93>$BM$7,105,IF(AF93>$BN$7,(($BQ$7*AF93)-$BR$7),IF(AF93>$BO$7,(($BS$7*AF93)-$BT$7),\"TBD\")))))","v":"NA"},{"$f":"IF(OR(AA93=\"TBD\",AC93=\"TBD\",AE93=\"TBD\",AG93=\"TBD\"),\"TBD\",IF(Z93=\"NA\",\"NA\",BN93))","v":"NA"},{"$f":"IF(Z93=\"NA\",\"NA\",IF(BP93=\"TBD\",\"TBD\",astmrnd(BP93,2)))","v":"NA"},{"$f":"IF(N93=0,\"NA\",ABS(N93-$H93))","v":"NA"},{"$f":"IF(AJ93=\"NA\",\"NA\",IF(AJ93<0.46,105-(11.1111*AJ93),IF(AJ93<1.01,181.8181-(181.8181*AJ93),\"TBD\")))","v":"NA"},{"$f":"IF(O93=0,\"NA\",ABS(O93-$R$4))","v":"NA"},{"$f":"IF(AL93=\"NA\",\"NA\",IF(O93<1,\"TBD\",IF(AL93<1.01,105-(5*AL93),IF(AL93<2.01,140-(40*AL93),\"TBD\"))))","v":"NA"},{"$f":"IF(P93=0,\"NA\",ABS(P93-$T$4))","v":"NA"},{"$f":"IF(AN93=\"NA\",\"NA\",IF(AN93<1.01,105-(5*AN93),IF(AN93<$BG$7,168-(69*AN93),\"TBD\")))","v":"NA"},{"$f":"IF(BI93=0,\"NA\",BI93)","v":"NA"},{"$f":"IF(AJ93=\"NA\",\"NA\",IF(Search!$W$3=2,100,IF(AP93>$BM$7,105,IF(AP93>$BN$7,(($BQ$7*AP93)-$BR$7),IF(AP93>$BO$7,(($BS$7*AP93)-$BT$7),\"TBD\")))))","v":"NA"},{"$f":"IF(OR(AK93=\"TBD\",AM93=\"TBD\",AO93=\"TBD\",AQ93=\"TBD\"),\"TBD\",IF(AJ93=\"NA\",\"NA\",BR93))","v":"NA"},{"$f":"IF(AJ93=\"NA\",\"NA\",IF(BT93=\"TBD\",\"TBD\",astmrnd(BT93,2)))","v":"NA"},{"$f":"IF(S93=0,\"NA\",ABS(S93-$H93))","v":"NA"},{"$f":"IF(AT93=\"NA\",\"NA\",IF(AT93<0.46,105-(11.1111*AT93),IF(AT93<1.01,181.8181-(181.8181*AT93),\"TBD\")))","v":"NA"},{"$f":"IF(T93=0,\"NA\",ABS(T93-$R$4))","v":"NA"},{"$f":"IF(AV93=\"NA\",\"NA\",IF(T93<1,\"TBD\",IF(AV93<1.01,105-(5*AV93),IF(AV93<2.01,140-(40*AV93),\"TBD\"))))","v":"NA"},{"$f":"IF(U93=0,\"NA\",ABS(U93-$T$4))","v":"NA"},{"$f":"IF(AX93=\"NA\",\"NA\",IF(AX93<1.01,105-(5*AX93),IF(AX93<$BG$7,168-(69*AX93),\"TBD\")))","v":"NA"},{"$f":"IF(BK93=0,\"NA\",BK93)","v":"NA"},{"$f":"IF(AT93=\"NA\",\"NA\",IF(Search!$W$3=2,100,IF(AZ93>$BM$7,105,IF(AZ93>$BN$7,(($BQ$7*AZ93)-$BR$7),IF(AZ93>$BO$7,(($BS$7*AZ93)-$BT$7),\"TBD\")))))","v":"NA"},{"$f":"IF(OR(AU93=\"TBD\",AW93=\"TBD\",AY93=\"TBD\",BA93=\"TBD\"),\"TBD\",IF(AT93=\"NA\",\"NA\",BV93))","v":"NA"},{"$f":"IF(AT93=\"NA\",\"NA\",IF(BX93=\"TBD\",\"TBD\",astmrnd(BX93,2)))","v":"NA"},null,null,{"$f":"IF(SUM(L93:L96)=0,0,AVERAGE(L93:L96))","v":0},{"$f":"IF(OR(Search!$W$3=4,Search!$W$3=5,BF93=0),0,astmrnd(BF93,2))","v":0},{"$f":"IF(SUM(Q93:Q96)=0,0,AVERAGE(Q93:Q96))","v":0},{"$f":"IF(OR(Search!$W$3=4,Search!$W$3=5,BH93=0),0,astmrnd(BH93,2))","v":0},{"$f":"IF(SUM(V93:V96)=0,0,AVERAGE(V93:V96))","v":0},{"$f":"IF(OR(Search!$W$3=4,Search!$W$3=5,BJ93=0),0,astmrnd(BJ93,2))","v":0},null,{"$f":"(AA93*0.15)+(AC93*0.3)+(AE93*0.15)+(AG93*0.4)","v":{"$error":"#VALUE!"}},{"$f":"IF(OR(AA93=\"TBD\",AC93=\"TBD\",AE93=\"TBD\",AG93=\"TBD\"),\"TBD\",astmrnd(BM93,0))","v":{"$error":"#VALUE!"}},{"$f":"IF(Menu!$C$10>Menu!$C$11,Menu!$C$10,IF(BN93>100,Menu!$C$10,Menu!$C$11))","v":{"$error":"#VALUE!"}},{"$f":"IF(AH93=\"TBD\",\"TBD\",((AH93-100)/100)*BO93*G93)","v":{"$error":"#VALUE!"}},{"$f":"(AK93*0.15)+(AM93*0.3)+(AO93*0.15)+(AQ93*0.4)","v":{"$error":"#VALUE!"}},{"$f":"IF(OR(AK93=\"TBD\",AM93=\"TBD\",AO93=\"TBD\",AQ93=\"TBD\"),\"TBD\",astmrnd(BQ93,0))","v":{"$error":"#VALUE!"}},{"$f":"IF(Menu!$C$10>Menu!$C$11,Menu!$C$10,IF(BR93>100,Menu!$C$10,Menu!$C$11))","v":{"$error":"#VALUE!"}},{"$f":"IF(AR93=\"TBD\",\"TBD\",((AR93-100)/100)*BS93*G93)","v":{"$error":"#VALUE!"}},{"$f":"(AU93*0.15)+(AW93*0.3)+(AY93*0.15)+(BA93*0.4)","v":{"$error":"#VALUE!"}},{"$f":"IF(OR(AU93=\"TBD\",AW93=\"TBD\",AY93=\"TBD\",BA93=\"TBD\"),\"TBD\",astmrnd(BU93,0))","v":{"$error":"#VALUE!"}},{"$f":"IF(Menu!$C$10>Menu!$C$11,Menu!$C$10,IF(BV93>100,Menu!$C$10,Menu!$C$11))","v":{"$error":"#VALUE!"}},{"$f":"IF(BB93=\"TBD\",\"TBD\",((BB93-100)/100)*BW93*G93)","v":{"$error":"#VALUE!"}}]
[null,null,null,null,21]
[null,null,null,null,21]
[null,null,null,null,21]
[null,null,{"$f":"IF(B97=0,\"\",$C$6)","v":""},null,22,null,null,null,null,null,null,null,{"$f":"BG97","v":0},null,null,null,null,{"$f":"BI97","v":0},null,null,null,null,{"$f":"BK97","v":0},null,null,{"$f":"IF(I97=0,\"NA\",ABS(I97-$H97))","v":"NA"},{"$f":"IF(Z97=\"NA\",\"NA\",IF(Z97<0.46,105-(11.1111*Z97),IF(Z97<1.01,181.8181-(181.8181*Z97),\"TBD\")))","v":"NA"},{"$f":"IF(J97=0,\"NA\",ABS(J97-$R$4))","v":"NA"},{"$f":"IF(AB97=\"NA\",\"NA\",IF(J97<1,\"TBD\",IF(AB97<1.01,105-(5*AB97),IF(AB97<2.01,140-(40*AB97),\"TBD\"))))","v":"NA"},{"$f":"IF(K97=0,\"NA\",ABS(K97-$T$4))","v":"NA"},{"$f":"IF(AD97=\"NA\",\"NA\",IF(AD97<1.01,105-(5*AD97),IF(AD97<$BG$7,168-(69*AD97),\"TBD\")))","v":"NA"},{"$f":"IF(BG97=0,\"NA\",BG97)","v":"NA"},{"$f":"IF(Z97=\"NA\",\"NA\",IF(Search!$W$3=2,100,IF(AF97>$BM$7,105,IF(AF97>$BN$7,(($BQ$7*AF97)-$BR$7),IF(AF97>$BO$7,(($BS$7*AF97)-$BT$7),\"TBD\")))))","v":"NA"},{"$f":"IF(OR(AA97=\"TBD\",AC97=\"TBD\",AE97=\"TBD\",AG97=\"TBD\"),\"TBD\",IF(Z97=\"NA\",\"NA\",BN97))","v":"NA"},{"$f":"IF(Z97=\"NA\",\"NA\",IF(BP97=\"TBD\",\"TBD\",astmrnd(BP97,2)))","v":"NA"},{"$f":"IF(N97=0,\"NA\",ABS(N97-$H97))","v":"NA"},{"$f":"IF(AJ97=\"NA\",\"NA\",IF(AJ97<0.46,105-(11.1111*AJ97),IF(AJ97<1.01,181.8181-(181.8181*AJ97),\"TBD\")))","v":"NA"},{"$f":"IF(O97=0,\"NA\",ABS(O97-$R$4))","v":"NA"},{"$f":"IF(AL97=\"NA\",\"NA\",IF(O97<1,\"TBD\",IF(AL97<1.01,105-(5*AL97),IF(AL97<2.01,140-(40*AL97),\"TBD\"))))","v":"NA"},{"$f":"IF(P97=0,\"NA\",ABS(P97-$T$4))","v":"NA"},{"$f":"IF(AN97=\"NA\",\"NA\",IF(AN97<1.01,105-(5*AN97),IF(AN97<$BG$7,168-(69*AN97),\"TBD\")))","v":"NA"},{"$f":"IF(BI97=0,\"NA\",BI97)","v":"NA"},{"$f":"IF(AJ97=\"NA\",\"NA\",IF(Search!$W$3=2,100,IF(AP97>$BM$7,105,IF(AP97>$BN$7,(($BQ$7*AP97)-$BR$7),IF(AP97>$BO$7,(($BS$7*AP97)-$BT$7),\"TBD\")))))","v":"NA"},{"$f":"IF(OR(AK97=\"TBD\",AM97=\"TBD\",AO97=\"TBD\",AQ97=\"TBD\"),\"TBD\",IF(AJ97=\"NA\",\"NA\",BR97))","v":"NA"},{"$f":"IF(AJ97=\"NA\",\"NA\",IF(BT97=\"TBD\",\"TBD\",astmrnd(BT97,2)))","v":"NA"},{"$f":"IF(S97=0,\"NA\",ABS(S97-$H97))","v":"NA"},{"$f":"IF(AT97=\"NA\",\"NA\",IF(AT97<0.46,105-(11.1111*AT97),IF(AT97<1.01,181.8181-(181.8181*AT97),\"TBD\")))","v":"NA"},{"$f":"IF(T97=0,\"NA\",ABS(T97-$R$4))","v":"NA"},{"$f":"IF(AV97=\"NA\",\"NA\",IF(T97<1,\"TBD\",IF(AV97<1.01,105-(5*AV97),IF(AV97<2.01,140-(40*AV97),\"TBD\"))))","v":"NA"},{"$f":"IF(U97=0,\"NA\",ABS(U97-$T$4))","v":"NA"},{"$f":"IF(AX97=\"NA\",\"NA\",IF(AX97<1.01,105-(5*AX97),IF(AX97<$BG$7,168-(69*AX97),\"TBD\")))","v":"NA"},{"$f":"IF(BK97=0,\"NA\",BK97)","v":"NA"},{"$f":"IF(AT97=\"NA\",\"NA\",IF(Search!$W$3=2,100,IF(AZ97>$BM$7,105,IF(AZ97>$BN$7,(($BQ$7*AZ97)-$BR$7),IF(AZ97>$BO$7,(($BS$7*AZ97)-$BT$7),\"TBD\")))))","v":"NA"},{"$f":"IF(OR(AU97=\"TBD\",AW97=\"TBD\",AY97=\"TBD\",BA97=\"TBD\"),\"TBD\",IF(AT97=\"NA\",\"NA\",BV97))","v":"NA"},{"$f":"IF(AT97=\"NA\",\"NA\",IF(BX97=\"TBD\",\"TBD\",astmrnd(BX97,2)))","v":"NA"},null,null,{"$f":"IF(SUM(L97:L100)=0,0,AVERAGE(L97:L100))","v":0},{"$f":"IF(OR(Search!$W$3=4,Search!$W$3=5,BF97=0),0,astmrnd(BF97,2))","v":0},{"$f":"IF(SUM(Q97:Q100)=0,0,AVERAGE(Q97:Q100))","v":0},{"$f":"IF(OR(Search!$W$3=4,Search!$W$3=5,BH97=0),0,astmrnd(BH97,2))","v":0},{"$f":"IF(SUM(V97:V100)=0,0,AVERAGE(V97:V100))","v":0},{"$f":"IF(OR(Search!$W$3=4,Search!$W$3=5,BJ97=0),0,astmrnd(BJ97,2))","v":0},null,{"$f":"(AA97*0.15)+(AC97*0.3)+(AE97*0.15)+(AG97*0.4)","v":{"$error":"#VALUE!"}},{"$f":"IF(OR(AA97=\"TBD\",AC97=\"TBD\",AE97=\"TBD\",AG97=\"TBD\"),\"TBD\",astmrnd(BM97,0))","v":{"$error":"#VALUE!"}},{"$f":"IF(Menu!$C$10>Menu!$C$11,Menu!$C$10,IF(BN97>100,Menu!$C$10,Menu!$C$11))","v":{"$error":"#VALUE!"}},{"$f":"IF(AH97=\"TBD\",\"TBD\",((AH97-100)/100)*BO97*G97)","v":{"$error":"#VALUE!"}},{"$f":"(AK97*0.15)+(AM97*0.3)+(AO97*0.15)+(AQ97*0.4)","v":{"$error":"#VALUE!"}},{"$f":"IF(OR(AK97=\"TBD\",AM97=\"TBD\",AO97=\"TBD\",AQ97=\"TBD\"),\"TBD\",astmrnd(BQ97,0))","v":{"$error":"#VALUE!"}},{"$f":"IF(Menu!$C$10>Menu!$C$11,Menu!$C$10,IF(BR97>100,Menu!$C$10,Menu!$C$11))","v":{"$error":"#VALUE!"}},{"$f":"IF(AR97=\"TBD\",\"TBD\",((AR97-100)/100)*BS97*G97)","v":{"$error":"#VALUE!"}},{"$f":"(AU97*0.15)+(AW97*0.3)+(AY97*0.15)+(BA97*0.4)","v":{"$error":"#VALUE!"}},{"$f":"IF(OR(AU97=\"TBD\",AW97=\"TBD\",AY97=\"TBD\",BA97=\"TBD\"),\"TBD\",astmrnd(BU97,0))","v":{"$error":"#VALUE!"}},{"$f":"IF(Menu!$C$10>Menu!$C$11,Menu!$C$10,IF(BV97>100,Menu!$C$10,Menu!$C$11))","v":{"$error":"#VALUE!"}},{"$f":"IF(BB97=\"TBD\",\"TBD\",((BB97-100)/100)*BW97*G97)","v":{"$error":"#VALUE!"}}]
[null,null,null,null,22]
[null,null,null,null,22]
[null,null,null,null,22]
[null,null,{"$f":"IF(B101=0,\"\",$C$6)","v":""},null,23,null,null,null,null,null,null,null,{"$f":"BG101","v":0},null,null,null,null,{"$f":"BI101","v":0},null,null,null,null,{"$f":"BK101","v":0},null,null,{"$f":"IF(I101=0,\"NA\",ABS(I101-$H101))","v":"NA"},{"$f":"IF(Z101=\"NA\",\"NA\",IF(Z101<0.46,105-(11.1111*Z101),IF(Z101<1.01,181.8181-(181.8181*Z101),\"TBD\")))","v":"NA"},{"$f":"IF(J101=0,\"NA\",ABS(J101-$R$4))","v":"NA"},{"$f":"IF(AB101=\"NA\",\"NA\",IF(J101<1,\"TBD\",IF(AB101<1.01,105-(5*AB101),IF(AB101<2.01,140-(40*AB101),\"TBD\"))))","v":"NA"},{"$f":"IF(K101=0,\"NA\",ABS(K101-$T$4))","v":"NA"},{"$f":"IF(AD101=\"NA\",\"NA\",IF(AD101<1.01,105-(5*AD101),IF(AD101<$BG$7,168-(69*AD101),\"TBD\")))","v":"NA"},{"$f":"IF(BG101=0,\"NA\",BG101)","v":"NA"},{"$f":"IF(Z101=\"NA\",\"NA\",IF(Search!$W$3=2,100,IF(AF101>$BM$7,105,IF(AF101>$BN$7,(($BQ$7*AF101)-$BR$7),IF(AF101>$BO$7,(($BS$7*AF101)-$BT$7),\"TBD\")))))","v":"NA"},{"$f":"IF(OR(AA101=\"TBD\",AC101=\"TBD\",AE101=\"TBD\",AG101=\"TBD\"),\"TBD\",IF(Z101=\"NA\",\"NA\",BN101))","v":"NA"},{"$f":"IF(Z101=\"NA\",\"NA\",IF(BP101=\"TBD\",\"TBD\",astmrnd(BP101,2)))","v":"NA"},{"$f":"IF(N101=0,\"NA\",ABS(N101-$H101))","v":"NA"},{"$f":"IF(AJ101=\"NA\",\"NA\",IF(AJ101<0.46,105-(11.1111*AJ101),IF(AJ101<1.01,181.8181-(181.8181*AJ101),\"TBD\")))","v":"NA"},{"$f":"IF(O101=0,\"NA\",ABS(O101-$R$4))","v":"NA"},{"$f":"IF(AL101=\"NA\",\"NA\",IF(O101<1,\"TBD\",IF(AL101<1.01,105-(5*AL101),IF(AL101<2.01,140-(40*AL101),\"TBD\"))))","v":"NA"},{"$f":"IF(P101=0,\"NA\",ABS(P101-$T$4))","v":"NA"},{"$f":"IF(AN101=\"NA\",\"NA\",IF(AN101<1.01,105-(5*AN101),IF(AN101<$BG$7,168-(69*AN101),\"TBD\")))","v":"NA"},{"$f":"IF(BI101=0,\"NA\",BI101)","v":"NA"},{"$f":"IF(AJ101=\"NA\",\"NA\",IF(Search!$W$3=2,100,IF(AP101>$BM$7,105,IF(AP101>$BN$7,(($BQ$7*AP101)-$BR$7),IF(AP101>$BO$7,(($BS$7*AP101)-$BT$7),\"TBD\")))))","v":"NA"},{"$f":"IF(OR(AK101=\"TBD\",AM101=\"TBD\",AO101=\"TBD\",AQ101=\"TBD\"),\"TBD\",IF(AJ101=\"NA\",\"NA\",BR101))","v":"NA"},{"$f":"IF(AJ101=\"NA\",\"NA\",IF(BT101=\"TBD\",\"TBD\",astmrnd(BT101,2)))","v":"NA"},{"$f":"IF(S101=0,\"NA\",ABS(S101-$H101))","v":"NA"},{"$f":"IF(AT101=\"NA\",\"NA\",IF(AT101<0.46,105-(11.1111*AT101),IF(AT101<1.01,181.8181-(181.8181*AT101),\"TBD\")))","v":"NA"},{"$f":"IF(T101=0,\"NA\",ABS(T101-$R$4))","v":"NA"},{"$f":"IF(AV101=\"NA\",\"NA\",IF(T101<1,\"TBD\",IF(AV101<1.01,105-(5*AV101),IF(AV101<2.01,140-(40*AV101),\"TBD\"))))","v":"NA"},{"$f":"IF(U101=0,\"NA\",ABS(U101-$T$4))","v":"NA"},{"$f":"IF(AX101=\"NA\",\"NA\",IF(AX101<1.01,105-(5*AX101),IF(AX101<$BG$7,168-(69*AX101),\"TBD\")))","v":"NA"},{"$f":"IF(BK101=0,\"NA\",BK101)","v":"NA"},{"$f":"IF(AT101=\"NA\",\"NA\",IF(Search!$W$3=2,100,IF(AZ101>$BM$7,105,IF(AZ101>$BN$7,(($BQ$7*AZ101)-$BR$7),IF(AZ101>$BO$7,(($BS$7*AZ101)-$BT$7),\"TBD\")))))","v":"NA"},{"$f":"IF(OR(AU101=\"TBD\",AW101=\"TBD\",AY101=\"TBD\",BA101=\"TBD\"),\"TBD\",IF(AT101=\"NA\",\"NA\",BV101))","v":"NA"},{"$f":"IF(AT101=\"NA\",\"NA\",IF(BX101=\"TBD\",\"TBD\",astmrnd(BX101,2)))","v":"NA"},null,null,{"$f":"IF(SUM(L101:L104)=0,0,AVERAGE(L101:L104))","v":0},{"$f":"IF(OR(Search!$W$3=4,Search!$W$3=5,BF101=0),0,astmrnd(BF101,2))","v":0},{"$f":"IF(SUM(Q101:Q104)=0,0,AVERAGE(Q101:Q104))","v":0},{"$f":"IF(OR(Search!$W$3=4,Search!$W$3=5,BH101=0),0,astmrnd(BH101,2))","v":0},{"$f":"IF(SUM(V101:V104)=0,0,AVERAGE(V101:V104))","v":0},{"$f":"IF(OR(Search!$W$3=4,Search!$W$3=5,BJ101=0),0,astmrnd(BJ101,2))","v":0},null,{"$f":"(AA101*0.15)+(AC101*0.3)+(AE101*0.15)+(AG101*0.4)","v":{"$error":"#VALUE!"}},{"$f":"IF(OR(AA101=\"TBD\",AC101=\"TBD\",AE101=\"TBD\",AG101=\"TBD\"),\"TBD\",astmrnd(BM101,0))","v":{"$error":"#VALUE!"}},{"$f":"IF(Menu!$C$10>Menu!$C$11,Menu!$C$10,IF(BN101>100,Menu!$C$10,Menu!$C$11))","v":{"$error":"#VALUE!"}},{"$f":"IF(AH101=\"TBD\",\"TBD\",((AH101-100)/100)*BO101*G101)","v":{"$error":"#VALUE!"}},{"$f":"(AK101*0.15)+(AM101*0.3)+(AO101*0.15)+(AQ101*0.4)","v":{"$error":"#VALUE!"}},{"$f":"IF(OR(AK101=\"TBD\",AM101=\"TBD\",AO101=\"TBD\",AQ101=\"TBD\"),\"TBD\",astmrnd(BQ101,0))","v":{"$error":"#VALUE!"}},{"$f":"IF(Menu!$C$10>Menu!$C$11,Menu!$C$10,IF(BR101>100,Menu!$C$10,Menu!$C$11))","v":{"$error":"#VALUE!"}},{"$f":"IF(AR101=\"TBD\",\"TBD\",((AR101-100)/100)*BS101*G101)","v":{"$error":"#VALUE!"}},{"$f":"(AU101*0.15)+(AW101*0.3)+(AY101*0.15)+(BA101*0.4)","v":{"$error":"#VALUE!"}},{"$f":"IF(OR(AU101=\"TBD\",AW101=\"TBD\",AY101=\"TBD\",BA101=\"TBD\"),\"TBD\",astmrnd(BU101,0))","v":{"$error":"#VALUE!"}},{"$f":"IF(Menu!$C$10>Menu!$C$11,Menu!$C$10,IF(BV101>100,Menu!$C$10,Menu!$C$11))","v":{"$error":"#VALUE!"}},{"$f":"IF(BB101=\"TBD\",\"TBD\",((BB101-100)/100)*BW101*G101)","v":{"$error":"#VALUE!"}}]
[null,null,null,null,23]
[null,null,null,null,23]
[null,null,null,null,23]
[null,null,{"$f":"IF(B105=0,\"\",$C$6)","v":""},null,24,null,null,null,null,null,null,null,{"$f":"BG105","v":0},null,null,null,null,{"$f":"BI105","v":0},null,null,null,null,{"$f":"BK105","v":0},null,null,{"$f":"IF(I105=0,\"NA\",ABS(I105-$H105))","v":"NA"},{"$f":"IF(Z105=\"NA\",\"NA\",IF(Z105<0.46,105-(11.1111*Z105),IF(Z105<1.01,181.8181-(181.8181*Z105),\"TBD\")))","v":"NA"},{"$f":"IF(J105=0,\"NA\",ABS(J105-$R$4))","v":"NA"},{"$f":"IF(AB105=\"NA\",\"NA\",IF(J105<1,\"TBD\",IF(AB105<1.01,105-(5*AB105),IF(AB105<2.01,140-(40*AB105),\"TBD\"))))","v":"NA"},{"$f":"IF(K105=0,\"NA\",ABS(K105-$T$4))","v":"NA"},{"$f":"IF(AD105=\"NA\",\"NA\",IF(AD105<1.01,105-(5*AD105),IF(AD105<$BG$7,168-(69*AD105),\"TBD\")))","v":"NA"},{"$f":"IF(BG105=0,\"NA\",BG105)","v":"NA"},{"$f":"IF(Z105=\"NA\",\"NA\",IF(Search!$W$3=2,100,IF(AF105>$BM$7,105,IF(AF105>$BN$7,(($BQ$7*AF105)-$BR$7),IF(AF105>$BO$7,(($BS$7*AF105)-$BT$7),\"TBD\")))))","v":"NA"},{"$f":"IF(OR(AA105=\"TBD\",AC105=\"TBD\",AE105=\"TBD\",AG105=\"TBD\"),\"TBD\",IF(Z105=\"NA\",\"NA\",BN105))","v":"NA"},{"$f":"IF(Z105=\"NA\",\"NA\",IF(BP105=\"TBD\",\"TBD\",astmrnd(BP105,2)))","v":"NA"},{"$f":"IF(N105=0,\"NA\",ABS(N105-$H105))","v":"NA"},{"$f":"IF(AJ105=\"NA\",\"NA\",IF(AJ105<0.46,105-(11.1111*AJ105),IF(AJ105<1.01,181.8181-(181.8181*AJ105),\"TBD\")))","v":"NA"},{"$f":"IF(O105=0,\"NA\",ABS(O105-$R$4))","v":"NA"},{"$f":"IF(AL105=\"NA\",\"NA\",IF(O105<1,\"TBD\",IF(AL105<1.01,105-(5*AL105),IF(AL105<2.01,140-(40*AL105),\"TBD\"))))","v":"NA"},{"$f":"IF(P105=0,\"NA\",ABS(P105-$T$4))","v":"NA"},{"$f":"IF(AN105=\"NA\",\"NA\",IF(AN105<1.01,105-(5*AN105),IF(AN105<$BG$7,168-(69*AN105),\"TBD\")))","v":"NA"},{"$f":"IF(BI105=0,\"NA\",BI105)","v":"NA"},{"$f":"IF(AJ105=\"NA\",\"NA\",IF(Search!$W$3=2,100,IF(AP105>$BM$7,105,IF(AP105>$BN$7,(($BQ$7*AP105)-$BR$7),IF(AP105>$BO$7,(($BS$7*AP105)-$BT$7),\"TBD\")))))","v":"NA"},{"$f":"IF(OR(AK105=\"TBD\",AM105=\"TBD\",AO105=\"TBD\",AQ105=\"TBD\"),\"TBD\",IF(AJ105=\"NA\",\"NA\",BR105))","v":"NA"},{"$f":"IF(AJ105=\"NA\",\"NA\",IF(BT105=\"TBD\",\"TBD\",astmrnd(BT105,2)))","v":"NA"},{"$f":"IF(S105=0,\"NA\",ABS(S105-$H105))","v":"NA"},{"$f":"IF(AT105=\"NA\",\"NA\",IF(AT105<0.46,105-(11.1111*AT105),IF(AT105<1.01,181.8181-(181.8181*AT105),\"TBD\")))","v":"NA"},{"$f":"IF(T105=0,\"NA\",ABS(T105-$R$4))","v":"NA"},{"$f":"IF(AV105=\"NA\",\"NA\",IF(T105<1,\"TBD\",IF(AV105<1.01,105-(5*AV105),IF(AV105<2.01,140-(40*AV105),\"TBD\"))))","v":"NA"},{"$f":"IF(U105=0,\"NA\",ABS(U105-$T$4))","v":"NA"},{"$f":"IF(AX105=\"NA\",\"NA\",IF(AX105<1.01,105-(5*AX105),IF(AX105<$BG$7,168-(69*AX105),\"TBD\")))","v":"NA"},{"$f":"IF(BK105=0,\"NA\",BK105)","v":"NA"},{"$f":"IF(AT105=\"NA\",\"NA\",IF(Search!$W$3=2,100,IF(AZ105>$BM$7,105,IF(AZ105>$BN$7,(($BQ$7*AZ105)-$BR$7),IF(AZ105>$BO$7,(($BS$7*AZ105)-$BT$7),\"TBD\")))))","v":"NA"},{"$f":"IF(OR(AU105=\"TBD\",AW105=\"TBD\",AY105=\"TBD\",BA105=\"TBD\"),\"TBD\",IF(AT105=\"NA\",\"NA\",BV105))","v":"NA"},{"$f":"IF(AT105=\"NA\",\"NA\",IF(BX105=\"TBD\",\"TBD\",astmrnd(BX105,2)))","v":"NA"},null,null,{"$f":"IF(SUM(L105:L108)=0,0,AVERAGE(L105:L108))","v":0},{"$f":"IF(OR(Search!$W$3=4,Search!$W$3=5,BF105=0),0,astmrnd(BF105,2))","v":0},{"$f":"IF(SUM(Q105:Q108)=0,0,AVERAGE(Q105:Q108))","v":0},{"$f":"IF(OR(Search!$W$3=4,Search!$W$3=5,BH105=0),0,astmrnd(BH105,2))","v":0},{"$f":"IF(SUM(V105:V108)=0,0,AVERAGE(V105:V108))","v":0},{"$f":"IF(OR(Search!$W$3=4,Search!$W$3=5,BJ105=0),0,astmrnd(BJ105,2))","v":0},null,{"$f":"(AA105*0.15)+(AC105*0.3)+(AE105*0.15)+(AG105*0.4)","v":{"$error":"#VALUE!"}},{"$f":"IF(OR(AA105=\"TBD\",AC105=\"TBD\",AE105=\"TBD\",AG105=\"TBD\"),\"TBD\",astmrnd(BM105,0))","v":{"$error":"#VALUE!"}},{"$f":"IF(Menu!$C$10>Menu!$C$11,Menu!$C$10,IF(BN105>100,Menu!$C$10,Menu!$C$11))","v":{"$error":"#VALUE!"}},{"$f":"IF(AH105=\"TBD\",\"TBD\",((AH105-100)/100)*BO105*G105)","v":{"$error":"#VALUE!"}},{"$f":"(AK105*0.15)+(AM105*0.3)+(AO105*0.15)+(AQ105*0.4)","v":{"$error":"#VALUE!"}},{"$f":"IF(OR(AK105=\"TBD\",AM105=\"TBD\",AO105=\"TBD\",AQ105=\"TBD\"),\"TBD\",astmrnd(BQ105,0))","v":{"$error":"#VALUE!"}},{"$f":"IF(Menu!$C$10>Menu!$C$11,Menu!$C$10,IF(BR105>100,Menu!$C$10,Menu!$C$11))","v":{"$error":"#VALUE!"}},{"$f":"IF(AR105=\"TBD\",\"TBD\",((AR105-100)/100)*BS105*G105)","v":{"$error":"#VALUE!"}},{"$f":"(AU105*0.15)+(AW105*0.3)+(AY105*0.15)+(BA105*0.4)","v":{"$error":"#VALUE!"}},{"$f":"IF(OR(AU105=\"TBD\",AW105=\"TBD\",AY105=\"TBD\",BA105=\"TBD\"),\"TBD\",astmrnd(BU105,0))","v":{"$error":"#VALUE!"}},{"$f":"IF(Menu!$C$10>Menu!$C$11,Menu!$C$10,IF(BV105>100,Menu!$C$10,Menu!$C$11))","v":{"$error":"#VALUE!"}},{"$f":"IF(BB105=\"TBD\",\"TBD\",((BB105-100)/100)*BW105*G105)","v":{"$error":"#VALUE!"}}]
[null,null,null,null,24]
[null,null,null,null,24]
[null,null,null,null,24]
[null,null,{"$f":"IF(B109=0,\"\",$C$6)","v":""},null,25,null,null,null,null,null,null,null,{"$f":"BG109","v":0},null,null,null,null,{"$f":"BI109","v":0},null,null,null,null,{"$f":"BK109","v":0},null,null,{"$f":"IF(I109=0,\"NA\",ABS(I109-$H109))","v":"NA"},{"$f":"IF(Z109=\"NA\",\"NA\",IF(Z109<0.46,105-(11.1111*Z109),IF(Z109<1.01,181.8181-(181.8181*Z109),\"TBD\")))","v":"NA"},{"$f":"IF(J109=0,\"NA\",ABS(J109-$R$4))","v":"NA"},{"$f":"IF(AB109=\"NA\",\"NA\",IF(J109<1,\"TBD\",IF(AB109<1.01,105-(5*AB109),IF(AB109<2.01,140-(40*AB109),\"TBD\"))))","v":"NA"},{"$f":"IF(K109=0,\"NA\",ABS(K109-$T$4))","v":"NA"},{"$f":"IF(AD109=\"NA\",\"NA\",IF(AD109<1.01,105-(5*AD109),IF(AD109<$BG$7,168-(69*AD109),\"TBD\")))","v":"NA"},{"$f":"IF(BG109=0,\"NA\",BG109)","v":"NA"},{"$f":"IF(Z109=\"NA\",\"NA\",IF(Search!$W$3=2,100,IF(AF109>$BM$7,105,IF(AF109>$BN$7,(($BQ$7*AF109)-$BR$7),IF(AF109>$BO$7,(($BS$7*AF109)-$BT$7),\"TBD\")))))","v":"NA"},{"$f":"IF(OR(AA109=\"TBD\",AC109=\"TBD\",AE109=\"TBD\",AG109=\"TBD\"),\"TBD\",IF(Z109=\"NA\",\"NA\",BN109))","v":"NA"},{"$f":"IF(Z109=\"NA\",\"NA\",IF(BP109=\"TBD\",\"TBD\",astmrnd(BP109,2)))","v":"NA"},{"$f":"IF(N109=0,\"NA\",ABS(N109-$H109))","v":"NA"},{"$f":"IF(AJ109=\"NA\",\"NA\",IF(AJ109<0.46,105-(11.1111*AJ109),IF(AJ109<1.01,181.8181-(181.8181*AJ109),\"TBD\")))","v":"NA"},{"$f":"IF(O109=0,\"NA\",ABS(O109-$R$4))","v":"NA"},{"$f":"IF(AL109=\"NA\",\"NA\",IF(O109<1,\"TBD\",IF(AL109<1.01,105-(5*AL109),IF(AL109<2.01,140-(40*AL109),\"TBD\"))))","v":"NA"},{"$f":"IF(P109=0,\"NA\",ABS(P109-$T$4))","v":"NA"},{"$f":"IF(AN109=\"NA\",\"NA\",IF(AN109<1.01,105-(5*AN109),IF(AN109<$BG$7,168-(69*AN109),\"TBD\")))","v":"NA"},{"$f":"IF(BI109=0,\"NA\",BI109)","v":"NA"},{"$f":"IF(AJ109=\"NA\",\"NA\",IF(Search!$W$3=2,100,IF(AP109>$BM$7,105,IF(AP109>$BN$7,(($BQ$7*AP109)-$BR$7),IF(AP109>$BO$7,(($BS$7*AP109)-$BT$7),\"TBD\")))))","v":"NA"},{"$f":"IF(OR(AK109=\"TBD\",AM109=\"TBD\",AO109=\"TBD\",AQ109=\"TBD\"),\"TBD\",IF(AJ109=\"NA\",\"NA\",BR109))","v":"NA"},{"$f":"IF(AJ109=\"NA\",\"NA\",IF(BT109=\"TBD\",\"TBD\",astmrnd(BT109,2)))","v":"NA"},{"$f":"IF(S109=0,\"NA\",ABS(S109-$H109))","v":"NA"},{"$f":"IF(AT109=\"NA\",\"NA\",IF(AT109<0.46,105-(11.1111*AT109),IF(AT109<1.01,181.8181-(181.8181*AT109),\"TBD\")))","v":"NA"},{"$f":"IF(T109=0,\"NA\",ABS(T109-$R$4))","v":"NA"},{"$f":"IF(AV109=\"NA\",\"NA\",IF(T109<1,\"TBD\",IF(AV109<1.01,105-(5*AV109),IF(AV109<2.01,140-(40*AV109),\"TBD\"))))","v":"NA"},{"$f":"IF(U109=0,\"NA\",ABS(U109-$T$4))","v":"NA"},{"$f":"IF(AX109=\"NA\",\"NA\",IF(AX109<1.01,105-(5*AX109),IF(AX109<$BG$7,168-(69*AX109),\"TBD\")))","v":"NA"},{"$f":"IF(BK109=0,\"NA\",BK109)","v":"NA"},{"$f":"IF(AT109=\"NA\",\"NA\",IF(Search!$W$3=2,100,IF(AZ109>$BM$7,105,IF(AZ109>$BN$7,(($BQ$7*AZ109)-$BR$7),IF(AZ109>$BO$7,(($BS$7*AZ109)-$BT$7),\"TBD\")))))","v":"NA"},{"$f":"IF(OR(AU109=\"TBD\",AW109=\"TBD\",AY109=\"TBD\",BA109=\"TBD\"),\"TBD\",IF(AT109=\"NA\",\"NA\",BV109))","v":"NA"},{"$f":"IF(AT109=\"NA\",\"NA\",IF(BX109=\"TBD\",\"TBD\",astmrnd(BX109,2)))","v":"NA"},null,null,{"$f":"IF(SUM(L109:L112)=0,0,AVERAGE(L109:L112))","v":0},{"$f":"IF(OR(Search!$W$3=4,Search!$W$3=5,BF109=0),0,astmrnd(BF109,2))","v":0},{"$f":"IF(SUM(Q109:Q112)=0,0,AVERAGE(Q109:Q112))","v":0},{"$f":"IF(OR(Search!$W$3=4,Search!$W$3=5,BH109=0),0,astmrnd(BH109,2))","v":0},{"$f":"IF(SUM(V109:V112)=0,0,AVERAGE(V109:V112))","v":0},{"$f":"IF(OR(Search!$W$3=4,Search!$W$3=5,BJ109=0),0,astmrnd(BJ109,2))","v":0},null,{"$f":"(AA109*0.15)+(AC109*0.3)+(AE109*0.15)+(AG109*0.4)","v":{"$error":"#VALUE!"}},{"$f":"IF(OR(AA109=\"TBD\",AC109=\"TBD\",AE109=\"TBD\",AG109=\"TBD\"),\"TBD\",astmrnd(BM109,0))","v":{"$error":"#VALUE!"}},{"$f":"IF(Menu!$C$10>Menu!$C$11,Menu!$C$10,IF(BN109>100,Menu!$C$10,Menu!$C$11))","v":{"$error":"#VALUE!"}},{"$f":"IF(AH109=\"TBD\",\"TBD\",((AH109-100)/100)*BO109*G109)","v":{"$error":"#VALUE!"}},{"$f":"(AK109*0.15)+(AM109*0.3)+(AO109*0.15)+(AQ109*0.4)","v":{"$error":"#VALUE!"}},{"$f":"IF(OR(AK109=\"TBD\",AM109=\"TBD\",AO109=\"TBD\",AQ109=\"TBD\"),\"TBD\",astmrnd(BQ109,0))","v":{"$error":"#VALUE!"}},{"$f":"IF(Menu!$C$10>Menu!$C$11,Menu!$C$10,IF(BR109>100,Menu!$C$10,Menu!$C$11))","v":{"$error":"#VALUE!"}},{"$f":"IF(AR109=\"TBD\",\"TBD\",((AR109-100)/100)*BS109*G109)","v":{"$error":"#VALUE!"}},{"$f":"(AU109*0.15)+(AW109*0.3)+(AY109*0.15)+(BA109*0.4)","v":{"$error":"#VALUE!"}},{"$f":"IF(OR(AU109=\"TBD\",AW109=\"TBD\",AY109=\"TBD\",BA109=\"TBD\"),\"TBD\",astmrnd(BU109,0))","v":{"$error":"#VALUE!"}},{"$f":"IF(Menu!$C$10>Menu!$C$11,Menu!$C$10,IF(BV109>100,Menu!$C$10,Menu!$C$11))","v":{"$error":"#VALUE!"}},{"$f":"IF(BB109=\"TBD\",\"TBD\",((BB109-100)/100)*BW109*G109)","v":{"$error":"#VALUE!"}}]
[null,null,null,null,25]
[null,null,null,null,25]
[null,null,null,null,25]
[null,null,{"$f":"IF(B113=0,\"\",$C$6)","v":""},null,26,null,null,null,null,null,null,null,{"$f":"BG113","v":0},null,null,null,null,{"$f":"BI113","v":0},null,null,null,null,{"$f":"BK113","v":0},null,null,{"$f":"IF(I113=0,\"NA\",ABS(I113-$H113))","v":"NA"},{"$f":"IF(Z113=\"NA\",\"NA\",IF(Z113<0.46,105-(11.1111*Z113),IF(Z113<1.01,181.8181-(181.8181*Z113),\"TBD\")))","v":"NA"},{"$f":"IF(J113=0,\"NA\",ABS(J113-$R$4))","v":"NA"},{"$f":"IF(AB113=\"NA\",\"NA\",IF(J113<1,\"TBD\",IF(AB113<1.01,105-(5*AB113),IF(AB113<2.01,140-(40*AB113),\"TBD\"))))","v":"NA"},{"$f":"IF(K113=0,\"NA\",ABS(K113-$T$4))","v":"NA"},{"$f":"IF(AD113=\"NA\",\"NA\",IF(AD113<1.01,105-(5*AD113),IF(AD113<$BG$7,168-(69*AD113),\"TBD\")))","v":"NA"},{"$f":"IF(BG113=0,\"NA\",BG113)","v":"NA"},{"$f":"IF(Z113=\"NA\",\"NA\",IF(Search!$W$3=2,100,IF(AF113>$BM$7,105,IF(AF113>$BN$7,(($BQ$7*AF113)-$BR$7),IF(AF113>$BO$7,(($BS$7*AF113)-$BT$7),\"TBD\")))))","v":"NA"},{"$f":"IF(OR(AA113=\"TBD\",AC113=\"TBD\",AE113=\"TBD\",AG113=\"TBD\"),\"TBD\",IF(Z113=\"NA\",\"NA\",BN113))","v":"NA"},{"$f":"IF(Z113=\"NA\",\"NA\",IF(BP113=\"TBD\",\"TBD\",astmrnd(BP113,2)))","v":"NA"},{"$f":"IF(N113=0,\"NA\",ABS(N113-$H113))","v":"NA"},{"$f":"IF(AJ113=\"NA\",\"NA\",IF(AJ113<0.46,105-(11.1111*AJ113),IF(AJ113<1.01,181.8181-(181.8181*AJ113),\"TBD\")))","v":"NA"},{"$f":"IF(O113=0,\"NA\",ABS(O113-$R$4))","v":"NA"},{"$f":"IF(AL113=\"NA\",\"NA\",IF(O113<1,\"TBD\",IF(AL113<1.01,105-(5*AL113),IF(AL113<2.01,140-(40*AL113),\"TBD\"))))","v":"NA"},{"$f":"IF(P113=0,\"NA\",ABS(P113-$T$4))","v":"NA"},{"$f":"IF(AN113=\"NA\",\"NA\",IF(AN113<1.01,105-(5*AN113),IF(AN113<$BG$7,168-(69*AN113),\"TBD\")))","v":"NA"},{"$f":"IF(BI113=0,\"NA\",BI113)","v":"NA"},{"$f":"IF(AJ113=\"NA\",\"NA\",IF(Search!$W$3=2,100,IF(AP113>$BM$7,105,IF(AP113>$BN$7,(($BQ$7*AP113)-$BR$7),IF(AP113>$BO$7,(($BS$7*AP113)-$BT$7),\"TBD\")))))","v":"NA"},{"$f":"IF(OR(AK113=\"TBD\",AM113=\"TBD\",AO113=\"TBD\",AQ113=\"TBD\"),\"TBD\",IF(AJ113=\"NA\",\"NA\",BR113))","v":"NA"},{"$f":"IF(AJ113=\"NA\",\"NA\",IF(BT113=\"TBD\",\"TBD\",astmrnd(BT113,2)))","v":"NA"},{"$f":"IF(S113=0,\"NA\",ABS(S113-$H113))","v":"NA"},{"$f":"IF(AT113=\"NA\",\"NA\",IF(AT113<0.46,105-(11.1111*AT113),IF(AT113<1.01,181.8181-(181.8181*AT113),\"TBD\")))","v":"NA"},{"$f":"IF(T113=0,\"NA\",ABS(T113-$R$4))","v":"NA"},{"$f":"IF(AV113=\"NA\",\"NA\",IF(T113<1,\"TBD\",IF(AV113<1.01,105-(5*AV113),IF(AV113<2.01,140-(40*AV113),\"TBD\"))))","v":"NA"},{"$f":"IF(U113=0,\"NA\",ABS(U113-$T$4))","v":"NA"},{"$f":"IF(AX113=\"NA\",\"NA\",IF(AX113<1.01,105-(5*AX113),IF(AX113<$BG$7,168-(69*AX113),\"TBD\")))","v":"NA"},{"$f":"IF(BK113=0,\"NA\",BK113)","v":"NA"},{"$f":"IF(AT113=\"NA\",\"NA\",IF(Search!$W$3=2,100,IF(AZ113>$BM$7,105,IF(AZ113>$BN$7,(($BQ$7*AZ113)-$BR$7),IF(AZ113>$BO$7,(($BS$7*AZ113)-$BT$7),\"TBD\")))))","v":"NA"},{"$f":"IF(OR(AU113=\"TBD\",AW113=\"TBD\",AY113=\"TBD\",BA113=\"TBD\"),\"TBD\",IF(AT113=\"NA\",\"NA\",BV113))","v":"NA"},{"$f":"IF(AT113=\"NA\",\"NA\",IF(BX113=\"TBD\",\"TBD\",astmrnd(BX113,2)))","v":"NA"},null,null,{"$f":"IF(SUM(L113:L116)=0,0,AVERAGE(L113:L116))","v":0},{"$f":"IF(OR(Search!$W$3=4,Search!$W$3=5,BF113=0),0,astmrnd(BF113,2))","v":0},{"$f":"IF(SUM(Q113:Q116)=0,0,AVERAGE(Q113:Q116))","v":0},{"$f":"IF(OR(Search!$W$3=4,Search!$W$3=5,BH113=0),0,astmrnd(BH113,2))","v":0},{"$f":"IF(SUM(V113:V116)=0,0,AVERAGE(V113:V116))","v":0},{"$f":"IF(OR(Search!$W$3=4,Search!$W$3=5,BJ113=0),0,astmrnd(BJ113,2))","v":0},null,{"$f":"(AA113*0.15)+(AC113*0.3)+(AE113*0.15)+(AG113*0.4)","v":{"$error":"#VALUE!"}},{"$f":"IF(OR(AA113=\"TBD\",AC113=\"TBD\",AE113=\"TBD\",AG113=\"TBD\"),\"TBD\",astmrnd(BM113,0))","v":{"$error":"#VALUE!"}},{"$f":"IF(Menu!$C$10>Menu!$C$11,Menu!$C$10,IF(BN113>100,Menu!$C$10,Menu!$C$11))","v":{"$error":"#VALUE!"}},{"$f":"IF(AH113=\"TBD\",\"TBD\",((AH113-100)/100)*BO113*G113)","v":{"$error":"#VALUE!"}},{"$f":"(AK113*0.15)+(AM113*0.3)+(AO113*0.15)+(AQ113*0.4)","v":{"$error":"#VALUE!"}},{"$f":"IF(OR(AK113=\"TBD\",AM113=\"TBD\",AO113=\"TBD\",AQ113=\"TBD\"),\"TBD\",astmrnd(BQ113,0))","v":{"$error":"#VALUE!"}},{"$f":"IF(Menu!$C$10>Menu!$C$11,Menu!$C$10,IF(BR113>100,Menu!$C$10,Menu!$C$11))","v":{"$error":"#VALUE!"}},{"$f":"IF(AR113=\"TBD\",\"TBD\",((AR113-100)/100)*BS113*G113)","v":{"$error":"#VALUE!"}},{"$f":"(AU113*0.15)+(AW113*0.3)+(AY113*0.15)+(BA113*0.4)","v":{"$error":"#VALUE!"}},{"$f":"IF(OR(AU113=\"TBD\",AW113=\"TBD\",AY113=\"TBD\",BA113=\"TBD\"),\"TBD\",astmrnd(BU113,0))","v":{"$error":"#VALUE!"}},{"$f":"IF(Menu!$C$10>Menu!$C$11,Menu!$C$10,IF(BV113>100,Menu!$C$10,Menu!$C$11))","v":{"$error":"#VALUE!"}},{"$f":"IF(BB113=\"TBD\",\"TBD\",((BB113-100)/100)*BW113*G113)","v":{"$error":"#VALUE!"}}]
[null,null,null,null,26]
[null,null,null,null,26]
[null,null,null,null,26]
[null,null,{"$f":"IF(B117=0,\"\",$C$6)","v":""},null,27,null,null,null,null,null,null,null,{"$f":"BG117","v":0},null,null,null,null,{"$f":"BI117","v":0},null,null,null,null,{"$f":"BK117","v":0},null,null,{"$f":"IF(I117=0,\"NA\",ABS(I117-$H117))","v":"NA"},{"$f":"IF(Z117=\"NA\",\"NA\",IF(Z117<0.46,105-(11.1111*Z117),IF(Z117<1.01,181.8181-(181.8181*Z117),\"TBD\")))","v":"NA"},{"$f":"IF(J117=0,\"NA\",ABS(J117-$R$4))","v":"NA"},{"$f":"IF(AB117=\"NA\",\"NA\",IF(J117<1,\"TBD\",IF(AB117<1.01,105-(5*AB117),IF(AB117<2.01,140-(40*AB117),\"TBD\"))))","v":"NA"},{"$f":"IF(K117=0,\"NA\",ABS(K117-$T$4))","v":"NA"},{"$f":"IF(AD117=\"NA\",\"NA\",IF(AD117<1.01,105-(5*AD117),IF(AD117<$BG$7,168-(69*AD117),\"TBD\")))","v":"NA"},{"$f":"IF(BG117=0,\"NA\",BG117)","v":"NA"},{"$f":"IF(Z117=\"NA\",\"NA\",IF(Search!$W$3=2,100,IF(AF117>$BM$7,105,IF(AF117>$BN$7,(($BQ$7*AF117)-$BR$7),IF(AF117>$BO$7,(($BS$7*AF117)-$BT$7),\"TBD\")))))","v":"NA"},{"$f":"IF(OR(AA117=\"TBD\",AC117=\"TBD\",AE117=\"TBD\",AG117=\"TBD\"),\"TBD\",IF(Z117=\"NA\",\"NA\",BN117))","v":"NA"},{"$f":"IF(Z117=\"NA\",\"NA\",IF(BP117=\"TBD\",\"TBD\",astmrnd(BP117,2)))","v":"NA"},{"$f":"IF(N117=0,\"NA\",ABS(N117-$H117))","v":"NA"},{"$f":"IF(AJ117=\"NA\",\"NA\",IF(AJ117<0.46,105-(11.1111*AJ117),IF(AJ117<1.01,181.8181-(181.8181*AJ117),\"TBD\")))","v":"NA"},{"$f":"IF(O117=0,\"NA\",ABS(O117-$R$4))","v":"NA"},{"$f":"IF(AL117=\"NA\",\"NA\",IF(O117<1,\"TBD\",IF(AL117<1.01,105-(5*AL117),IF(AL117<2.01,140-(40*AL117),\"TBD\"))))","v":"NA"},{"$f":"IF(P117=0,\"NA\",ABS(P117-$T$4))","v":"NA"},{"$f":"IF(AN117=\"NA\",\"NA\",IF(AN117<1.01,105-(5*AN117),IF(AN117<$BG$7,168-(69*AN117),\"TBD\")))","v":"NA"},{"$f":"IF(BI117=0,\"NA\",BI117)","v":"NA"},{"$f":"IF(AJ117=\"NA\",\"NA\",IF(Search!$W$3=2,100,IF(AP117>$BM$7,105,IF(AP117>$BN$7,(($BQ$7*AP117)-$BR$7),IF(AP117>$BO$7,(($BS$7*AP117)-$BT$7),\"TBD\")))))","v":"NA"},{"$f":"IF(OR(AK117=\"TBD\",AM117=\"TBD\",AO117=\"TBD\",AQ117=\"TBD\"),\"TBD\",IF(AJ117=\"NA\",\"NA\",BR117))","v":"NA"},{"$f":"IF(AJ117=\"NA\",\"NA\",IF(BT117=\"TBD\",\"TBD\",astmrnd(BT117,2)))","v":"NA"},{"$f":"IF(S117=0,\"NA\",ABS(S117-$H117))","v":"NA"},{"$f":"IF(AT117=\"NA\",\"NA\",IF(AT117<0.46,105-(11.1111*AT117),IF(AT117<1.01,181.8181-(181.8181*AT117),\"TBD\")))","v":"NA"},{"$f":"IF(T117=0,\"NA\",ABS(T117-$R$4))","v":"NA"},{"$f":"IF(AV117=\"NA\",\"NA\",IF(T117<1,\"TBD\",IF(AV117<1.01,105-(5*AV117),IF(AV117<2.01,140-(40*AV117),\"TBD\"))))","v":"NA"},{"$f":"IF(U117=0,\"NA\",ABS(U117-$T$4))","v":"NA"},{"$f":"IF(AX117=\"NA\",\"NA\",IF(AX117<1.01,105-(5*AX117),IF(AX117<$BG$7,168-(69*AX117),\"TBD\")))","v":"NA"},{"$f":"IF(BK117=0,\"NA\",BK117)","v":"NA"},{"$f":"IF(AT117=\"NA\",\"NA\",IF(Search!$W$3=2,100,IF(AZ117>$BM$7,105,IF(AZ117>$BN$7,(($BQ$7*AZ117)-$BR$7),IF(AZ117>$BO$7,(($BS$7*AZ117)-$BT$7),\"TBD\")))))","v":"NA"},{"$f":"IF(OR(AU117=\"TBD\",AW117=\"TBD\",AY117=\"TBD\",BA117=\"TBD\"),\"TBD\",IF(AT117=\"NA\",\"NA\",BV117))","v":"NA"},{"$f":"IF(AT117=\"NA\",\"NA\",IF(BX117=\"TBD\",\"TBD\",astmrnd(BX117,2)))","v":"NA"},null,null,{"$f":"IF(SUM(L117:L120)=0,0,AVERAGE(L117:L120))","v":0},{"$f":"IF(OR(Search!$W$3=4,Search!$W$3=5,BF117=0),0,astmrnd(BF117,2))","v":0},{"$f":"IF(SUM(Q117:Q120)=0,0,AVERAGE(Q117:Q120))","v":0},{"$f":"IF(OR(Search!$W$3=4,Search!$W$3=5,BH117=0),0,astmrnd(BH117,2))","v":0},{"$f":"IF(SUM(V117:V120)=0,0,AVERAGE(V117:V120))","v":0},{"$f":"IF(OR(Search!$W$3=4,Search!$W$3=5,BJ117=0),0,astmrnd(BJ117,2))","v":0},null,{"$f":"(AA117*0.15)+(AC117*0.3)+(AE117*0.15)+(AG117*0.4)","v":{"$error":"#VALUE!"}},{"$f":"IF(OR(AA117=\"TBD\",AC117=\"TBD\",AE117=\"TBD\",AG117=\"TBD\"),\"TBD\",astmrnd(BM117,0))","v":{"$error":"#VALUE!"}},{"$f":"IF(Menu!$C$10>Menu!$C$11,Menu!$C$10,IF(BN117>100,Menu!$C$10,Menu!$C$11))","v":{"$error":"#VALUE!"}},{"$f":"IF(AH117=\"TBD\",\"TBD\",((AH117-100)/100)*BO117*G117)","v":{"$error":"#VALUE!"}},{"$f":"(AK117*0.15)+(AM117*0.3)+(AO117*0.15)+(AQ117*0.4)","v":{"$error":"#VALUE!"}},{"$f":"IF(OR(AK117=\"TBD\",AM117=\"TBD\",AO117=\"TBD\",AQ117=\"TBD\"),\"TBD\",astmrnd(BQ117,0))","v":{"$error":"#VALUE!"}},{"$f":"IF(Menu!$C$10>Menu!$C$11,Menu!$C$10,IF(BR117>100,Menu!$C$10,Menu!$C$11))","v":{"$error":"#VALUE!"}},{"$f":"IF(AR117=\"TBD\",\"TBD\",((AR117-100)/100)*BS117*G117)","v":{"$error":"#VALUE!"}},{"$f":"(AU117*0.15)+(AW117*0.3)+(AY117*0.15)+(BA117*0.4)","v":{"$error":"#VALUE!"}},{"$f":"IF(OR(AU117=\"TBD\",AW117=\"TBD\",AY117=\"TBD\",BA117=\"TBD\"),\"TBD\",astmrnd(BU117,0))","v":{"$error":"#VALUE!"}},{"$f":"IF(Menu!$C$10>Menu!$C$11,Menu!$C$10,IF(BV117>100,Menu!$C$10,Menu!$C$11))","v":{"$error":"#VALUE!"}},{"$f":"IF(BB117=\"TBD\",\"TBD\",((BB117-100)/100)*BW117*G117)","v":{"$error":"#VALUE!"}}]
[null,null,null,null,27]
[null,null,null,null,27]
[null,null,null,null,27]
[null,null,{"$f":"IF(B121=0,\"\",$C$6)","v":""},null,28,null,null,null,null,null,null,null,{"$f":"BG121","v":0},null,null,null,null,{"$f":"BI121","v":0},null,null,null,null,{"$f":"BK121","v":0},null,null,{"$f":"IF(I121=0,\"NA\",ABS(I121-$H121))","v":"NA"},{"$f":"IF(Z121=\"NA\",\"NA\",IF(Z121<0.46,105-(11.1111*Z121),IF(Z121<1.01,181.8181-(181.8181*Z121),\"TBD\")))","v":"NA"},{"$f":"IF(J121=0,\"NA\",ABS(J121-$R$4))","v":"NA"},{"$f":"IF(AB121=\"NA\",\"NA\",IF(J121<1,\"TBD\",IF(AB121<1.01,105-(5*AB121),IF(AB121<2.01,140-(40*AB121),\"TBD\"))))","v":"NA"},{"$f":"IF(K121=0,\"NA\",ABS(K121-$T$4))","v":"NA"},{"$f":"IF(AD121=\"NA\",\"NA\",IF(AD121<1.01,105-(5*AD121),IF(AD121<$BG$7,168-(69*AD121),\"TBD\")))","v":"NA"},{"$f":"IF(BG121=0,\"NA\",BG121)","v":"NA"},{"$f":"IF(Z121=\"NA\",\"NA\",IF(Search!$W$3=2,100,IF(AF121>$BM$7,105,IF(AF121>$BN$7,(($BQ$7*AF121)-$BR$7),IF(AF121>$BO$7,(($BS$7*AF121)-$BT$7),\"TBD\")))))","v":"NA"},{"$f":"IF(OR(AA121=\"TBD\",AC121=\"TBD\",AE121=\"TBD\",AG121=\"TBD\"),\"TBD\",IF(Z121=\"NA\",\"NA\",BN121))","v":"NA"},{"$f":"IF(Z121=\"NA\",\"NA\",IF(BP121=\"TBD\",\"TBD\",astmrnd(BP121,2)))","v":"NA"},{"$f":"IF(N121=0,\"NA\",ABS(N121-$H121))","v":"NA"},{"$f":"IF(AJ121=\"NA\",\"NA\",IF(AJ121<0.46,105-(11.1111*AJ121),IF(AJ121<1.01,181.8181-(181.8181*AJ121),\"TBD\")))","v":"NA"},{"$f":"IF(O121=0,\"NA\",ABS(O121-$R$4))","v":"NA"},{"$f":"IF(AL121=\"NA\",\"NA\",IF(O121<1,\"TBD\",IF(AL121<1.01,105-(5*AL121),IF(AL121<2.01,140-(40*AL121),\"TBD\"))))","v":"NA"},{"$f":"IF(P121=0,\"NA\",ABS(P121-$T$4))","v":"NA"},{"$f":"IF(AN121=\"NA\",\"NA\",IF(AN121<1.01,105-(5*AN121),IF(AN121<$BG$7,168-(69*AN121),\"TBD\")))","v":"NA"},{"$f":"IF(BI121=0,\"NA\",BI121)","v":"NA"},{"$f":"IF(AJ121=\"NA\",\"NA\",IF(Search!$W$3=2,100,IF(AP121>$BM$7,105,IF(AP121>$BN$7,(($BQ$7*AP121)-$BR$7),IF(AP121>$BO$7,(($BS$7*AP121)-$BT$7),\"TBD\")))))","v":"NA"},{"$f":"IF(OR(AK121=\"TBD\",AM121=\"TBD\",AO121=\"TBD\",AQ121=\"TBD\"),\"TBD\",IF(AJ121=\"NA\",\"NA\",BR121))","v":"NA"},{"$f":"IF(AJ121=\"NA\",\"NA\",IF(BT121=\"TBD\",\"TBD\",astmrnd(BT121,2)))","v":"NA"},{"$f":"IF(S121=0,\"NA\",ABS(S121-$H121))","v":"NA"},{"$f":"IF(AT121=\"NA\",\"NA\",IF(AT121<0.46,105-(11.1111*AT121),IF(AT121<1.01,181.8181-(181.8181*AT121),\"TBD\")))","v":"NA"},{"$f":"IF(T121=0,\"NA\",ABS(T121-$R$4))","v":"NA"},{"$f":"IF(AV121=\"NA\",\"NA\",IF(T121<1,\"TBD\",IF(AV121<1.01,105-(5*AV121),IF(AV121<2.01,140-(40*AV121),\"TBD\"))))","v":"NA"},{"$f":"IF(U121=0,\"NA\",ABS(U121-$T$4))","v":"NA"},{"$f":"IF(AX121=\"NA\",\"NA\",IF(AX121<1.01,105-(5*AX121),IF(AX121<$BG$7,168-(69*AX121),\"TBD\")))","v":"NA"},{"$f":"IF(BK121=0,\"NA\",BK121)","v":"NA"},{"$f":"IF(AT121=\"NA\",\"NA\",IF(Search!$W$3=2,100,IF(AZ121>$BM$7,105,IF(AZ121>$BN$7,(($BQ$7*AZ121)-$BR$7),IF(AZ121>$BO$7,(($BS$7*AZ121)-$BT$7),\"TBD\")))))","v":"NA"},{"$f":"IF(OR(AU121=\"TBD\",AW121=\"TBD\",AY121=\"TBD\",BA121=\"TBD\"),\"TBD\",IF(AT121=\"NA\",\"NA\",BV121))","v":"NA"},{"$f":"IF(AT121=\"NA\",\"NA\",IF(BX121=\"TBD\",\"TBD\",astmrnd(BX121,2)))","v":"NA"},null,null,{"$f":"IF(SUM(L121:L124)=0,0,AVERAGE(L121:L124))","v":0},{"$f":"IF(OR(Search!$W$3=4,Search!$W$3=5,BF121=0),0,astmrnd(BF121,2))","v":0},{"$f":"IF(SUM(Q121:Q124)=0,0,AVERAGE(Q121:Q124))","v":0},{"$f":"IF(OR(Search!$W$3=4,Search!$W$3=5,BH121=0),0,astmrnd(BH121,2))","v":0},{"$f":"IF(SUM(V121:V124)=0,0,AVERAGE(V121:V124))","v":0},{"$f":"IF(OR(Search!$W$3=4,Search!$W$3=5,BJ121=0),0,astmrnd(BJ121,2))","v":0},null,{"$f":"(AA121*0.15)+(AC121*0.3)+(AE121*0.15)+(AG121*0.4)","v":{"$error":"#VALUE!"}},{"$f":"IF(OR(AA121=\"TBD\",AC121=\"TBD\",AE121=\"TBD\",AG121=\"TBD\"),\"TBD\",astmrnd(BM121,0))","v":{"$error":"#VALUE!"}},{"$f":"IF(Menu!$C$10>Menu!$C$11,Menu!$C$10,IF(BN121>100,Menu!$C$10,Menu!$C$11))","v":{"$error":"#VALUE!"}},{"$f":"IF(AH121=\"TBD\",\"TBD\",((AH121-100)/100)*BO121*G121)","v":{"$error":"#VALUE!"}},{"$f":"(AK121*0.15)+(AM121*0.3)+(AO121*0.15)+(AQ121*0.4)","v":{"$error":"#VALUE!"}},{"$f":"IF(OR(AK121=\"TBD\",AM121=\"TBD\",AO121=\"TBD\",AQ121=\"TBD\"),\"TBD\",astmrnd(BQ121,0))","v":{"$error":"#VALUE!"}},{"$f":"IF(Menu!$C$10>Menu!$C$11,Menu!$C$10,IF(BR121>100,Menu!$C$10,Menu!$C$11))","v":{"$error":"#VALUE!"}},{"$f":"IF(AR121=\"TBD\",\"TBD\",((AR121-100)/100)*BS121*G121)","v":{"$error":"#VALUE!"}},{"$f":"(AU121*0.15)+(AW121*0.3)+(AY121*0.15)+(BA121*0.4)","v":{"$error":"#VALUE!"}},{"$f":"IF(OR(AU121=\"TBD\",AW121=\"TBD\",AY121=\"TBD\",BA121=\"TBD\"),\"TBD\",astmrnd(BU121,0))","v":{"$error":"#VALUE!"}},{"$f":"IF(Menu!$C$10>Menu!$C$11,Menu!$C$10,IF(BV121>100,Menu!$C$10,Menu!$C$11))","v":{"$error":"#VALUE!"}},{"$f":"IF(BB121=\"TBD\",\"TBD\",((BB121-100)/100)*BW121*G121)","v":{"$error":"#VALUE!"}}]
[null,null,null,null,28]
[null,null,null,null,28]
[null,null,null,null,28]
[null,null,{"$f":"IF(B125=0,\"\",$C$6)","v":""},null,29,null,null,null,null,null,null,null,{"$f":"BG125","v":0},null,null,null,null,{"$f":"BI125","v":0},null,null,null,null,{"$f":"BK125","v":0},null,null,{"$f":"IF(I125=0,\"NA\",ABS(I125-$H125))","v":"NA"},{"$f":"IF(Z125=\"NA\",\"NA\",IF(Z125<0.46,105-(11.1111*Z125),IF(Z125<1.01,181.8181-(181.8181*Z125),\"TBD\")))","v":"NA"},{"$f":"IF(J125=0,\"NA\",ABS(J125-$R$4))","v":"NA"},{"$f":"IF(AB125=\"NA\",\"NA\",IF(J125<1,\"TBD\",IF(AB125<1.01,105-(5*AB125),IF(AB125<2.01,140-(40*AB125),\"TBD\"))))","v":"NA"},{"$f":"IF(K125=0,\"NA\",ABS(K125-$T$4))","v":"NA"},{"$f":"IF(AD125=\"NA\",\"NA\",IF(AD125<1.01,105-(5*AD125),IF(AD125<$BG$7,168-(69*AD125),\"TBD\")))","v":"NA"},{"$f":"IF(BG125=0,\"NA\",BG125)","v":"NA"},{"$f":"IF(Z125=\"NA\",\"NA\",IF(Search!$W$3=2,100,IF(AF125>$BM$7,105,IF(AF125>$BN$7,(($BQ$7*AF125)-$BR$7),IF(AF125>$BO$7,(($BS$7*AF125)-$BT$7),\"TBD\")))))","v":"NA"},{"$f":"IF(OR(AA125=\"TBD\",AC125=\"TBD\",AE125=\"TBD\",AG125=\"TBD\"),\"TBD\",IF(Z125=\"NA\",\"NA\",BN125))","v":"NA"},{"$f":"IF(Z125=\"NA\",\"NA\",IF(BP125=\"TBD\",\"TBD\",astmrnd(BP125,2)))","v":"NA"},{"$f":"IF(N125=0,\"NA\",ABS(N125-$H125))","v":"NA"},{"$f":"IF(AJ125=\"NA\",\"NA\",IF(AJ125<0.46,105-(11.1111*AJ125),IF(AJ125<1.01,181.8181-(181.8181*AJ125),\"TBD\")))","v":"NA"},{"$f":"IF(O125=0,\"NA\",ABS(O125-$R$4))","v":"NA"},{"$f":"IF(AL125=\"NA\",\"NA\",IF(O125<1,\"TBD\",IF(AL125<1.01,105-(5*AL125),IF(AL125<2.01,140-(40*AL125),\"TBD\"))))","v":"NA"},{"$f":"IF(P125=0,\"NA\",ABS(P125-$T$4))","v":"NA"},{"$f":"IF(AN125=\"NA\",\"NA\",IF(AN125<1.01,105-(5*AN125),IF(AN125<$BG$7,168-(69*AN125),\"TBD\")))","v":"NA"},{"$f":"IF(BI125=0,\"NA\",BI125)","v":"NA"},{"$f":"IF(AJ125=\"NA\",\"NA\",IF(Search!$W$3=2,100,IF(AP125>$BM$7,105,IF(AP125>$BN$7,(($BQ$7*AP125)-$BR$7),IF(AP125>$BO$7,(($BS$7*AP125)-$BT$7),\"TBD\")))))","v":"NA"},{"$f":"IF(OR(AK125=\"TBD\",AM125=\"TBD\",AO125=\"TBD\",AQ125=\"TBD\"),\"TBD\",IF(AJ125=\"NA\",\"NA\",BR125))","v":"NA"},{"$f":"IF(AJ125=\"NA\",\"NA\",IF(BT125=\"TBD\",\"TBD\",astmrnd(BT125,2)))","v":"NA"},{"$f":"IF(S125=0,\"NA\",ABS(S125-$H125))","v":"NA"},{"$f":"IF(AT125=\"NA\",\"NA\",IF(AT125<0.46,105-(11.1111*AT125),IF(AT125<1.01,181.8181-(181.8181*AT125),\"TBD\")))","v":"NA"},{"$f":"IF(T125=0,\"NA\",ABS(T125-$R$4))","v":"NA"},{"$f":"IF(AV125=\"NA\",\"NA\",IF(T125<1,\"TBD\",IF(AV125<1.01,105-(5*AV125),IF(AV125<2.01,140-(40*AV125),\"TBD\"))))","v":"NA"},{"$f":"IF(U125=0,\"NA\",ABS(U125-$T$4))","v":"NA"},{"$f":"IF(AX125=\"NA\",\"NA\",IF(AX125<1.01,105-(5*AX125),IF(AX125<$BG$7,168-(69*AX125),\"TBD\")))","v":"NA"},{"$f":"IF(BK125=0,\"NA\",BK125)","v":"NA"},{"$f":"IF(AT125=\"NA\",\"NA\",IF(Search!$W$3=2,100,IF(AZ125>$BM$7,105,IF(AZ125>$BN$7,(($BQ$7*AZ125)-$BR$7),IF(AZ125>$BO$7,(($BS$7*AZ125)-$BT$7),\"TBD\")))))","v":"NA"},{"$f":"IF(OR(AU125=\"TBD\",AW125=\"TBD\",AY125=\"TBD\",BA125=\"TBD\"),\"TBD\",IF(AT125=\"NA\",\"NA\",BV125))","v":"NA"},{"$f":"IF(AT125=\"NA\",\"NA\",IF(BX125=\"TBD\",\"TBD\",astmrnd(BX125,2)))","v":"NA"},null,null,{"$f":"IF(SUM(L125:L128)=0,0,AVERAGE(L125:L128))","v":0},{"$f":"IF(OR(Search!$W$3=4,Search!$W$3=5,BF125=0),0,astmrnd(BF125,2))","v":0},{"$f":"IF(SUM(Q125:Q128)=0,0,AVERAGE(Q125:Q128))","v":0},{"$f":"IF(OR(Search!$W$3=4,Search!$W$3=5,BH125=0),0,astmrnd(BH125,2))","v":0},{"$f":"IF(SUM(V125:V128)=0,0,AVERAGE(V125:V128))","v":0},{"$f":"IF(OR(Search!$W$3=4,Search!$W$3=5,BJ125=0),0,astmrnd(BJ125,2))","v":0},null,{"$f":"(AA125*0.15)+(AC125*0.3)+(AE125*0.15)+(AG125*0.4)","v":{"$error":"#VALUE!"}},{"$f":"IF(OR(AA125=\"TBD\",AC125=\"TBD\",AE125=\"TBD\",AG125=\"TBD\"),\"TBD\",astmrnd(BM125,0))","v":{"$error":"#VALUE!"}},{"$f":"IF(Menu!$C$10>Menu!$C$11,Menu!$C$10,IF(BN125>100,Menu!$C$10,Menu!$C$11))","v":{"$error":"#VALUE!"}},{"$f":"IF(AH125=\"TBD\",\"TBD\",((AH125-100)/100)*BO125*G125)","v":{"$error":"#VALUE!"}},{"$f":"(AK125*0.15)+(AM125*0.3)+(AO125*0.15)+(AQ125*0.4)","v":{"$error":"#VALUE!"}},{"$f":"IF(OR(AK125=\"TBD\",AM125=\"TBD\",AO125=\"TBD\",AQ125=\"TBD\"),\"TBD\",astmrnd(BQ125,0))","v":{"$error":"#VALUE!"}},{"$f":"IF(Menu!$C$10>Menu!$C$11,Menu!$C$10,IF(BR125>100,Menu!$C$10,Menu!$C$11))","v":{"$error":"#VALUE!"}},{"$f":"IF(AR125=\"TBD\",\"TBD\",((AR125-100)/100)*BS125*G125)","v":{"$error":"#VALUE!"}},{"$f":"(AU125*0.15)+(AW125*0.3)+(AY125*0.15)+(BA125*0.4)","v":{"$error":"#VALUE!"}},{"$f":"IF(OR(AU125=\"TBD\",AW125=\"TBD\",AY125=\"TBD\",BA125=\"TBD\"),\"TBD\",astmrnd(BU125,0))","v":{"$error":"#VALUE!"}},{"$f":"IF(Menu!$C$10>Menu!$C$11,Menu!$C$10,IF(BV125>100,Menu!$C$10,Menu!$C$11))","v":{"$error":"#VALUE!"}},{"$f":"IF(BB125=\"TBD\",\"TBD\",((BB125-100)/100)*BW125*G125)","v":{"$error":"#VALUE!"}}]
[null,null,null,null,29]
[null,null,null,null,29]
[null,null,null,null,29]
[null,null,{"$f":"IF(B129=0,\"\",$C$6)","v":""},null,30,null,null,null,null,null,null,null,{"$f":"BG129","v":0},null,null,null,null,{"$f":"BI129","v":0},null,null,null,null,{"$f":"BK129","v":0},null,null,{"$f":"IF(I129=0,\"NA\",ABS(I129-$H129))","v":"NA"},{"$f":"IF(Z129=\"NA\",\"NA\",IF(Z129<0.46,105-(11.1111*Z129),IF(Z129<1.01,181.8181-(181.8181*Z129),\"TBD\")))","v":"NA"},{"$f":"IF(J129=0,\"NA\",ABS(J129-$R$4))","v":"NA"},{"$f":"IF(AB129=\"NA\",\"NA\",IF(J129<1,\"TBD\",IF(AB129<1.01,105-(5*AB129),IF(AB129<2.01,140-(40*AB129),\"TBD\"))))","v":"NA"},{"$f":"IF(K129=0,\"NA\",ABS(K129-$T$4))","v":"NA"},{"$f":"IF(AD129=\"NA\",\"NA\",IF(AD129<1.01,105-(5*AD129),IF(AD129<$BG$7,168-(69*AD129),\"TBD\")))","v":"NA"},{"$f":"IF(BG129=0,\"NA\",BG129)","v":"NA"},{"$f":"IF(Z129=\"NA\",\"NA\",IF(Search!$W$3=2,100,IF(AF129>$BM$7,105,IF(AF129>$BN$7,(($BQ$7*AF129)-$BR$7),IF(AF129>$BO$7,(($BS$7*AF129)-$BT$7),\"TBD\")))))","v":"NA"},{"$f":"IF(OR(AA129=\"TBD\",AC129=\"TBD\",AE129=\"TBD\",AG129=\"TBD\"),\"TBD\",IF(Z129=\"NA\",\"NA\",BN129))","v":"NA"},{"$f":"IF(Z129=\"NA\",\"NA\",IF(BP129=\"TBD\",\"TBD\",astmrnd(BP129,2)))","v":"NA"},{"$f":"IF(N129=0,\"NA\",ABS(N129-$H129))","v":"NA"},{"$f":"IF(AJ129=\"NA\",\"NA\",IF(AJ129<0.46,105-(11.1111*AJ129),IF(AJ129<1.01,181.8181-(181.8181*AJ129),\"TBD\")))","v":"NA"},{"$f":"IF(O129=0,\"NA\",ABS(O129-$R$4))","v":"NA"},{"$f":"IF(AL129=\"NA\",\"NA\",IF(O129<1,\"TBD\",IF(AL129<1.01,105-(5*AL129),IF(AL129<2.01,140-(40*AL129),\"TBD\"))))","v":"NA"},{"$f":"IF(P129=0,\"NA\",ABS(P129-$T$4))","v":"NA"},{"$f":"IF(AN129=\"NA\",\"NA\",IF(AN129<1.01,105-(5*AN129),IF(AN129<$BG$7,168-(69*AN129),\"TBD\")))","v":"NA"},{"$f":"IF(BI129=0,\"NA\",BI129)","v":"NA"},{"$f":"IF(AJ129=\"NA\",\"NA\",IF(Search!$W$3=2,100,IF(AP129>$BM$7,105,IF(AP129>$BN$7,(($BQ$7*AP129)-$BR$7),IF(AP129>$BO$7,(($BS$7*AP129)-$BT$7),\"TBD\")))))","v":"NA"},{"$f":"IF(OR(AK129=\"TBD\",AM129=\"TBD\",AO129=\"TBD\",AQ129=\"TBD\"),\"TBD\",IF(AJ129=\"NA\",\"NA\",BR129))","v":"NA"},{"$f":"IF(AJ129=\"NA\",\"NA\",IF(BT129=\"TBD\",\"TBD\",astmrnd(BT129,2)))","v":"NA"},{"$f":"IF(S129=0,\"NA\",ABS(S129-$H129))","v":"NA"},{"$f":"IF(AT129=\"NA\",\"NA\",IF(AT129<0.46,105-(11.1111*AT129),IF(AT129<1.01,181.8181-(181.8181*AT129),\"TBD\")))","v":"NA"},{"$f":"IF(T129=0,\"NA\",ABS(T129-$R$4))","v":"NA"},{"$f":"IF(AV129=\"NA\",\"NA\",IF(T129<1,\"TBD\",IF(AV129<1.01,105-(5*AV129),IF(AV129<2.01,140-(40*AV129),\"TBD\"))))","v":"NA"},{"$f":"IF(U129=0,\"NA\",ABS(U129-$T$4))","v":"NA"},{"$f":"IF(AX129=\"NA\",\"NA\",IF(AX129<1.01,105-(5*AX129),IF(AX129<$BG$7,168-(69*AX129),\"TBD\")))","v":"NA"},{"$f":"IF(BK129=0,\"NA\",BK129)","v":"NA"},{"$f":"IF(AT129=\"NA\",\"NA\",IF(Search!$W$3=2,100,IF(AZ129>$BM$7,105,IF(AZ129>$BN$7,(($BQ$7*AZ129)-$BR$7),IF(AZ129>$BO$7,(($BS$7*AZ129)-$BT$7),\"TBD\")))))","v":"NA"},{"$f":"IF(OR(AU129=\"TBD\",AW129=\"TBD\",AY129=\"TBD\",BA129=\"TBD\"),\"TBD\",IF(AT129=\"NA\",\"NA\",BV129))","v":"NA"},{"$f":"IF(AT129=\"NA\",\"NA\",IF(BX129=\"TBD\",\"TBD\",astmrnd(BX129,2)))","v":"NA"},null,null,{"$f":"IF(SUM(L129:L132)=0,0,AVERAGE(L129:L132))","v":0},{"$f":"IF(OR(Search!$W$3=4,Search!$W$3=5,BF129=0),0,astmrnd(BF129,2))","v":0},{"$f":"IF(SUM(Q129:Q132)=0,0,AVERAGE(Q129:Q132))","v":0},{"$f":"IF(OR(Search!$W$3=4,Search!$W$3=5,BH129=0),0,astmrnd(BH129,2))","v":0},{"$f":"IF(SUM(V129:V132)=0,0,AVERAGE(V129:V132))","v":0},{"$f":"IF(OR(Search!$W$3=4,Search!$W$3=5,BJ129=0),0,astmrnd(BJ129,2))","v":0},null,{"$f":"(AA129*0.15)+(AC129*0.3)+(AE129*0.15)+(AG129*0.4)","v":{"$error":"#VALUE!"}},{"$f":"IF(OR(AA129=\"TBD\",AC129=\"TBD\",AE129=\"TBD\",AG129=\"TBD\"),\"TBD\",astmrnd(BM129,0))","v":{"$error":"#VALUE!"}},{"$f":"IF(Menu!$C$10>Menu!$C$11,Menu!$C$10,IF(BN129>100,Menu!$C$10,Menu!$C$11))","v":{"$error":"#VALUE!"}},{"$f":"IF(AH129=\"TBD\",\"TBD\",((AH129-100)/100)*BO129*G129)","v":{"$error":"#VALUE!"}},{"$f":"(AK129*0.15)+(AM129*0.3)+(AO129*0.15)+(AQ129*0.4)","v":{"$error":"#VALUE!"}},{"$f":"IF(OR(AK129=\"TBD\",AM129=\"TBD\",AO129=\"TBD\",AQ129=\"TBD\"),\"TBD\",astmrnd(BQ129,0))","v":{"$error":"#VALUE!"}},{"$f":"IF(Menu!$C$10>Menu!$C$11,Menu!$C$10,IF(BR129>100,Menu!$C$10,Menu!$C$11))","v":{"$error":"#VALUE!"}},{"$f":"IF(AR129=\"TBD\",\"TBD\",((AR129-100)/100)*BS129*G129)","v":{"$error":"#VALUE!"}},{"$f":"(AU129*0.15)+(AW129*0.3)+(AY129*0.15)+(BA129*0.4)","v":{"$error":"#VALUE!"}},{"$f":"IF(OR(AU129=\"TBD\",AW129=\"TBD\",AY129=\"TBD\",BA129=\"TBD\"),\"TBD\",astmrnd(BU129,0))","v":{"$error":"#VALUE!"}},{"$f":"IF(Menu!$C$10>Menu!$C$11,Menu!$C$10,IF(BV129>100,Menu!$C$10,Menu!$C$11))","v":{"$error":"#VALUE!"}},{"$f":"IF(BB129=\"TBD\",\"TBD\",((BB129-100)/100)*BW129*G129)","v":{"$error":"#VALUE!"}}]
[null,null,null,null,30]
[null,null,null,null,30]
[null,null,null,null,30]
[null,null,{"$f":"IF(B133=0,\"\",$C$6)","v":""},null,31,null,null,null,null,null,null,null,{"$f":"BG133","v":0},null,null,null,null,{"$f":"BI133","v":0},null,null,null,null,{"$f":"BK133","v":0},null,null,{"$f":"IF(I133=0,\"NA\",ABS(I133-$H133))","v":"NA"},{"$f":"IF(Z133=\"NA\",\"NA\",IF(Z133<0.46,105-(11.1111*Z133),IF(Z133<1.01,181.8181-(181.8181*Z133),\"TBD\")))","v":"NA"},{"$f":"IF(J133=0,\"NA\",ABS(J133-$R$4))","v":"NA"},{"$f":"IF(AB133=\"NA\",\"NA\",IF(J133<1,\"TBD\",IF(AB133<1.01,105-(5*AB133),IF(AB133<2.01,140-(40*AB133),\"TBD\"))))","v":"NA"},{"$f":"IF(K133=0,\"NA\",ABS(K133-$T$4))","v":"NA"},{"$f":"IF(AD133=\"NA\",\"NA\",IF(AD133<1.01,105-(5*AD133),IF(AD133<$BG$7,168-(69*AD133),\"TBD\")))","v":"NA"},{"$f":"IF(BG133=0,\"NA\",BG133)","v":"NA"},{"$f":"IF(Z133=\"NA\",\"NA\",IF(Search!$W$3=2,100,IF(AF133>$BM$7,105,IF(AF133>$BN$7,(($BQ$7*AF133)-$BR$7),IF(AF133>$BO$7,(($BS$7*AF133)-$BT$7),\"TBD\")))))","v":"NA"},{"$f":"IF(OR(AA133=\"TBD\",AC133=\"TBD\",AE133=\"TBD\",AG133=\"TBD\"),\"TBD\",IF(Z133=\"NA\",\"NA\",BN133))","v":"NA"},{"$f":"IF(Z133=\"NA\",\"NA\",IF(BP133=\"TBD\",\"TBD\",astmrnd(BP133,2)))","v":"NA"},{"$f":"IF(N133=0,\"NA\",ABS(N133-$H133))","v":"NA"},{"$f":"IF(AJ133=\"NA\",\"NA\",IF(AJ133<0.46,105-(11.1111*AJ133),IF(AJ133<1.01,181.8181-(181.8181*AJ133),\"TBD\")))","v":"NA"},{"$f":"IF(O133=0,\"NA\",ABS(O133-$R$4))","v":"NA"},{"$f":"IF(AL133=\"NA\",\"NA\",IF(O133<1,\"TBD\",IF(AL133<1.01,105-(5*AL133),IF(AL133<2.01,140-(40*AL133),\"TBD\"))))","v":"NA"},{"$f":"IF(P133=0,\"NA\",ABS(P133-$T$4))","v":"NA"},{"$f":"IF(AN133=\"NA\",\"NA\",IF(AN133<1.01,105-(5*AN133),IF(AN133<$BG$7,168-(69*AN133),\"TBD\")))","v":"NA"},{"$f":"IF(BI133=0,\"NA\",BI133)","v":"NA"},{"$f":"IF(AJ133=\"NA\",\"NA\",IF(Search!$W$3=2,100,IF(AP133>$BM$7,105,IF(AP133>$BN$7,(($BQ$7*AP133)-$BR$7),IF(AP133>$BO$7,(($BS$7*AP133)-$BT$7),\"TBD\")))))","v":"NA"},{"$f":"IF(OR(AK133=\"TBD\",AM133=\"TBD\",AO133=\"TBD\",AQ133=\"TBD\"),\"TBD\",IF(AJ133=\"NA\",\"NA\",BR133))","v":"NA"},{"$f":"IF(AJ133=\"NA\",\"NA\",IF(BT133=\"TBD\",\"TBD\",astmrnd(BT133,2)))","v":"NA"},{"$f":"IF(S133=0,\"NA\",ABS(S133-$H133))","v":"NA"},{"$f":"IF(AT133=\"NA\",\"NA\",IF(AT133<0.46,105-(11.1111*AT133),IF(AT133<1.01,181.8181-(181.8181*AT133),\"TBD\")))","v":"NA"},{"$f":"IF(T133=0,\"NA\",ABS(T133-$R$4))","v":"NA"},{"$f":"IF(AV133=\"NA\",\"NA\",IF(T133<1,\"TBD\",IF(AV133<1.01,105-(5*AV133),IF(AV133<2.01,140-(40*AV133),\"TBD\"))))","v":"NA"},{"$f":"IF(U133=0,\"NA\",ABS(U133-$T$4))","v":"NA"},{"$f":"IF(AX133=\"NA\",\"NA\",IF(AX133<1.01,105-(5*AX133),IF(AX133<$BG$7,168-(69*AX133),\"TBD\")))","v":"NA"},{"$f":"IF(BK133=0,\"NA\",BK133)","v":"NA"},{"$f":"IF(AT133=\"NA\",\"NA\",IF(Search!$W$3=2,100,IF(AZ133>$BM$7,105,IF(AZ133>$BN$7,(($BQ$7*AZ133)-$BR$7),IF(AZ133>$BO$7,(($BS$7*AZ133)-$BT$7),\"TBD\")))))","v":"NA"},{"$f":"IF(OR(AU133=\"TBD\",AW133=\"TBD\",AY133=\"TBD\",BA133=\"TBD\"),\"TBD\",IF(AT133=\"NA\",\"NA\",BV133))","v":"NA"},{"$f":"IF(AT133=\"NA\",\"NA\",IF(BX133=\"TBD\",\"TBD\",astmrnd(BX133,2)))","v":"NA"},null,null,{"$f":"IF(SUM(L133:L136)=0,0,AVERAGE(L133:L136))","v":0},{"$f":"IF(OR(Search!$W$3=4,Search!$W$3=5,BF133=0),0,astmrnd(BF133,2))","v":0},{"$f":"IF(SUM(Q133:Q136)=0,0,AVERAGE(Q133:Q136))","v":0},{"$f":"IF(OR(Search!$W$3=4,Search!$W$3=5,BH133=0),0,astmrnd(BH133,2))","v":0},{"$f":"IF(SUM(V133:V136)=0,0,AVERAGE(V133:V136))","v":0},{"$f":"IF(OR(Search!$W$3=4,Search!$W$3=5,BJ133=0),0,astmrnd(BJ133,2))","v":0},null,{"$f":"(AA133*0.15)+(AC133*0.3)+(AE133*0.15)+(AG133*0.4)","v":{"$error":"#VALUE!"}},{"$f":"IF(OR(AA133=\"TBD\",AC133=\"TBD\",AE133=\"TBD\",AG133=\"TBD\"),\"TBD\",astmrnd(BM133,0))","v":{"$error":"#VALUE!"}},{"$f":"IF(Menu!$C$10>Menu!$C$11,Menu!$C$10,IF(BN133>100,Menu!$C$10,Menu!$C$11))","v":{"$error":"#VALUE!"}},{"$f":"IF(AH133=\"TBD\",\"TBD\",((AH133-100)/100)*BO133*G133)","v":{"$error":"#VALUE!"}},{"$f":"(AK133*0.15)+(AM133*0.3)+(AO133*0.15)+(AQ133*0.4)","v":{"$error":"#VALUE!"}},{"$f":"IF(OR(AK133=\"TBD\",AM133=\"TBD\",AO133=\"TBD\",AQ133=\"TBD\"),\"TBD\",astmrnd(BQ133,0))","v":{"$error":"#VALUE!"}},{"$f":"IF(Menu!$C$10>Menu!$C$11,Menu!$C$10,IF(BR133>100,Menu!$C$10,Menu!$C$11))","v":{"$error":"#VALUE!"}},{"$f":"IF(AR133=\"TBD\",\"TBD\",((AR133-100)/100)*BS133*G133)","v":{"$error":"#VALUE!"}},{"$f":"(AU133*0.15)+(AW133*0.3)+(AY133*0.15)+(BA133*0.4)","v":{"$error":"#VALUE!"}},{"$f":"IF(OR(AU133=\"TBD\",AW133=\"TBD\",AY133=\"TBD\",BA133=\"TBD\"),\"TBD\",astmrnd(BU133,0))","v":{"$error":"#VALUE!"}},{"$f":"IF(Menu!$C$10>Menu!$C$11,Menu!$C$10,IF(BV133>100,Menu!$C$10,Menu!$C$11))","v":{"$error":"#VALUE!"}},{"$f":"IF(BB133=\"TBD\",\"TBD\",((BB133-100)/100)*BW133*G133)","v":{"$error":"#VALUE!"}}]
[null,null,null,null,31]
[null,null,null,null,31]
[null,null,null,null,31]
[null,null,{"$f":"IF(B137=0,\"\",$C$6)","v":""},null,32,null,null,null,null,null,null,null,{"$f":"BG137","v":0},null,null,null,null,{"$f":"BI137","v":0},null,null,null,null,{"$f":"BK137","v":0},null,null,{"$f":"IF(I137=0,\"NA\",ABS(I137-$H137))","v":"NA"},{"$f":"IF(Z137=\"NA\",\"NA\",IF(Z137<0.46,105-(11.1111*Z137),IF(Z137<1.01,181.8181-(181.8181*Z137),\"TBD\")))","v":"NA"},{"$f":"IF(J137=0,\"NA\",ABS(J137-$R$4))","v":"NA"},{"$f":"IF(AB137=\"NA\",\"NA\",IF(J137<1,\"TBD\",IF(AB137<1.01,105-(5*AB137),IF(AB137<2.01,140-(40*AB137),\"TBD\"))))","v":"NA"},{"$f":"IF(K137=0,\"NA\",ABS(K137-$T$4))","v":"NA"},{"$f":"IF(AD137=\"NA\",\"NA\",IF(AD137<1.01,105-(5*AD137),IF(AD137<$BG$7,168-(69*AD137),\"TBD\")))","v":"NA"},{"$f":"IF(BG137=0,\"NA\",BG137)","v":"NA"},{"$f":"IF(Z137=\"NA\",\"NA\",IF(Search!$W$3=2,100,IF(AF137>$BM$7,105,IF(AF137>$BN$7,(($BQ$7*AF137)-$BR$7),IF(AF137>$BO$7,(($BS$7*AF137)-$BT$7),\"TBD\")))))","v":"NA"},{"$f":"IF(OR(AA137=\"TBD\",AC137=\"TBD\",AE137=\"TBD\",AG137=\"TBD\"),\"TBD\",IF(Z137=\"NA\",\"NA\",BN137))","v":"NA"},{"$f":"IF(Z137=\"NA\",\"NA\",IF(BP137=\"TBD\",\"TBD\",astmrnd(BP137,2)))","v":"NA"},{"$f":"IF(N137=0,\"NA\",ABS(N137-$H137))","v":"NA"},{"$f":"IF(AJ137=\"NA\",\"NA\",IF(AJ137<0.46,105-(11.1111*AJ137),IF(AJ137<1.01,181.8181-(181.8181*AJ137),\"TBD\")))","v":"NA"},{"$f":"IF(O137=0,\"NA\",ABS(O137-$R$4))","v":"NA"},{"$f":"IF(AL137=\"NA\",\"NA\",IF(O137<1,\"TBD\",IF(AL137<1.01,105-(5*AL137),IF(AL137<2.01,140-(40*AL137),\"TBD\"))))","v":"NA"},{"$f":"IF(P137=0,\"NA\",ABS(P137-$T$4))","v":"NA"},{"$f":"IF(AN137=\"NA\",\"NA\",IF(AN137<1.01,105-(5*AN137),IF(AN137<$BG$7,168-(69*AN137),\"TBD\")))","v":"NA"},{"$f":"IF(BI137=0,\"NA\",BI137)","v":"NA"},{"$f":"IF(AJ137=\"NA\",\"NA\",IF(Search!$W$3=2,100,IF(AP137>$BM$7,105,IF(AP137>$BN$7,(($BQ$7*AP137)-$BR$7),IF(AP137>$BO$7,(($BS$7*AP137)-$BT$7),\"TBD\")))))","v":"NA"},{"$f":"IF(OR(AK137=\"TBD\",AM137=\"TBD\",AO137=\"TBD\",AQ137=\"TBD\"),\"TBD\",IF(AJ137=\"NA\",\"NA\",BR137))","v":"NA"},{"$f":"IF(AJ137=\"NA\",\"NA\",IF(BT137=\"TBD\",\"TBD\",astmrnd(BT137,2)))","v":"NA"},{"$f":"IF(S137=0,\"NA\",ABS(S137-$H137))","v":"NA"},{"$f":"IF(AT137=\"NA\",\"NA\",IF(AT137<0.46,105-(11.1111*AT137),IF(AT137<1.01,181.8181-(181.8181*AT137),\"TBD\")))","v":"NA"},{"$f":"IF(T137=0,\"NA\",ABS(T137-$R$4))","v":"NA"},{"$f":"IF(AV137=\"NA\",\"NA\",IF(T137<1,\"TBD\",IF(AV137<1.01,105-(5*AV137),IF(AV137<2.01,140-(40*AV137),\"TBD\"))))","v":"NA"},{"$f":"IF(U137=0,\"NA\",ABS(U137-$T$4))","v":"NA"},{"$f":"IF(AX137=\"NA\",\"NA\",IF(AX137<1.01,105-(5*AX137),IF(AX137<$BG$7,168-(69*AX137),\"TBD\")))","v":"NA"},{"$f":"IF(BK137=0,\"NA\",BK137)","v":"NA"},{"$f":"IF(AT137=\"NA\",\"NA\",IF(Search!$W$3=2,100,IF(AZ137>$BM$7,105,IF(AZ137>$BN$7,(($BQ$7*AZ137)-$BR$7),IF(AZ137>$BO$7,(($BS$7*AZ137)-$BT$7),\"TBD\")))))","v":"NA"},{"$f":"IF(OR(AU137=\"TBD\",AW137=\"TBD\",AY137=\"TBD\",BA137=\"TBD\"),\"TBD\",IF(AT137=\"NA\",\"NA\",BV137))","v":"NA"},{"$f":"IF(AT137=\"NA\",\"NA\",IF(BX137=\"TBD\",\"TBD\",astmrnd(BX137,2)))","v":"NA"},null,null,{"$f":"IF(SUM(L137:L140)=0,0,AVERAGE(L137:L140))","v":0},{"$f":"IF(OR(Search!$W$3=4,Search!$W$3=5,BF137=0),0,astmrnd(BF137,2))","v":0},{"$f":"IF(SUM(Q137:Q140)=0,0,AVERAGE(Q137:Q140))","v":0},{"$f":"IF(OR(Search!$W$3=4,Search!$W$3=5,BH137=0),0,astmrnd(BH137,2))","v":0},{"$f":"IF(SUM(V137:V140)=0,0,AVERAGE(V137:V140))","v":0},{"$f":"IF(OR(Search!$W$3=4,Search!$W$3=5,BJ137=0),0,astmrnd(BJ137,2))","v":0},null,{"$f":"(AA137*0.15)+(AC137*0.3)+(AE137*0.15)+(AG137*0.4)","v":{"$error":"#VALUE!"}},{"$f":"IF(OR(AA137=\"TBD\",AC137=\"TBD\",AE137=\"TBD\",AG137=\"TBD\"),\"TBD\",astmrnd(BM137,0))","v":{"$error":"#VALUE!"}},{"$f":"IF(Menu!$C$10>Menu!$C$11,Menu!$C$10,IF(BN137>100,Menu!$C$10,Menu!$C$11))","v":{"$error":"#VALUE!"}},{"$f":"IF(AH137=\"TBD\",\"TBD\",((AH137-100)/100)*BO137*G137)","v":{"$error":"#VALUE!"}},{"$f":"(AK137*0.15)+(AM137*0.3)+(AO137*0.15)+(AQ137*0.4)","v":{"$error":"#VALUE!"}},{"$f":"IF(OR(AK137=\"TBD\",AM137=\"TBD\",AO137=\"TBD\",AQ137=\"TBD\"),\"TBD\",astmrnd(BQ137,0))","v":{"$error":"#VALUE!"}},{"$f":"IF(Menu!$C$10>Menu!$C$11,Menu!$C$10,IF(BR137>100,Menu!$C$10,Menu!$C$11))","v":{"$error":"#VALUE!"}},{"$f":"IF(AR137=\"TBD\",\"TBD\",((AR137-100)/100)*BS137*G137)","v":{"$error":"#VALUE!"}},{"$f":"(AU137*0.15)+(AW137*0.3)+(AY137*0.15)+(BA137*0.4)","v":{"$error":"#VALUE!"}},{"$f":"IF(OR(AU137=\"TBD\",AW137=\"TBD\",AY137=\"TBD\",BA137=\"TBD\"),\"TBD\",astmrnd(BU137,0))","v":{"$error":"#VALUE!"}},{"$f":"IF(Menu!$C$10>Menu!$C$11,Menu!$C$10,IF(BV137>100,Menu!$C$10,Menu!$C$11))","v":{"$error":"#VALUE!"}},{"$f":"IF(BB137=\"TBD\",\"TBD\",((BB137-100)/100)*BW137*G137)","v":{"$error":"#VALUE!"}}]
[null,null,null,null,32]
[null,null,null,null,32]
[null,null,null,null,32]
[null,null,{"$f":"IF(B141=0,\"\",$C$6)","v":""},null,33,null,null,null,null,null,null,null,{"$f":"BG141","v":0},null,null,null,null,{"$f":"BI141","v":0},null,null,null,null,{"$f":"BK141","v":0},null,null,{"$f":"IF(I141=0,\"NA\",ABS(I141-$H141))","v":"NA"},{"$f":"IF(Z141=\"NA\",\"NA\",IF(Z141<0.46,105-(11.1111*Z141),IF(Z141<1.01,181.8181-(181.8181*Z141),\"TBD\")))","v":"NA"},{"$f":"IF(J141=0,\"NA\",ABS(J141-$R$4))","v":"NA"},{"$f":"IF(AB141=\"NA\",\"NA\",IF(J141<1,\"TBD\",IF(AB141<1.01,105-(5*AB141),IF(AB141<2.01,140-(40*AB141),\"TBD\"))))","v":"NA"},{"$f":"IF(K141=0,\"NA\",ABS(K141-$T$4))","v":"NA"},{"$f":"IF(AD141=\"NA\",\"NA\",IF(AD141<1.01,105-(5*AD141),IF(AD141<$BG$7,168-(69*AD141),\"TBD\")))","v":"NA"},{"$f":"IF(BG141=0,\"NA\",BG141)","v":"NA"},{"$f":"IF(Z141=\"NA\",\"NA\",IF(Search!$W$3=2,100,IF(AF141>$BM$7,105,IF(AF141>$BN$7,(($BQ$7*AF141)-$BR$7),IF(AF141>$BO$7,(($BS$7*AF141)-$BT$7),\"TBD\")))))","v":"NA"},{"$f":"IF(OR(AA141=\"TBD\",AC141=\"TBD\",AE141=\"TBD\",AG141=\"TBD\"),\"TBD\",IF(Z141=\"NA\",\"NA\",BN141))","v":"NA"},{"$f":"IF(Z141=\"NA\",\"NA\",IF(BP141=\"TBD\",\"TBD\",astmrnd(BP141,2)))","v":"NA"},{"$f":"IF(N141=0,\"NA\",ABS(N141-$H141))","v":"NA"},{"$f":"IF(AJ141=\"NA\",\"NA\",IF(AJ141<0.46,105-(11.1111*AJ141),IF(AJ141<1.01,181.8181-(181.8181*AJ141),\"TBD\")))","v":"NA"},{"$f":"IF(O141=0,\"NA\",ABS(O141-$R$4))","v":"NA"},{"$f":"IF(AL141=\"NA\",\"NA\",IF(O141<1,\"TBD\",IF(AL141<1.01,105-(5*AL141),IF(AL141<2.01,140-(40*AL141),\"TBD\"))))","v":"NA"},{"$f":"IF(P141=0,\"NA\",ABS(P141-$T$4))","v":"NA"},{"$f":"IF(AN141=\"NA\",\"NA\",IF(AN141<1.01,105-(5*AN141),IF(AN141<$BG$7,168-(69*AN141),\"TBD\")))","v":"NA"},{"$f":"IF(BI141=0,\"NA\",BI141)","v":"NA"},{"$f":"IF(AJ141=\"NA\",\"NA\",IF(Search!$W$3=2,100,IF(AP141>$BM$7,105,IF(AP141>$BN$7,(($BQ$7*AP141)-$BR$7),IF(AP141>$BO$7,(($BS$7*AP141)-$BT$7),\"TBD\")))))","v":"NA"},{"$f":"IF(OR(AK141=\"TBD\",AM141=\"TBD\",AO141=\"TBD\",AQ141=\"TBD\"),\"TBD\",IF(AJ141=\"NA\",\"NA\",BR141))","v":"NA"},{"$f":"IF(AJ141=\"NA\",\"NA\",IF(BT141=\"TBD\",\"TBD\",astmrnd(BT141,2)))","v":"NA"},{"$f":"IF(S141=0,\"NA\",ABS(S141-$H141))","v":"NA"},{"$f":"IF(AT141=\"NA\",\"NA\",IF(AT141<0.46,105-(11.1111*AT141),IF(AT141<1.01,181.8181-(181.8181*AT141),\"TBD\")))","v":"NA"},{"$f":"IF(T141=0,\"NA\",ABS(T141-$R$4))","v":"NA"},{"$f":"IF(AV141=\"NA\",\"NA\",IF(T141<1,\"TBD\",IF(AV141<1.01,105-(5*AV141),IF(AV141<2.01,140-(40*AV141),\"TBD\"))))","v":"NA"},{"$f":"IF(U141=0,\"NA\",ABS(U141-$T$4))","v":"NA"},{"$f":"IF(AX141=\"NA\",\"NA\",IF(AX141<1.01,105-(5*AX141),IF(AX141<$BG$7,168-(69*AX141),\"TBD\")))","v":"NA"},{"$f":"IF(BK141=0,\"NA\",BK141)","v":"NA"},{"$f":"IF(AT141=\"NA\",\"NA\",IF(Search!$W$3=2,100,IF(AZ141>$BM$7,105,IF(AZ141>$BN$7,(($BQ$7*AZ141)-$BR$7),IF(AZ141>$BO$7,(($BS$7*AZ141)-$BT$7),\"TBD\")))))","v":"NA"},{"$f":"IF(OR(AU141=\"TBD\",AW141=\"TBD\",AY141=\"TBD\",BA141=\"TBD\"),\"TBD\",IF(AT141=\"NA\",\"NA\",BV141))","v":"NA"},{"$f":"IF(AT141=\"NA\",\"NA\",IF(BX141=\"TBD\",\"TBD\",astmrnd(BX141,2)))","v":"NA"},null,null,{"$f":"IF(SUM(L141:L144)=0,0,AVERAGE(L141:L144))","v":0},{"$f":"IF(OR(Search!$W$3=4,Search!$W$3=5,BF141=0),0,astmrnd(BF141,2))","v":0},{"$f":"IF(SUM(Q141:Q144)=0,0,AVERAGE(Q141:Q144))","v":0},{"$f":"IF(OR(Search!$W$3=4,Search!$W$3=5,BH141=0),0,astmrnd(BH141,2))","v":0},{"$f":"IF(SUM(V141:V144)=0,0,AVERAGE(V141:V144))","v":0},{"$f":"IF(OR(Search!$W$3=4,Search!$W$3=5,BJ141=0),0,astmrnd(BJ141,2))","v":0},null,{"$f":"(AA141*0.15)+(AC141*0.3)+(AE141*0.15)+(AG141*0.4)","v":{"$error":"#VALUE!"}},{"$f":"IF(OR(AA141=\"TBD\",AC141=\"TBD\",AE141=\"TBD\",AG141=\"TBD\"),\"TBD\",astmrnd(BM141,0))","v":{"$error":"#VALUE!"}},{"$f":"IF(Menu!$C$10>Menu!$C$11,Menu!$C$10,IF(BN141>100,Menu!$C$10,Menu!$C$11))","v":{"$error":"#VALUE!"}},{"$f":"IF(AH141=\"TBD\",\"TBD\",((AH141-100)/100)*BO141*G141)","v":{"$error":"#VALUE!"}},{"$f":"(AK141*0.15)+(AM141*0.3)+(AO141*0.15)+(AQ141*0.4)","v":{"$error":"#VALUE!"}},{"$f":"IF(OR(AK141=\"TBD\",AM141=\"TBD\",AO141=\"TBD\",AQ141=\"TBD\"),\"TBD\",astmrnd(BQ141,0))","v":{"$error":"#VALUE!"}},{"$f":"IF(Menu!$C$10>Menu!$C$11,Menu!$C$10,IF(BR141>100,Menu!$C$10,Menu!$C$11))","v":{"$error":"#VALUE!"}},{"$f":"IF(AR141=\"TBD\",\"TBD\",((AR141-100)/100)*BS141*G141)","v":{"$error":"#VALUE!"}},{"$f":"(AU141*0.15)+(AW141*0.3)+(AY141*0.15)+(BA141*0.4)","v":{"$error":"#VALUE!"}},{"$f":"IF(OR(AU141=\"TBD\",AW141=\"TBD\",AY141=\"TBD\",BA141=\"TBD\"),\"TBD\",astmrnd(BU141,0))","v":{"$error":"#VALUE!"}},{"$f":"IF(Menu!$C$10>Menu!$C$11,Menu!$C$10,IF(BV141>100,Menu!$C$10,Menu!$C$11))","v":{"$error":"#VALUE!"}},{"$f":"IF(BB141=\"TBD\",\"TBD\",((BB141-100)/100)*BW141*G141)","v":{"$error":"#VALUE!"}}]
[null,null,null,null,33]
[null,null,null,null,33]
[null,null,null,null,33]
[null,null,{"$f":"IF(B145=0,\"\",$C$6)","v":""},null,34,null,null,null,null,null,null,null,{"$f":"BG145","v":0},null,null,null,null,{"$f":"BI145","v":0},null,null,null,null,{"$f":"BK145","v":0},null,null,{"$f":"IF(I145=0,\"NA\",ABS(I145-$H145))","v":"NA"},{"$f":"IF(Z145=\"NA\",\"NA\",IF(Z145<0.46,105-(11.1111*Z145),IF(Z145<1.01,181.8181-(181.8181*Z145),\"TBD\")))","v":"NA"},{"$f":"IF(J145=0,\"NA\",ABS(J145-$R$4))","v":"NA"},{"$f":"IF(AB145=\"NA\",\"NA\",IF(J145<1,\"TBD\",IF(AB145<1.01,105-(5*AB145),IF(AB145<2.01,140-(40*AB145),\"TBD\"))))","v":"NA"},{"$f":"IF(K145=0,\"NA\",ABS(K145-$T$4))","v":"NA"},{"$f":"IF(AD145=\"NA\",\"NA\",IF(AD145<1.01,105-(5*AD145),IF(AD145<$BG$7,168-(69*AD145),\"TBD\")))","v":"NA"},{"$f":"IF(BG145=0,\"NA\",BG145)","v":"NA"},{"$f":"IF(Z145=\"NA\",\"NA\",IF(Search!$W$3=2,100,IF(AF145>$BM$7,105,IF(AF145>$BN$7,(($BQ$7*AF145)-$BR$7),IF(AF145>$BO$7,(($BS$7*AF145)-$BT$7),\"TBD\")))))","v":"NA"},{"$f":"IF(OR(AA145=\"TBD\",AC145=\"TBD\",AE145=\"TBD\",AG145=\"TBD\"),\"TBD\",IF(Z145=\"NA\",\"NA\",BN145))","v":"NA"},{"$f":"IF(Z145=\"NA\",\"NA\",IF(BP145=\"TBD\",\"TBD\",astmrnd(BP145,2)))","v":"NA"},{"$f":"IF(N145=0,\"NA\",ABS(N145-$H145))","v":"NA"},{"$f":"IF(AJ145=\"NA\",\"NA\",IF(AJ145<0.46,105-(11.1111*AJ145),IF(AJ145<1.01,181.8181-(181.8181*AJ145),\"TBD\")))","v":"NA"},{"$f":"IF(O145=0,\"NA\",ABS(O145-$R$4))","v":"NA"},{"$f":"IF(AL145=\"NA\",\"NA\",IF(O145<1,\"TBD\",IF(AL145<1.01,105-(5*AL145),IF(AL145<2.01,140-(40*AL145),\"TBD\"))))","v":"NA"},{"$f":"IF(P145=0,\"NA\",ABS(P145-$T$4))","v":"NA"},{"$f":"IF(AN145=\"NA\",\"NA\",IF(AN145<1.01,105-(5*AN145),IF(AN145<$BG$7,168-(69*AN145),\"TBD\")))","v":"NA"},{"$f":"IF(BI145=0,\"NA\",BI145)","v":"NA"},{"$f":"IF(AJ145=\"NA\",\"NA\",IF(Search!$W$3=2,100,IF(AP145>$BM$7,105,IF(AP145>$BN$7,(($BQ$7*AP145)-$BR$7),IF(AP145>$BO$7,(($BS$7*AP145)-$BT$7),\"TBD\")))))","v":"NA"},{"$f":"IF(OR(AK145=\"TBD\",AM145=\"TBD\",AO145=\"TBD\",AQ145=\"TBD\"),\"TBD\",IF(AJ145=\"NA\",\"NA\",BR145))","v":"NA"},{"$f":"IF(AJ145=\"NA\",\"NA\",IF(BT145=\"TBD\",\"TBD\",astmrnd(BT145,2)))","v":"NA"},{"$f":"IF(S145=0,\"NA\",ABS(S145-$H145))","v":"NA"},{"$f":"IF(AT145=\"NA\",\"NA\",IF(AT145<0.46,105-(11.1111*AT145),IF(AT145<1.01,181.8181-(181.8181*AT145),\"TBD\")))","v":"NA"},{"$f":"IF(T145=0,\"NA\",ABS(T145-$R$4))","v":"NA"},{"$f":"IF(AV145=\"NA\",\"NA\",IF(T145<1,\"TBD\",IF(AV145<1.01,105-(5*AV145),IF(AV145<2.01,140-(40*AV145),\"TBD\"))))","v":"NA"},{"$f":"IF(U145=0,\"NA\",ABS(U145-$T$4))","v":"NA"},{"$f":"IF(AX145=\"NA\",\"NA\",IF(AX145<1.01,105-(5*AX145),IF(AX145<$BG$7,168-(69*AX145),\"TBD\")))","v":"NA"},{"$f":"IF(BK145=0,\"NA\",BK145)","v":"NA"},{"$f":"IF(AT145=\"NA\",\"NA\",IF(Search!$W$3=2,100,IF(AZ145>$BM$7,105,IF(AZ145>$BN$7,(($BQ$7*AZ145)-$BR$7),IF(AZ145>$BO$7,(($BS$7*AZ145)-$BT$7),\"TBD\")))))","v":"NA"},{"$f":"IF(OR(AU145=\"TBD\",AW145=\"TBD\",AY145=\"TBD\",BA145=\"TBD\"),\"TBD\",IF(AT145=\"NA\",\"NA\",BV145))","v":"NA"},{"$f":"IF(AT145=\"NA\",\"NA\",IF(BX145=\"TBD\",\"TBD\",astmrnd(BX145,2)))","v":"NA"},null,null,{"$f":"IF(SUM(L145:L148)=0,0,AVERAGE(L145:L148))","v":0},{"$f":"IF(OR(Search!$W$3=4,Search!$W$3=5,BF145=0),0,astmrnd(BF145,2))","v":0},{"$f":"IF(SUM(Q145:Q148)=0,0,AVERAGE(Q145:Q148))","v":0},{"$f":"IF(OR(Search!$W$3=4,Search!$W$3=5,BH145=0),0,astmrnd(BH145,2))","v":0},{"$f":"IF(SUM(V145:V148)=0,0,AVERAGE(V145:V148))","v":0},{"$f":"IF(OR(Search!$W$3=4,Search!$W$3=5,BJ145=0),0,astmrnd(BJ145,2))","v":0},null,{"$f":"(AA145*0.15)+(AC145*0.3)+(AE145*0.15)+(AG145*0.4)","v":{"$error":"#VALUE!"}},{"$f":"IF(OR(AA145=\"TBD\",AC145=\"TBD\",AE145=\"TBD\",AG145=\"TBD\"),\"TBD\",astmrnd(BM145,0))","v":{"$error":"#VALUE!"}},{"$f":"IF(Menu!$C$10>Menu!$C$11,Menu!$C$10,IF(BN145>100,Menu!$C$10,Menu!$C$11))","v":{"$error":"#VALUE!"}},{"$f":"IF(AH145=\"TBD\",\"TBD\",((AH145-100)/100)*BO145*G145)","v":{"$error":"#VALUE!"}},{"$f":"(AK145*0.15)+(AM145*0.3)+(AO145*0.15)+(AQ145*0.4)","v":{"$error":"#VALUE!"}},{"$f":"IF(OR(AK145=\"TBD\",AM145=\"TBD\",AO145=\"TBD\",AQ145=\"TBD\"),\"TBD\",astmrnd(BQ145,0))","v":{"$error":"#VALUE!"}},{"$f":"IF(Menu!$C$10>Menu!$C$11,Menu!$C$10,IF(BR145>100,Menu!$C$10,Menu!$C$11))","v":{"$error":"#VALUE!"}},{"$f":"IF(AR145=\"TBD\",\"TBD\",((AR145-100)/100)*BS145*G145)","v":{"$error":"#VALUE!"}},{"$f":"(AU145*0.15)+(AW145*0.3)+(AY145*0.15)+(BA145*0.4)","v":{"$error":"#VALUE!"}},{"$f":"IF(OR(AU145=\"TBD\",AW145=\"TBD\",AY145=\"TBD\",BA145=\"TBD\"),\"TBD\",astmrnd(BU145,0))","v":{"$error":"#VALUE!"}},{"$f":"IF(Menu!$C$10>Menu!$C$11,Menu!$C$10,IF(BV145>100,Menu!$C$10,Menu!$C$11))","v":{"$error":"#VALUE!"}},{"$f":"IF(BB145=\"TBD\",\"TBD\",((BB145-100)/100)*BW145*G145)","v":{"$error":"#VALUE!"}}]
[null,null,null,null,34]
[null,null,null,null,34]
[null,null,null,null,34]
[null,null,{"$f":"IF(B149=0,\"\",$C$6)","v":""},null,35,null,null,null,null,null,null,null,{"$f":"BG149","v":0},null,null,null,null,{"$f":"BI149","v":0},null,null,null,null,{"$f":"BK149","v":0},null,null,{"$f":"IF(I149=0,\"NA\",ABS(I149-$H149))","v":"NA"},{"$f":"IF(Z149=\"NA\",\"NA\",IF(Z149<0.46,105-(11.1111*Z149),IF(Z149<1.01,181.8181-(181.8181*Z149),\"TBD\")))","v":"NA"},{"$f":"IF(J149=0,\"NA\",ABS(J149-$R$4))","v":"NA"},{"$f":"IF(AB149=\"NA\",\"NA\",IF(J149<1,\"TBD\",IF(AB149<1.01,105-(5*AB149),IF(AB149<2.01,140-(40*AB149),\"TBD\"))))","v":"NA"},{"$f":"IF(K149=0,\"NA\",ABS(K149-$T$4))","v":"NA"},{"$f":"IF(AD149=\"NA\",\"NA\",IF(AD149<1.01,105-(5*AD149),IF(AD149<$BG$7,168-(69*AD149),\"TBD\")))","v":"NA"},{"$f":"IF(BG149=0,\"NA\",BG149)","v":"NA"},{"$f":"IF(Z149=\"NA\",\"NA\",IF(Search!$W$3=2,100,IF(AF149>$BM$7,105,IF(AF149>$BN$7,(($BQ$7*AF149)-$BR$7),IF(AF149>$BO$7,(($BS$7*AF149)-$BT$7),\"TBD\")))))","v":"NA"},{"$f":"IF(OR(AA149=\"TBD\",AC149=\"TBD\",AE149=\"TBD\",AG149=\"TBD\"),\"TBD\",IF(Z149=\"NA\",\"NA\",BN149))","v":"NA"},{"$f":"IF(Z149=\"NA\",\"NA\",IF(BP149=\"TBD\",\"TBD\",astmrnd(BP149,2)))","v":"NA"},{"$f":"IF(N149=0,\"NA\",ABS(N149-$H149))","v":"NA"},{"$f":"IF(AJ149=\"NA\",\"NA\",IF(AJ149<0.46,105-(11.1111*AJ149),IF(AJ149<1.01,181.8181-(181.8181*AJ149),\"TBD\")))","v":"NA"},{"$f":"IF(O149=0,\"NA\",ABS(O149-$R$4))","v":"NA"},{"$f":"IF(AL149=\"NA\",\"NA\",IF(O149<1,\"TBD\",IF(AL149<1.01,105-(5*AL149),IF(AL149<2.01,140-(40*AL149),\"TBD\"))))","v":"NA"},{"$f":"IF(P149=0,\"NA\",ABS(P149-$T$4))","v":"NA"},{"$f":"IF(AN149=\"NA\",\"NA\",IF(AN149<1.01,105-(5*AN149),IF(AN149<$BG$7,168-(69*AN149),\"TBD\")))","v":"NA"},{"$f":"IF(BI149=0,\"NA\",BI149)","v":"NA"},{"$f":"IF(AJ149=\"NA\",\"NA\",IF(Search!$W$3=2,100,IF(AP149>$BM$7,105,IF(AP149>$BN$7,(($BQ$7*AP149)-$BR$7),IF(AP149>$BO$7,(($BS$7*AP149)-$BT$7),\"TBD\")))))","v":"NA"},{"$f":"IF(OR(AK149=\"TBD\",AM149=\"TBD\",AO149=\"TBD\",AQ149=\"TBD\"),\"TBD\",IF(AJ149=\"NA\",\"NA\",BR149))","v":"NA"},{"$f":"IF(AJ149=\"NA\",\"NA\",IF(BT149=\"TBD\",\"TBD\",astmrnd(BT149,2)))","v":"NA"},{"$f":"IF(S149=0,\"NA\",ABS(S149-$H149))","v":"NA"},{"$f":"IF(AT149=\"NA\",\"NA\",IF(AT149<0.46,105-(11.1111*AT149),IF(AT149<1.01,181.8181-(181.8181*AT149),\"TBD\")))","v":"NA"},{"$f":"IF(T149=0,\"NA\",ABS(T149-$R$4))","v":"NA"},{"$f":"IF(AV149=\"NA\",\"NA\",IF(T149<1,\"TBD\",IF(AV149<1.01,105-(5*AV149),IF(AV149<2.01,140-(40*AV149),\"TBD\"))))","v":"NA"},{"$f":"IF(U149=0,\"NA\",ABS(U149-$T$4))","v":"NA"},{"$f":"IF(AX149=\"NA\",\"NA\",IF(AX149<1.01,105-(5*AX149),IF(AX149<$BG$7,168-(69*AX149),\"TBD\")))","v":"NA"},{"$f":"IF(BK149=0,\"NA\",BK149)","v":"NA"},{"$f":"IF(AT149=\"NA\",\"NA\",IF(Search!$W$3=2,100,IF(AZ149>$BM$7,105,IF(AZ149>$BN$7,(($BQ$7*AZ149)-$BR$7),IF(AZ149>$BO$7,(($BS$7*AZ149)-$BT$7),\"TBD\")))))","v":"NA"},{"$f":"IF(OR(AU149=\"TBD\",AW149=\"TBD\",AY149=\"TBD\",BA149=\"TBD\"),\"TBD\",IF(AT149=\"NA\",\"NA\",BV149))","v":"NA"},{"$f":"IF(AT149=\"NA\",\"NA\",IF(BX149=\"TBD\",\"TBD\",astmrnd(BX149,2)))","v":"NA"},null,null,{"$f":"IF(SUM(L149:L152)=0,0,AVERAGE(L149:L152))","v":0},{"$f":"IF(OR(Search!$W$3=4,Search!$W$3=5,BF149=0),0,astmrnd(BF149,2))","v":0},{"$f":"IF(SUM(Q149:Q152)=0,0,AVERAGE(Q149:Q152))","v":0},{"$f":"IF(OR(Search!$W$3=4,Search!$W$3=5,BH149=0),0,astmrnd(BH149,2))","v":0},{"$f":"IF(SUM(V149:V152)=0,0,AVERAGE(V149:V152))","v":0},{"$f":"IF(OR(Search!$W$3=4,Search!$W$3=5,BJ149=0),0,astmrnd(BJ149,2))","v":0},null,{"$f":"(AA149*0.15)+(AC149*0.3)+(AE149*0.15)+(AG149*0.4)","v":{"$error":"#VALUE!"}},{"$f":"IF(OR(AA149=\"TBD\",AC149=\"TBD\",AE149=\"TBD\",AG149=\"TBD\"),\"TBD\",astmrnd(BM149,0))","v":{"$error":"#VALUE!"}},{"$f":"IF(Menu!$C$10>Menu!$C$11,Menu!$C$10,IF(BN149>100,Menu!$C$10,Menu!$C$11))","v":{"$error":"#VALUE!"}},{"$f":"IF(AH149=\"TBD\",\"TBD\",((AH149-100)/100)*BO149*G149)","v":{"$error":"#VALUE!"}},{"$f":"(AK149*0.15)+(AM149*0.3)+(AO149*0.15)+(AQ149*0.4)","v":{"$error":"#VALUE!"}},{"$f":"IF(OR(AK149=\"TBD\",AM149=\"TBD\",AO149=\"TBD\",AQ149=\"TBD\"),\"TBD\",astmrnd(BQ149,0))","v":{"$error":"#VALUE!"}},{"$f":"IF(Menu!$C$10>Menu!$C$11,Menu!$C$10,IF(BR149>100,Menu!$C$10,Menu!$C$11))","v":{"$error":"#VALUE!"}},{"$f":"IF(AR149=\"TBD\",\"TBD\",((AR149-100)/100)*BS149*G149)","v":{"$error":"#VALUE!"}},{"$f":"(AU149*0.15)+(AW149*0.3)+(AY149*0.15)+(BA149*0.4)","v":{"$error":"#VALUE!"}},{"$f":"IF(OR(AU149=\"TBD\",AW149=\"TBD\",AY149=\"TBD\",BA149=\"TBD\"),\"TBD\",astmrnd(BU149,0))","v":{"$error":"#VALUE!"}},{"$f":"IF(Menu!$C$10>Menu!$C$11,Menu!$C$10,IF(BV149>100,Menu!$C$10,Menu!$C$11))","v":{"$error":"#VALUE!"}},{"$f":"IF(BB149=\"TBD\",\"TBD\",((BB149-100)/100)*BW149*G149)","v":{"$error":"#VALUE!"}}]
[null,null,null,null,35]
[null,null,null,null,35]
[null,null,null,null,35]
[null,null,{"$f":"IF(B153=0,\"\",$C$6)","v":""},null,36,null,null,null,null,null,null,null,{"$f":"BG153","v":0},null,null,null,null,{"$f":"BI153","v":0},null,null,null,null,{"$f":"BK153","v":0},null,null,{"$f":"IF(I153=0,\"NA\",ABS(I153-$H153))","v":"NA"},{"$f":"IF(Z153=\"NA\",\"NA\",IF(Z153<0.46,105-(11.1111*Z153),IF(Z153<1.01,181.8181-(181.8181*Z153),\"TBD\")))","v":"NA"},{"$f":"IF(J153=0,\"NA\",ABS(J153-$R$4))","v":"NA"},{"$f":"IF(AB153=\"NA\",\"NA\",IF(J153<1,\"TBD\",IF(AB153<1.01,105-(5*AB153),IF(AB153<2.01,140-(40*AB153),\"TBD\"))))","v":"NA"},{"$f":"IF(K153=0,\"NA\",ABS(K153-$T$4))","v":"NA"},{"$f":"IF(AD153=\"NA\",\"NA\",IF(AD153<1.01,105-(5*AD153),IF(AD153<$BG$7,168-(69*AD153),\"TBD\")))","v":"NA"},{"$f":"IF(BG153=0,\"NA\",BG153)","v":"NA"},{"$f":"IF(Z153=\"NA\",\"NA\",IF(Search!$W$3=2,100,IF(AF153>$BM$7,105,IF(AF153>$BN$7,(($BQ$7*AF153)-$BR$7),IF(AF153>$BO$7,(($BS$7*AF153)-$BT$7),\"TBD\")))))","v":"NA"},{"$f":"IF(OR(AA153=\"TBD\",AC153=\"TBD\",AE153=\"TBD\",AG153=\"TBD\"),\"TBD\",IF(Z153=\"NA\",\"NA\",BN153))","v":"NA"},{"$f":"IF(Z153=\"NA\",\"NA\",IF(BP153=\"TBD\",\"TBD\",astmrnd(BP153,2)))","v":"NA"},{"$f":"IF(N153=0,\"NA\",ABS(N153-$H153))","v":"NA"},{"$f":"IF(AJ153=\"NA\",\"NA\",IF(AJ153<0.46,105-(11.1111*AJ153),IF(AJ153<1.01,181.8181-(181.8181*AJ153),\"TBD\")))","v":"NA"},{"$f":"IF(O153=0,\"NA\",ABS(O153-$R$4))","v":"NA"},{"$f":"IF(AL153=\"NA\",\"NA\",IF(O153<1,\"TBD\",IF(AL153<1.01,105-(5*AL153),IF(AL153<2.01,140-(40*AL153),\"TBD\"))))","v":"NA"},{"$f":"IF(P153=0,\"NA\",ABS(P153-$T$4))","v":"NA"},{"$f":"IF(AN153=\"NA\",\"NA\",IF(AN153<1.01,105-(5*AN153),IF(AN153<$BG$7,168-(69*AN153),\"TBD\")))","v":"NA"},{"$f":"IF(BI153=0,\"NA\",BI153)","v":"NA"},{"$f":"IF(AJ153=\"NA\",\"NA\",IF(Search!$W$3=2,100,IF(AP153>$BM$7,105,IF(AP153>$BN$7,(($BQ$7*AP153)-$BR$7),IF(AP153>$BO$7,(($BS$7*AP153)-$BT$7),\"TBD\")))))","v":"NA"},{"$f":"IF(OR(AK153=\"TBD\",AM153=\"TBD\",AO153=\"TBD\",AQ153=\"TBD\"),\"TBD\",IF(AJ153=\"NA\",\"NA\",BR153))","v":"NA"},{"$f":"IF(AJ153=\"NA\",\"NA\",IF(BT153=\"TBD\",\"TBD\",astmrnd(BT153,2)))","v":"NA"},{"$f":"IF(S153=0,\"NA\",ABS(S153-$H153))","v":"NA"},{"$f":"IF(AT153=\"NA\",\"NA\",IF(AT153<0.46,105-(11.1111*AT153),IF(AT153<1.01,181.8181-(181.8181*AT153),\"TBD\")))","v":"NA"},{"$f":"IF(T153=0,\"NA\",ABS(T153-$R$4))","v":"NA"},{"$f":"IF(AV153=\"NA\",\"NA\",IF(T153<1,\"TBD\",IF(AV153<1.01,105-(5*AV153),IF(AV153<2.01,140-(40*AV153),\"TBD\"))))","v":"NA"},{"$f":"IF(U153=0,\"NA\",ABS(U153-$T$4))","v":"NA"},{"$f":"IF(AX153=\"NA\",\"NA\",IF(AX153<1.01,105-(5*AX153),IF(AX153<$BG$7,168-(69*AX153),\"TBD\")))","v":"NA"},{"$f":"IF(BK153=0,\"NA\",BK153)","v":"NA"},{"$f":"IF(AT153=\"NA\",\"NA\",IF(Search!$W$3=2,100,IF(AZ153>$BM$7,105,IF(AZ153>$BN$7,(($BQ$7*AZ153)-$BR$7),IF(AZ153>$BO$7,(($BS$7*AZ153)-$BT$7),\"TBD\")))))","v":"NA"},{"$f":"IF(OR(AU153=\"TBD\",AW153=\"TBD\",AY153=\"TBD\",BA153=\"TBD\"),\"TBD\",IF(AT153=\"NA\",\"NA\",BV153))","v":"NA"},{"$f":"IF(AT153=\"NA\",\"NA\",IF(BX153=\"TBD\",\"TBD\",astmrnd(BX153,2)))","v":"NA"},null,null,{"$f":"IF(SUM(L153:L156)=0,0,AVERAGE(L153:L156))","v":0},{"$f":"IF(OR(Search!$W$3=4,Search!$W$3=5,BF153=0),0,astmrnd(BF153,2))","v":0},{"$f":"IF(SUM(Q153:Q156)=0,0,AVERAGE(Q153:Q156))","v":0},{"$f":"IF(OR(Search!$W$3=4,Search!$W$3=5,BH153=0),0,astmrnd(BH153,2))","v":0},{"$f":"IF(SUM(V153:V156)=0,0,AVERAGE(V153:V156))","v":0},{"$f":"IF(OR(Search!$W$3=4,Search!$W$3=5,BJ153=0),0,astmrnd(BJ153,2))","v":0},null,{"$f":"(AA153*0.15)+(AC153*0.3)+(AE153*0.15)+(AG153*0.4)","v":{"$error":"#VALUE!"}},{"$f":"IF(OR(AA153=\"TBD\",AC153=\"TBD\",AE153=\"TBD\",AG153=\"TBD\"),\"TBD\",astmrnd(BM153,0))","v":{"$error":"#VALUE!"}},{"$f":"IF(Menu!$C$10>Menu!$C$11,Menu!$C$10,IF(BN153>100,Menu!$C$10,Menu!$C$11))","v":{"$error":"#VALUE!"}},{"$f":"IF(AH153=\"TBD\",\"TBD\",((AH153-100)/100)*BO153*G153)","v":{"$error":"#VALUE!"}},{"$f":"(AK153*0.15)+(AM153*0.3)+(AO153*0.15)+(AQ153*0.4)","v":{"$error":"#VALUE!"}},{"$f":"IF(OR(AK153=\"TBD\",AM153=\"TBD\",AO153=\"TBD\",AQ153=\"TBD\"),\"TBD\",astmrnd(BQ153,0))","v":{"$error":"#VALUE!"}},{"$f":"IF(Menu!$C$10>Menu!$C$11,Menu!$C$10,IF(BR153>100,Menu!$C$10,Menu!$C$11))","v":{"$error":"#VALUE!"}},{"$f":"IF(AR153=\"TBD\",\"TBD\",((AR153-100)/100)*BS153*G153)","v":{"$error":"#VALUE!"}},{"$f":"(AU153*0.15)+(AW153*0.3)+(AY153*0.15)+(BA153*0.4)","v":{"$error":"#VALUE!"}},{"$f":"IF(OR(AU153=\"TBD\",AW153=\"TBD\",AY153=\"TBD\",BA153=\"TBD\"),\"TBD\",astmrnd(BU153,0))","v":{"$error":"#VALUE!"}},{"$f":"IF(Menu!$C$10>Menu!$C$11,Menu!$C$10,IF(BV153>100,Menu!$C$10,Menu!$C$11))","v":{"$error":"#VALUE!"}},{"$f":"IF(BB153=\"TBD\",\"TBD\",((BB153-100)/100)*BW153*G153)","v":{"$error":"#VALUE!"}}]
[null,null,null,null,36]
[null,null,null,null,36]
[null,null,null,null,36]
[null,null,{"$f":"IF(B157=0,\"\",$C$6)","v":""},null,37,null,null,null,null,null,null,null,{"$f":"BG157","v":0},null,null,null,null,{"$f":"BI157","v":0},null,null,null,null,{"$f":"BK157","v":0},null,null,{"$f":"IF(I157=0,\"NA\",ABS(I157-$H157))","v":"NA"},{"$f":"IF(Z157=\"NA\",\"NA\",IF(Z157<0.46,105-(11.1111*Z157),IF(Z157<1.01,181.8181-(181.8181*Z157),\"TBD\")))","v":"NA"},{"$f":"IF(J157=0,\"NA\",ABS(J157-$R$4))","v":"NA"},{"$f":"IF(AB157=\"NA\",\"NA\",IF(J157<1,\"TBD\",IF(AB157<1.01,105-(5*AB157),IF(AB157<2.01,140-(40*AB157),\"TBD\"))))","v":"NA"},{"$f":"IF(K157=0,\"NA\",ABS(K157-$T$4))","v":"NA"},{"$f":"IF(AD157=\"NA\",\"NA\",IF(AD157<1.01,105-(5*AD157),IF(AD157<$BG$7,168-(69*AD157),\"TBD\")))","v":"NA"},{"$f":"IF(BG157=0,\"NA\",BG157)","v":"NA"},{"$f":"IF(Z157=\"NA\",\"NA\",IF(Search!$W$3=2,100,IF(AF157>$BM$7,105,IF(AF157>$BN$7,(($BQ$7*AF157)-$BR$7),IF(AF157>$BO$7,(($BS$7*AF157)-$BT$7),\"TBD\")))))","v":"NA"},{"$f":"IF(OR(AA157=\"TBD\",AC157=\"TBD\",AE157=\"TBD\",AG157=\"TBD\"),\"TBD\",IF(Z157=\"NA\",\"NA\",BN157))","v":"NA"},{"$f":"IF(Z157=\"NA\",\"NA\",IF(BP157=\"TBD\",\"TBD\",astmrnd(BP157,2)))","v":"NA"},{"$f":"IF(N157=0,\"NA\",ABS(N157-$H157))","v":"NA"},{"$f":"IF(AJ157=\"NA\",\"NA\",IF(AJ157<0.46,105-(11.1111*AJ157),IF(AJ157<1.01,181.8181-(181.8181*AJ157),\"TBD\")))","v":"NA"},{"$f":"IF(O157=0,\"NA\",ABS(O157-$R$4))","v":"NA"},{"$f":"IF(AL157=\"NA\",\"NA\",IF(O157<1,\"TBD\",IF(AL157<1.01,105-(5*AL157),IF(AL157<2.01,140-(40*AL157),\"TBD\"))))","v":"NA"},{"$f":"IF(P157=0,\"NA\",ABS(P157-$T$4))","v":"NA"},{"$f":"IF(AN157=\"NA\",\"NA\",IF(AN157<1.01,105-(5*AN157),IF(AN157<$BG$7,168-(69*AN157),\"TBD\")))","v":"NA"},{"$f":"IF(BI157=0,\"NA\",BI157)","v":"NA"},{"$f":"IF(AJ157=\"NA\",\"NA\",IF(Search!$W$3=2,100,IF(AP157>$BM$7,105,IF(AP157>$BN$7,(($BQ$7*AP157)-$BR$7),IF(AP157>$BO$7,(($BS$7*AP157)-$BT$7),\"TBD\")))))","v":"NA"},{"$f":"IF(OR(AK157=\"TBD\",AM157=\"TBD\",AO157=\"TBD\",AQ157=\"TBD\"),\"TBD\",IF(AJ157=\"NA\",\"NA\",BR157))","v":"NA"},{"$f":"IF(AJ157=\"NA\",\"NA\",IF(BT157=\"TBD\",\"TBD\",astmrnd(BT157,2)))","v":"NA"},{"$f":"IF(S157=0,\"NA\",ABS(S157-$H157))","v":"NA"},{"$f":"IF(AT157=\"NA\",\"NA\",IF(AT157<0.46,105-(11.1111*AT157),IF(AT157<1.01,181.8181-(181.8181*AT157),\"TBD\")))","v":"NA"},{"$f":"IF(T157=0,\"NA\",ABS(T157-$R$4))","v":"NA"},{"$f":"IF(AV157=\"NA\",\"NA\",IF(T157<1,\"TBD\",IF(AV157<1.01,105-(5*AV157),IF(AV157<2.01,140-(40*AV157),\"TBD\"))))","v":"NA"},{"$f":"IF(U157=0,\"NA\",ABS(U157-$T$4))","v":"NA"},{"$f":"IF(AX157=\"NA\",\"NA\",IF(AX157<1.01,105-(5*AX157),IF(AX157<$BG$7,168-(69*AX157),\"TBD\")))","v":"NA"},{"$f":"IF(BK157=0,\"NA\",BK157)","v":"NA"},{"$f":"IF(AT157=\"NA\",\"NA\",IF(Search!$W$3=2,100,IF(AZ157>$BM$7,105,IF(AZ157>$BN$7,(($BQ$7*AZ157)-$BR$7),IF(AZ157>$BO$7,(($BS$7*AZ157)-$BT$7),\"TBD\")))))","v":"NA"},{"$f":"IF(OR(AU157=\"TBD\",AW157=\"TBD\",AY157=\"TBD\",BA157=\"TBD\"),\"TBD\",IF(AT157=\"NA\",\"NA\",BV157))","v":"NA"},{"$f":"IF(AT157=\"NA\",\"NA\",IF(BX157=\"TBD\",\"TBD\",astmrnd(BX157,2)))","v":"NA"},null,null,{"$f":"IF(SUM(L157:L160)=0,0,AVERAGE(L157:L160))","v":0},{"$f":"IF(OR(Search!$W$3=4,Search!$W$3=5,BF157=0),0,astmrnd(BF157,2))","v":0},{"$f":"IF(SUM(Q157:Q160)=0,0,AVERAGE(Q157:Q160))","v":0},{"$f":"IF(OR(Search!$W$3=4,Search!$W$3=5,BH157=0),0,astmrnd(BH157,2))","v":0},{"$f":"IF(SUM(V157:V160)=0,0,AVERAGE(V157:V160))","v":0},{"$f":"IF(OR(Search!$W$3=4,Search!$W$3=5,BJ157=0),0,astmrnd(BJ157,2))","v":0},null,{"$f":"(AA157*0.15)+(AC157*0.3)+(AE157*0.15)+(AG157*0.4)","v":{"$error":"#VALUE!"}},{"$f":"IF(OR(AA157=\"TBD\",AC157=\"TBD\",AE157=\"TBD\",AG157=\"TBD\"),\"TBD\",astmrnd(BM157,0))","v":{"$error":"#VALUE!"}},{"$f":"IF(Menu!$C$10>Menu!$C$11,Menu!$C$10,IF(BN157>100,Menu!$C$10,Menu!$C$11))","v":{"$error":"#VALUE!"}},{"$f":"IF(AH157=\"TBD\",\"TBD\",((AH157-100)/100)*BO157*G157)","v":{"$error":"#VALUE!"}},{"$f":"(AK157*0.15)+(AM157*0.3)+(AO157*0.15)+(AQ157*0.4)","v":{"$error":"#VALUE!"}},{"$f":"IF(OR(AK157=\"TBD\",AM157=\"TBD\",AO157=\"TBD\",AQ157=\"TBD\"),\"TBD\",astmrnd(BQ157,0))","v":{"$error":"#VALUE!"}},{"$f":"IF(Menu!$C$10>Menu!$C$11,Menu!$C$10,IF(BR157>100,Menu!$C$10,Menu!$C$11))","v":{"$error":"#VALUE!"}},{"$f":"IF(AR157=\"TBD\",\"TBD\",((AR157-100)/100)*BS157*G157)","v":{"$error":"#VALUE!"}},{"$f":"(AU157*0.15)+(AW157*0.3)+(AY157*0.15)+(BA157*0.4)","v":{"$error":"#VALUE!"}},{"$f":"IF(OR(AU157=\"TBD\",AW157=\"TBD\",AY157=\"TBD\",BA157=\"TBD\"),\"TBD\",astmrnd(BU157,0))","v":{"$error":"#VALUE!"}},{"$f":"IF(Menu!$C$10>Menu!$C$11,Menu!$C$10,IF(BV157>100,Menu!$C$10,Menu!$C$11))","v":{"$error":"#VALUE!"}},{"$f":"IF(BB157=\"TBD\",\"TBD\",((BB157-100)/100)*BW157*G157)","v":{"$error":"#VALUE!"}}]
[null,null,null,null,37]
[null,null,null,null,37]
[null,null,null,null,37]
[null,null,{"$f":"IF(B161=0,\"\",$C$6)","v":""},null,38,null,null,null,null,null,null,null,{"$f":"BG161","v":0},null,null,null,null,{"$f":"BI161","v":0},null,null,null,null,{"$f":"BK161","v":0},null,null,{"$f":"IF(I161=0,\"NA\",ABS(I161-$H161))","v":"NA"},{"$f":"IF(Z161=\"NA\",\"NA\",IF(Z161<0.46,105-(11.1111*Z161),IF(Z161<1.01,181.8181-(181.8181*Z161),\"TBD\")))","v":"NA"},{"$f":"IF(J161=0,\"NA\",ABS(J161-$R$4))","v":"NA"},{"$f":"IF(AB161=\"NA\",\"NA\",IF(J161<1,\"TBD\",IF(AB161<1.01,105-(5*AB161),IF(AB161<2.01,140-(40*AB161),\"TBD\"))))","v":"NA"},{"$f":"IF(K161=0,\"NA\",ABS(K161-$T$4))","v":"NA"},{"$f":"IF(AD161=\"NA\",\"NA\",IF(AD161<1.01,105-(5*AD161),IF(AD161<$BG$7,168-(69*AD161),\"TBD\")))","v":"NA"},{"$f":"IF(BG161=0,\"NA\",BG161)","v":"NA"},{"$f":"IF(Z161=\"NA\",\"NA\",IF(Search!$W$3=2,100,IF(AF161>$BM$7,105,IF(AF161>$BN$7,(($BQ$7*AF161)-$BR$7),IF(AF161>$BO$7,(($BS$7*AF161)-$BT$7),\"TBD\")))))","v":"NA"},{"$f":"IF(OR(AA161=\"TBD\",AC161=\"TBD\",AE161=\"TBD\",AG161=\"TBD\"),\"TBD\",IF(Z161=\"NA\",\"NA\",BN161))","v":"NA"},{"$f":"IF(Z161=\"NA\",\"NA\",IF(BP161=\"TBD\",\"TBD\",astmrnd(BP161,2)))","v":"NA"},{"$f":"IF(N161=0,\"NA\",ABS(N161-$H161))","v":"NA"},{"$f":"IF(AJ161=\"NA\",\"NA\",IF(AJ161<0.46,105-(11.1111*AJ161),IF(AJ161<1.01,181.8181-(181.8181*AJ161),\"TBD\")))","v":"NA"},{"$f":"IF(O161=0,\"NA\",ABS(O161-$R$4))","v":"NA"},{"$f":"IF(AL161=\"NA\",\"NA\",IF(O161<1,\"TBD\",IF(AL161<1.01,105-(5*AL161),IF(AL161<2.01,140-(40*AL161),\"TBD\"))))","v":"NA"},{"$f":"IF(P161=0,\"NA\",ABS(P161-$T$4))","v":"NA"},{"$f":"IF(AN161=\"NA\",\"NA\",IF(AN161<1.01,105-(5*AN161),IF(AN161<$BG$7,168-(69*AN161),\"TBD\")))","v":"NA"},{"$f":"IF(BI161=0,\"NA\",BI161)","v":"NA"},{"$f":"IF(AJ161=\"NA\",\"NA\",IF(Search!$W$3=2,100,IF(AP161>$BM$7,105,IF(AP161>$BN$7,(($BQ$7*AP161)-$BR$7),IF(AP161>$BO$7,(($BS$7*AP161)-$BT$7),\"TBD\")))))","v":"NA"},{"$f":"IF(OR(AK161=\"TBD\",AM161=\"TBD\",AO161=\"TBD\",AQ161=\"TBD\"),\"TBD\",IF(AJ161=\"NA\",\"NA\",BR161))","v":"NA"},{"$f":"IF(AJ161=\"NA\",\"NA\",IF(BT161=\"TBD\",\"TBD\",astmrnd(BT161,2)))","v":"NA"},{"$f":"IF(S161=0,\"NA\",ABS(S161-$H161))","v":"NA"},{"$f":"IF(AT161=\"NA\",\"NA\",IF(AT161<0.46,105-(11.1111*AT161),IF(AT161<1.01,181.8181-(181.8181*AT161),\"TBD\")))","v":"NA"},{"$f":"IF(T161=0,\"NA\",ABS(T161-$R$4))","v":"NA"},{"$f":"IF(AV161=\"NA\",\"NA\",IF(T161<1,\"TBD\",IF(AV161<1.01,105-(5*AV161),IF(AV161<2.01,140-(40*AV161),\"TBD\"))))","v":"NA"},{"$f":"IF(U161=0,\"NA\",ABS(U161-$T$4))","v":"NA"},{"$f":"IF(AX161=\"NA\",\"NA\",IF(AX161<1.01,105-(5*AX161),IF(AX161<$BG$7,168-(69*AX161),\"TBD\")))","v":"NA"},{"$f":"IF(BK161=0,\"NA\",BK161)","v":"NA"},{"$f":"IF(AT161=\"NA\",\"NA\",IF(Search!$W$3=2,100,IF(AZ161>$BM$7,105,IF(AZ161>$BN$7,(($BQ$7*AZ161)-$BR$7),IF(AZ161>$BO$7,(($BS$7*AZ161)-$BT$7),\"TBD\")))))","v":"NA"},{"$f":"IF(OR(AU161=\"TBD\",AW161=\"TBD\",AY161=\"TBD\",BA161=\"TBD\"),\"TBD\",IF(AT161=\"NA\",\"NA\",BV161))","v":"NA"},{"$f":"IF(AT161=\"NA\",\"NA\",IF(BX161=\"TBD\",\"TBD\",astmrnd(BX161,2)))","v":"NA"},null,null,{"$f":"IF(SUM(L161:L164)=0,0,AVERAGE(L161:L164))","v":0},{"$f":"IF(OR(Search!$W$3=4,Search!$W$3=5,BF161=0),0,astmrnd(BF161,2))","v":0},{"$f":"IF(SUM(Q161:Q164)=0,0,AVERAGE(Q161:Q164))","v":0},{"$f":"IF(OR(Search!$W$3=4,Search!$W$3=5,BH161=0),0,astmrnd(BH161,2))","v":0},{"$f":"IF(SUM(V161:V164)=0,0,AVERAGE(V161:V164))","v":0},{"$f":"IF(OR(Search!$W$3=4,Search!$W$3=5,BJ161=0),0,astmrnd(BJ161,2))","v":0},null,{"$f":"(AA161*0.15)+(AC161*0.3)+(AE161*0.15)+(AG161*0.4)","v":{"$error":"#VALUE!"}},{"$f":"IF(OR(AA161=\"TBD\",AC161=\"TBD\",AE161=\"TBD\",AG161=\"TBD\"),\"TBD\",astmrnd(BM161,0))","v":{"$error":"#VALUE!"}},{"$f":"IF(Menu!$C$10>Menu!$C$11,Menu!$C$10,IF(BN161>100,Menu!$C$10,Menu!$C$11))","v":{"$error":"#VALUE!"}},{"$f":"IF(AH161=\"TBD\",\"TBD\",((AH161-100)/100)*BO161*G161)","v":{"$error":"#VALUE!"}},{"$f":"(AK161*0.15)+(AM161*0.3)+(AO161*0.15)+(AQ161*0.4)","v":{"$error":"#VALUE!"}},{"$f":"IF(OR(AK161=\"TBD\",AM161=\"TBD\",AO161=\"TBD\",AQ161=\"TBD\"),\"TBD\",astmrnd(BQ161,0))","v":{"$error":"#VALUE!"}},{"$f":"IF(Menu!$C$10>Menu!$C$11,Menu!$C$10,IF(BR161>100,Menu!$C$10,Menu!$C$11))","v":{"$error":"#VALUE!"}},{"$f":"IF(AR161=\"TBD\",\"TBD\",((AR161-100)/100)*BS161*G161)","v":{"$error":"#VALUE!"}},{"$f":"(AU161*0.15)+(AW161*0.3)+(AY161*0.15)+(BA161*0.4)","v":{"$error":"#VALUE!"}},{"$f":"IF(OR(AU161=\"TBD\",AW161=\"TBD\",AY161=\"TBD\",BA161=\"TBD\"),\"TBD\",astmrnd(BU161,0))","v":{"$error":"#VALUE!"}},{"$f":"IF(Menu!$C$10>Menu!$C$11,Menu!$C$10,IF(BV161>100,Menu!$C$10,Menu!$C$11))","v":{"$error":"#VALUE!"}},{"$f":"IF(BB161=\"TBD\",\"TBD\",((BB161-100)/100)*BW161*G161)","v":{"$error":"#VALUE!"}}]
[null,null,null,null,38]
[null,null,null,null,38]
[null,null,null,null,38]
[null,null,{"$f":"IF(B165=0,\"\",$C$6)","v":""},null,39,null,null,null,null,null,null,null,{"$f":"BG165","v":0},null,null,null,null,{"$f":"BI165","v":0},null,null,null,null,{"$f":"BK165","v":0},null,null,{"$f":"IF(I165=0,\"NA\",ABS(I165-$H165))","v":"NA"},{"$f":"IF(Z165=\"NA\",\"NA\",IF(Z165<0.46,105-(11.1111*Z165),IF(Z165<1.01,181.8181-(181.8181*Z165),\"TBD\")))","v":"NA"},{"$f":"IF(J165=0,\"NA\",ABS(J165-$R$4))","v":"NA"},{"$f":"IF(AB165=\"NA\",\"NA\",IF(J165<1,\"TBD\",IF(AB165<1.01,105-(5*AB165),IF(AB165<2.01,140-(40*AB165),\"TBD\"))))","v":"NA"},{"$f":"IF(K165=0,\"NA\",ABS(K165-$T$4))","v":"NA"},{"$f":"IF(AD165=\"NA\",\"NA\",IF(AD165<1.01,105-(5*AD165),IF(AD165<$BG$7,168-(69*AD165),\"TBD\")))","v":"NA"},{"$f":"IF(BG165=0,\"NA\",BG165)","v":"NA"},{"$f":"IF(Z165=\"NA\",\"NA\",IF(Search!$W$3=2,100,IF(AF165>$BM$7,105,IF(AF165>$BN$7,(($BQ$7*AF165)-$BR$7),IF(AF165>$BO$7,(($BS$7*AF165)-$BT$7),\"TBD\")))))","v":"NA"},{"$f":"IF(OR(AA165=\"TBD\",AC165=\"TBD\",AE165=\"TBD\",AG165=\"TBD\"),\"TBD\",IF(Z165=\"NA\",\"NA\",BN165))","v":"NA"},{"$f":"IF(Z165=\"NA\",\"NA\",IF(BP165=\"TBD\",\"TBD\",astmrnd(BP165,2)))","v":"NA"},{"$f":"IF(N165=0,\"NA\",ABS(N165-$H165))","v":"NA"},{"$f":"IF(AJ165=\"NA\",\"NA\",IF(AJ165<0.46,105-(11.1111*AJ165),IF(AJ165<1.01,181.8181-(181.8181*AJ165),\"TBD\")))","v":"NA"},{"$f":"IF(O165=0,\"NA\",ABS(O165-$R$4))","v":"NA"},{"$f":"IF(AL165=\"NA\",\"NA\",IF(O165<1,\"TBD\",IF(AL165<1.01,105-(5*AL165),IF(AL165<2.01,140-(40*AL165),\"TBD\"))))","v":"NA"},{"$f":"IF(P165=0,\"NA\",ABS(P165-$T$4))","v":"NA"},{"$f":"IF(AN165=\"NA\",\"NA\",IF(AN165<1.01,105-(5*AN165),IF(AN165<$BG$7,168-(69*AN165),\"TBD\")))","v":"NA"},{"$f":"IF(BI165=0,\"NA\",BI165)","v":"NA"},{"$f":"IF(AJ165=\"NA\",\"NA\",IF(Search!$W$3=2,100,IF(AP165>$BM$7,105,IF(AP165>$BN$7,(($BQ$7*AP165)-$BR$7),IF(AP165>$BO$7,(($BS$7*AP165)-$BT$7),\"TBD\")))))","v":"NA"},{"$f":"IF(OR(AK165=\"TBD\",AM165=\"TBD\",AO165=\"TBD\",AQ165=\"TBD\"),\"TBD\",IF(AJ165=\"NA\",\"NA\",BR165))","v":"NA"},{"$f":"IF(AJ165=\"NA\",\"NA\",IF(BT165=\"TBD\",\"TBD\",astmrnd(BT165,2)))","v":"NA"},{"$f":"IF(S165=0,\"NA\",ABS(S165-$H165))","v":"NA"},{"$f":"IF(AT165=\"NA\",\"NA\",IF(AT165<0.46,105-(11.1111*AT165),IF(AT165<1.01,181.8181-(181.8181*AT165),\"TBD\")))","v":"NA"},{"$f":"IF(T165=0,\"NA\",ABS(T165-$R$4))","v":"NA"},{"$f":"IF(AV165=\"NA\",\"NA\",IF(T165<1,\"TBD\",IF(AV165<1.01,105-(5*AV165),IF(AV165<2.01,140-(40*AV165),\"TBD\"))))","v":"NA"},{"$f":"IF(U165=0,\"NA\",ABS(U165-$T$4))","v":"NA"},{"$f":"IF(AX165=\"NA\",\"NA\",IF(AX165<1.01,105-(5*AX165),IF(AX165<$BG$7,168-(69*AX165),\"TBD\")))","v":"NA"},{"$f":"IF(BK165=0,\"NA\",BK165)","v":"NA"},{"$f":"IF(AT165=\"NA\",\"NA\",IF(Search!$W$3=2,100,IF(AZ165>$BM$7,105,IF(AZ165>$BN$7,(($BQ$7*AZ165)-$BR$7),IF(AZ165>$BO$7,(($BS$7*AZ165)-$BT$7),\"TBD\")))))","v":"NA"},{"$f":"IF(OR(AU165=\"TBD\",AW165=\"TBD\",AY165=\"TBD\",BA165=\"TBD\"),\"TBD\",IF(AT165=\"NA\",\"NA\",BV165))","v":"NA"},{"$f":"IF(AT165=\"NA\",\"NA\",IF(BX165=\"TBD\",\"TBD\",astmrnd(BX165,2)))","v":"NA"},null,null,{"$f":"IF(SUM(L165:L168)=0,0,AVERAGE(L165:L168))","v":0},{"$f":"IF(OR(Search!$W$3=4,Search!$W$3=5,BF165=0),0,astmrnd(BF165,2))","v":0},{"$f":"IF(SUM(Q165:Q168)=0,0,AVERAGE(Q165:Q168))","v":0},{"$f":"IF(OR(Search!$W$3=4,Search!$W$3=5,BH165=0),0,astmrnd(BH165,2))","v":0},{"$f":"IF(SUM(V165:V168)=0,0,AVERAGE(V165:V168))","v":0},{"$f":"IF(OR(Search!$W$3=4,Search!$W$3=5,BJ165=0),0,astmrnd(BJ165,2))","v":0},null,{"$f":"(AA165*0.15)+(AC165*0.3)+(AE165*0.15)+(AG165*0.4)","v":{"$error":"#VALUE!"}},{"$f":"IF(OR(AA165=\"TBD\",AC165=\"TBD\",AE165=\"TBD\",AG165=\"TBD\"),\"TBD\",astmrnd(BM165,0))","v":{"$error":"#VALUE!"}},{"$f":"IF(Menu!$C$10>Menu!$C$11,Menu!$C$10,IF(BN165>100,Menu!$C$10,Menu!$C$11))","v":{"$error":"#VALUE!"}},{"$f":"IF(AH165=\"TBD\",\"TBD\",((AH165-100)/100)*BO165*G165)","v":{"$error":"#VALUE!"}},{"$f":"(AK165*0.15)+(AM165*0.3)+(AO165*0.15)+(AQ165*0.4)","v":{"$error":"#VALUE!"}},{"$f":"IF(OR(AK165=\"TBD\",AM165=\"TBD\",AO165=\"TBD\",AQ165=\"TBD\"),\"TBD\",astmrnd(BQ165,0))","v":{"$error":"#VALUE!"}},{"$f":"IF(Menu!$C$10>Menu!$C$11,Menu!$C$10,IF(BR165>100,Menu!$C$10,Menu!$C$11))","v":{"$error":"#VALUE!"}},{"$f":"IF(AR165=\"TBD\",\"TBD\",((AR165-100)/100)*BS165*G165)","v":{"$error":"#VALUE!"}},{"$f":"(AU165*0.15)+(AW165*0.3)+(AY165*0.15)+(BA165*0.4)","v":{"$error":"#VALUE!"}},{"$f":"IF(OR(AU165=\"TBD\",AW165=\"TBD\",AY165=\"TBD\",BA165=\"TBD\"),\"TBD\",astmrnd(BU165,0))","v":{"$error":"#VALUE!"}},{"$f":"IF(Menu!$C$10>Menu!$C$11,Menu!$C$10,IF(BV165>100,Menu!$C$10,Menu!$C$11))","v":{"$error":"#VALUE!"}},{"$f":"IF(BB165=\"TBD\",\"TBD\",((BB165-100)/100)*BW165*G165)","v":{"$error":"#VALUE!"}}]
[null,null,null,null,39]
[null,null,null,null,39]
[null,null,null,null,39]
[null,null,{"$f":"IF(B169=0,\"\",$C$6)","v":""},null,40,null,null,null,null,null,null,null,{"$f":"BG169","v":0},null,null,null,null,{"$f":"BI169","v":0},null,null,null,null,{"$f":"BK169","v":0},null,null,{"$f":"IF(I169=0,\"NA\",ABS(I169-$H169))","v":"NA"},{"$f":"IF(Z169=\"NA\",\"NA\",IF(Z169<0.46,105-(11.1111*Z169),IF(Z169<1.01,181.8181-(181.8181*Z169),\"TBD\")))","v":"NA"},{"$f":"IF(J169=0,\"NA\",ABS(J169-$R$4))","v":"NA"},{"$f":"IF(AB169=\"NA\",\"NA\",IF(J169<1,\"TBD\",IF(AB169<1.01,105-(5*AB169),IF(AB169<2.01,140-(40*AB169),\"TBD\"))))","v":"NA"},{"$f":"IF(K169=0,\"NA\",ABS(K169-$T$4))","v":"NA"},{"$f":"IF(AD169=\"NA\",\"NA\",IF(AD169<1.01,105-(5*AD169),IF(AD169<$BG$7,168-(69*AD169),\"TBD\")))","v":"NA"},{"$f":"IF(BG169=0,\"NA\",BG169)","v":"NA"},{"$f":"IF(Z169=\"NA\",\"NA\",IF(Search!$W$3=2,100,IF(AF169>$BM$7,105,IF(AF169>$BN$7,(($BQ$7*AF169)-$BR$7),IF(AF169>$BO$7,(($BS$7*AF169)-$BT$7),\"TBD\")))))","v":"NA"},{"$f":"IF(OR(AA169=\"TBD\",AC169=\"TBD\",AE169=\"TBD\",AG169=\"TBD\"),\"TBD\",IF(Z169=\"NA\",\"NA\",BN169))","v":"NA"},{"$f":"IF(Z169=\"NA\",\"NA\",IF(BP169=\"TBD\",\"TBD\",astmrnd(BP169,2)))","v":"NA"},{"$f":"IF(N169=0,\"NA\",ABS(N169-$H169))","v":"NA"},{"$f":"IF(AJ169=\"NA\",\"NA\",IF(AJ169<0.46,105-(11.1111*AJ169),IF(AJ169<1.01,181.8181-(181.8181*AJ169),\"TBD\")))","v":"NA"},{"$f":"IF(O169=0,\"NA\",ABS(O169-$R$4))","v":"NA"},{"$f":"IF(AL169=\"NA\",\"NA\",IF(O169<1,\"TBD\",IF(AL169<1.01,105-(5*AL169),IF(AL169<2.01,140-(40*AL169),\"TBD\"))))","v":"NA"},{"$f":"IF(P169=0,\"NA\",ABS(P169-$T$4))","v":"NA"},{"$f":"IF(AN169=\"NA\",\"NA\",IF(AN169<1.01,105-(5*AN169),IF(AN169<$BG$7,168-(69*AN169),\"TBD\")))","v":"NA"},{"$f":"IF(BI169=0,\"NA\",BI169)","v":"NA"},{"$f":"IF(AJ169=\"NA\",\"NA\",IF(Search!$W$3=2,100,IF(AP169>$BM$7,105,IF(AP169>$BN$7,(($BQ$7*AP169)-$BR$7),IF(AP169>$BO$7,(($BS$7*AP169)-$BT$7),\"TBD\")))))","v":"NA"},{"$f":"IF(OR(AK169=\"TBD\",AM169=\"TBD\",AO169=\"TBD\",AQ169=\"TBD\"),\"TBD\",IF(AJ169=\"NA\",\"NA\",BR169))","v":"NA"},{"$f":"IF(AJ169=\"NA\",\"NA\",IF(BT169=\"TBD\",\"TBD\",astmrnd(BT169,2)))","v":"NA"},{"$f":"IF(S169=0,\"NA\",ABS(S169-$H169))","v":"NA"},{"$f":"IF(AT169=\"NA\",\"NA\",IF(AT169<0.46,105-(11.1111*AT169),IF(AT169<1.01,181.8181-(181.8181*AT169),\"TBD\")))","v":"NA"},{"$f":"IF(T169=0,\"NA\",ABS(T169-$R$4))","v":"NA"},{"$f":"IF(AV169=\"NA\",\"NA\",IF(T169<1,\"TBD\",IF(AV169<1.01,105-(5*AV169),IF(AV169<2.01,140-(40*AV169),\"TBD\"))))","v":"NA"},{"$f":"IF(U169=0,\"NA\",ABS(U169-$T$4))","v":"NA"},{"$f":"IF(AX169=\"NA\",\"NA\",IF(AX169<1.01,105-(5*AX169),IF(AX169<$BG$7,168-(69*AX169),\"TBD\")))","v":"NA"},{"$f":"IF(BK169=0,\"NA\",BK169)","v":"NA"},{"$f":"IF(AT169=\"NA\",\"NA\",IF(Search!$W$3=2,100,IF(AZ169>$BM$7,105,IF(AZ169>$BN$7,(($BQ$7*AZ169)-$BR$7),IF(AZ169>$BO$7,(($BS$7*AZ169)-$BT$7),\"TBD\")))))","v":"NA"},{"$f":"IF(OR(AU169=\"TBD\",AW169=\"TBD\",AY169=\"TBD\",BA169=\"TBD\"),\"TBD\",IF(AT169=\"NA\",\"NA\",BV169))","v":"NA"},{"$f":"IF(AT169=\"NA\",\"NA\",IF(BX169=\"TBD\",\"TBD\",astmrnd(BX169,2)))","v":"NA"},null,null,{"$f":"IF(SUM(L169:L172)=0,0,AVERAGE(L169:L172))","v":0},{"$f":"IF(OR(Search!$W$3=4,Search!$W$3=5,BF169=0),0,astmrnd(BF169,2))","v":0},{"$f":"IF(SUM(Q169:Q172)=0,0,AVERAGE(Q169:Q172))","v":0},{"$f":"IF(OR(Search!$W$3=4,Search!$W$3=5,BH169=0),0,astmrnd(BH169,2))","v":0},{"$f":"IF(SUM(V169:V172)=0,0,AVERAGE(V169:V172))","v":0},{"$f":"IF(OR(Search!$W$3=4,Search!$W$3=5,BJ169=0),0,astmrnd(BJ169,2))","v":0},null,{"$f":"(AA169*0.15)+(AC169*0.3)+(AE169*0.15)+(AG169*0.4)","v":{"$error":"#VALUE!"}},{"$f":"IF(OR(AA169=\"TBD\",AC169=\"TBD\",AE169=\"TBD\",AG169=\"TBD\"),\"TBD\",astmrnd(BM169,0))","v":{"$error":"#VALUE!"}},{"$f":"IF(Menu!$C$10>Menu!$C$11,Menu!$C$10,IF(BN169>100,Menu!$C$10,Menu!$C$11))","v":{"$error":"#VALUE!"}},{"$f":"IF(AH169=\"TBD\",\"TBD\",((AH169-100)/100)*BO169*G169)","v":{"$error":"#VALUE!"}},{"$f":"(AK169*0.15)+(AM169*0.3)+(AO169*0.15)+(AQ169*0.4)","v":{"$error":"#VALUE!"}},{"$f":"IF(OR(AK169=\"TBD\",AM169=\"TBD\",AO169=\"TBD\",AQ169=\"TBD\"),\"TBD\",astmrnd(BQ169,0))","v":{"$error":"#VALUE!"}},{"$f":"IF(Menu!$C$10>Menu!$C$11,Menu!$C$10,IF(BR169>100,Menu!$C$10,Menu!$C$11))","v":{"$error":"#VALUE!"}},{"$f":"IF(AR169=\"TBD\",\"TBD\",((AR169-100)/100)*BS169*G169)","v":{"$error":"#VALUE!"}},{"$f":"(AU169*0.15)+(AW169*0.3)+(AY169*0.15)+(BA169*0.4)","v":{"$error":"#VALUE!"}},{"$f":"IF(OR(AU169=\"TBD\",AW169=\"TBD\",AY169=\"TBD\",BA169=\"TBD\"),\"TBD\",astmrnd(BU169,0))","v":{"$error":"#VALUE!"}},{"$f":"IF(Menu!$C$10>Menu!$C$11,Menu!$C$10,IF(BV169>100,Menu!$C$10,Menu!$C$11))","v":{"$error":"#VALUE!"}},{"$f":"IF(BB169=\"TBD\",\"TBD\",((BB169-100)/100)*BW169*G169)","v":{"$error":"#VALUE!"}}]
[null,null,null,null,40]
[null,null,null,null,40]
[null,null,null,null,40]
[null,null,{"$f":"IF(B173=0,\"\",$C$6)","v":""},null,41,null,null,null,null,null,null,null,{"$f":"BG173","v":0},null,null,null,null,{"$f":"BI173","v":0},null,null,null,null,{"$f":"BK173","v":0},null,null,{"$f":"IF(I173=0,\"NA\",ABS(I173-$H173))","v":"NA"},{"$f":"IF(Z173=\"NA\",\"NA\",IF(Z173<0.46,105-(11.1111*Z173),IF(Z173<1.01,181.8181-(181.8181*Z173),\"TBD\")))","v":"NA"},{"$f":"IF(J173=0,\"NA\",ABS(J173-$R$4))","v":"NA"},{"$f":"IF(AB173=\"NA\",\"NA\",IF(J173<1,\"TBD\",IF(AB173<1.01,105-(5*AB173),IF(AB173<2.01,140-(40*AB173),\"TBD\"))))","v":"NA"},{"$f":"IF(K173=0,\"NA\",ABS(K173-$T$4))","v":"NA"},{"$f":"IF(AD173=\"NA\",\"NA\",IF(AD173<1.01,105-(5*AD173),IF(AD173<$BG$7,168-(69*AD173),\"TBD\")))","v":"NA"},{"$f":"IF(BG173=0,\"NA\",BG173)","v":"NA"},{"$f":"IF(Z173=\"NA\",\"NA\",IF(Search!$W$3=2,100,IF(AF173>$BM$7,105,IF(AF173>$BN$7,(($BQ$7*AF173)-$BR$7),IF(AF173>$BO$7,(($BS$7*AF173)-$BT$7),\"TBD\")))))","v":"NA"},{"$f":"IF(OR(AA173=\"TBD\",AC173=\"TBD\",AE173=\"TBD\",AG173=\"TBD\"),\"TBD\",IF(Z173=\"NA\",\"NA\",BN173))","v":"NA"},{"$f":"IF(Z173=\"NA\",\"NA\",IF(BP173=\"TBD\",\"TBD\",astmrnd(BP173,2)))","v":"NA"},{"$f":"IF(N173=0,\"NA\",ABS(N173-$H173))","v":"NA"},{"$f":"IF(AJ173=\"NA\",\"NA\",IF(AJ173<0.46,105-(11.1111*AJ173),IF(AJ173<1.01,181.8181-(181.8181*AJ173),\"TBD\")))","v":"NA"},{"$f":"IF(O173=0,\"NA\",ABS(O173-$R$4))","v":"NA"},{"$f":"IF(AL173=\"NA\",\"NA\",IF(O173<1,\"TBD\",IF(AL173<1.01,105-(5*AL173),IF(AL173<2.01,140-(40*AL173),\"TBD\"))))","v":"NA"},{"$f":"IF(P173=0,\"NA\",ABS(P173-$T$4))","v":"NA"},{"$f":"IF(AN173=\"NA\",\"NA\",IF(AN173<1.01,105-(5*AN173),IF(AN173<$BG$7,168-(69*AN173),\"TBD\")))","v":"NA"},{"$f":"IF(BI173=0,\"NA\",BI173)","v":"NA"},{"$f":"IF(AJ173=\"NA\",\"NA\",IF(Search!$W$3=2,100,IF(AP173>$BM$7,105,IF(AP173>$BN$7,(($BQ$7*AP173)-$BR$7),IF(AP173>$BO$7,(($BS$7*AP173)-$BT$7),\"TBD\")))))","v":"NA"},{"$f":"IF(OR(AK173=\"TBD\",AM173=\"TBD\",AO173=\"TBD\",AQ173=\"TBD\"),\"TBD\",IF(AJ173=\"NA\",\"NA\",BR173))","v":"NA"},{"$f":"IF(AJ173=\"NA\",\"NA\",IF(BT173=\"TBD\",\"TBD\",astmrnd(BT173,2)))","v":"NA"},{"$f":"IF(S173=0,\"NA\",ABS(S173-$H173))","v":"NA"},{"$f":"IF(AT173=\"NA\",\"NA\",IF(AT173<0.46,105-(11.1111*AT173),IF(AT173<1.01,181.8181-(181.8181*AT173),\"TBD\")))","v":"NA"},{"$f":"IF(T173=0,\"NA\",ABS(T173-$R$4))","v":"NA"},{"$f":"IF(AV173=\"NA\",\"NA\",IF(T173<1,\"TBD\",IF(AV173<1.01,105-(5*AV173),IF(AV173<2.01,140-(40*AV173),\"TBD\"))))","v":"NA"},{"$f":"IF(U173=0,\"NA\",ABS(U173-$T$4))","v":"NA"},{"$f":"IF(AX173=\"NA\",\"NA\",IF(AX173<1.01,105-(5*AX173),IF(AX173<$BG$7,168-(69*AX173),\"TBD\")))","v":"NA"},{"$f":"IF(BK173=0,\"NA\",BK173)","v":"NA"},{"$f":"IF(AT173=\"NA\",\"NA\",IF(Search!$W$3=2,100,IF(AZ173>$BM$7,105,IF(AZ173>$BN$7,(($BQ$7*AZ173)-$BR$7),IF(AZ173>$BO$7,(($BS$7*AZ173)-$BT$7),\"TBD\")))))","v":"NA"},{"$f":"IF(OR(AU173=\"TBD\",AW173=\"TBD\",AY173=\"TBD\",BA173=\"TBD\"),\"TBD\",IF(AT173=\"NA\",\"NA\",BV173))","v":"NA"},{"$f":"IF(AT173=\"NA\",\"NA\",IF(BX173=\"TBD\",\"TBD\",astmrnd(BX173,2)))","v":"NA"},null,null,{"$f":"IF(SUM(L173:L176)=0,0,AVERAGE(L173:L176))","v":0},{"$f":"IF(OR(Search!$W$3=4,Search!$W$3=5,BF173=0),0,astmrnd(BF173,2))","v":0},{"$f":"IF(SUM(Q173:Q176)=0,0,AVERAGE(Q173:Q176))","v":0},{"$f":"IF(OR(Search!$W$3=4,Search!$W$3=5,BH173=0),0,astmrnd(BH173,2))","v":0},{"$f":"IF(SUM(V173:V176)=0,0,AVERAGE(V173:V176))","v":0},{"$f":"IF(OR(Search!$W$3=4,Search!$W$3=5,BJ173=0),0,astmrnd(BJ173,2))","v":0},null,{"$f":"(AA173*0.15)+(AC173*0.3)+(AE173*0.15)+(AG173*0.4)","v":{"$error":"#VALUE!"}},{"$f":"IF(OR(AA173=\"TBD\",AC173=\"TBD\",AE173=\"TBD\",AG173=\"TBD\"),\"TBD\",astmrnd(BM173,0))","v":{"$error":"#VALUE!"}},{"$f":"IF(Menu!$C$10>Menu!$C$11,Menu!$C$10,IF(BN173>100,Menu!$C$10,Menu!$C$11))","v":{"$error":"#VALUE!"}},{"$f":"IF(AH173=\"TBD\",\"TBD\",((AH173-100)/100)*BO173*G173)","v":{"$error":"#VALUE!"}},{"$f":"(AK173*0.15)+(AM173*0.3)+(AO173*0.15)+(AQ173*0.4)","v":{"$error":"#VALUE!"}},{"$f":"IF(OR(AK173=\"TBD\",AM173=\"TBD\",AO173=\"TBD\",AQ173=\"TBD\"),\"TBD\",astmrnd(BQ173,0))","v":{"$error":"#VALUE!"}},{"$f":"IF(Menu!$C$10>Menu!$C$11,Menu!$C$10,IF(BR173>100,Menu!$C$10,Menu!$C$11))","v":{"$error":"#VALUE!"}},{"$f":"IF(AR173=\"TBD\",\"TBD\",((AR173-100)/100)*BS173*G173)","v":{"$error":"#VALUE!"}},{"$f":"(AU173*0.15)+(AW173*0.3)+(AY173*0.15)+(BA173*0.4)","v":{"$error":"#VALUE!"}},{"$f":"IF(OR(AU173=\"TBD\",AW173=\"TBD\",AY173=\"TBD\",BA173=\"TBD\"),\"TBD\",astmrnd(BU173,0))","v":{"$error":"#VALUE!"}},{"$f":"IF(Menu!$C$10>Menu!$C$11,Menu!$C$10,IF(BV173>100,Menu!$C$10,Menu!$C$11))","v":{"$error":"#VALUE!"}},{"$f":"IF(BB173=\"TBD\",\"TBD\",((BB173-100)/100)*BW173*G173)","v":{"$error":"#VALUE!"}}]
[null,null,null,null,41]
[null,null,null,null,41]
[null,null,null,null,41]
[null,null,{"$f":"IF(B177=0,\"\",$C$6)","v":""},null,42,null,null,null,null,null,null,null,{"$f":"BG177","v":0},null,null,null,null,{"$f":"BI177","v":0},null,null,null,null,{"$f":"BK177","v":0},null,null,{"$f":"IF(I177=0,\"NA\",ABS(I177-$H177))","v":"NA"},{"$f":"IF(Z177=\"NA\",\"NA\",IF(Z177<0.46,105-(11.1111*Z177),IF(Z177<1.01,181.8181-(181.8181*Z177),\"TBD\")))","v":"NA"},{"$f":"IF(J177=0,\"NA\",ABS(J177-$R$4))","v":"NA"},{"$f":"IF(AB177=\"NA\",\"NA\",IF(J177<1,\"TBD\",IF(AB177<1.01,105-(5*AB177),IF(AB177<2.01,140-(40*AB177),\"TBD\"))))","v":"NA"},{"$f":"IF(K177=0,\"NA\",ABS(K177-$T$4))","v":"NA"},{"$f":"IF(AD177=\"NA\",\"NA\",IF(AD177<1.01,105-(5*AD177),IF(AD177<$BG$7,168-(69*AD177),\"TBD\")))","v":"NA"},{"$f":"IF(BG177=0,\"NA\",BG177)","v":"NA"},{"$f":"IF(Z177=\"NA\",\"NA\",IF(Search!$W$3=2,100,IF(AF177>$BM$7,105,IF(AF177>$BN$7,(($BQ$7*AF177)-$BR$7),IF(AF177>$BO$7,(($BS$7*AF177)-$BT$7),\"TBD\")))))","v":"NA"},{"$f":"IF(OR(AA177=\"TBD\",AC177=\"TBD\",AE177=\"TBD\",AG177=\"TBD\"),\"TBD\",IF(Z177=\"NA\",\"NA\",BN177))","v":"NA"},{"$f":"IF(Z177=\"NA\",\"NA\",IF(BP177=\"TBD\",\"TBD\",astmrnd(BP177,2)))","v":"NA"},{"$f":"IF(N177=0,\"NA\",ABS(N177-$H177))","v":"NA"},{"$f":"IF(AJ177=\"NA\",\"NA\",IF(AJ177<0.46,105-(11.1111*AJ177),IF(AJ177<1.01,181.8181-(181.8181*AJ177),\"TBD\")))","v":"NA"},{"$f":"IF(O177=0,\"NA\",ABS(O177-$R$4))","v":"NA"},{"$f":"IF(AL177=\"NA\",\"NA\",IF(O177<1,\"TBD\",IF(AL177<1.01,105-(5*AL177),IF(AL177<2.01,140-(40*AL177),\"TBD\"))))","v":"NA"},{"$f":"IF(P177=0,\"NA\",ABS(P177-$T$4))","v":"NA"},{"$f":"IF(AN177=\"NA\",\"NA\",IF(AN177<1.01,105-(5*AN177),IF(AN177<$BG$7,168-(69*AN177),\"TBD\")))","v":"NA"},{"$f":"IF(BI177=0,\"NA\",BI177)","v":"NA"},{"$f":"IF(AJ177=\"NA\",\"NA\",IF(Search!$W$3=2,100,IF(AP177>$BM$7,105,IF(AP177>$BN$7,(($BQ$7*AP177)-$BR$7),IF(AP177>$BO$7,(($BS$7*AP177)-$BT$7),\"TBD\")))))","v":"NA"},{"$f":"IF(OR(AK177=\"TBD\",AM177=\"TBD\",AO177=\"TBD\",AQ177=\"TBD\"),\"TBD\",IF(AJ177=\"NA\",\"NA\",BR177))","v":"NA"},{"$f":"IF(AJ177=\"NA\",\"NA\",IF(BT177=\"TBD\",\"TBD\",astmrnd(BT177,2)))","v":"NA"},{"$f":"IF(S177=0,\"NA\",ABS(S177-$H177))","v":"NA"},{"$f":"IF(AT177=\"NA\",\"NA\",IF(AT177<0.46,105-(11.1111*AT177),IF(AT177<1.01,181.8181-(181.8181*AT177),\"TBD\")))","v":"NA"},{"$f":"IF(T177=0,\"NA\",ABS(T177-$R$4))","v":"NA"},{"$f":"IF(AV177=\"NA\",\"NA\",IF(T177<1,\"TBD\",IF(AV177<1.01,105-(5*AV177),IF(AV177<2.01,140-(40*AV177),\"TBD\"))))","v":"NA"},{"$f":"IF(U177=0,\"NA\",ABS(U177-$T$4))","v":"NA"},{"$f":"IF(AX177=\"NA\",\"NA\",IF(AX177<1.01,105-(5*AX177),IF(AX177<$BG$7,168-(69*AX177),\"TBD\")))","v":"NA"},{"$f":"IF(BK177=0,\"NA\",BK177)","v":"NA"},{"$f":"IF(AT177=\"NA\",\"NA\",IF(Search!$W$3=2,100,IF(AZ177>$BM$7,105,IF(AZ177>$BN$7,(($BQ$7*AZ177)-$BR$7),IF(AZ177>$BO$7,(($BS$7*AZ177)-$BT$7),\"TBD\")))))","v":"NA"},{"$f":"IF(OR(AU177=\"TBD\",AW177=\"TBD\",AY177=\"TBD\",BA177=\"TBD\"),\"TBD\",IF(AT177=\"NA\",\"NA\",BV177))","v":"NA"},{"$f":"IF(AT177=\"NA\",\"NA\",IF(BX177=\"TBD\",\"TBD\",astmrnd(BX177,2)))","v":"NA"},null,null,{"$f":"IF(SUM(L177:L180)=0,0,AVERAGE(L177:L180))","v":0},{"$f":"IF(OR(Search!$W$3=4,Search!$W$3=5,BF177=0),0,astmrnd(BF177,2))","v":0},{"$f":"IF(SUM(Q177:Q180)=0,0,AVERAGE(Q177:Q180))","v":0},{"$f":"IF(OR(Search!$W$3=4,Search!$W$3=5,BH177=0),0,astmrnd(BH177,2))","v":0},{"$f":"IF(SUM(V177:V180)=0,0,AVERAGE(V177:V180))","v":0},{"$f":"IF(OR(Search!$W$3=4,Search!$W$3=5,BJ177=0),0,astmrnd(BJ177,2))","v":0},null,{"$f":"(AA177*0.15)+(AC177*0.3)+(AE177*0.15)+(AG177*0.4)","v":{"$error":"#VALUE!"}},{"$f":"IF(OR(AA177=\"TBD\",AC177=\"TBD\",AE177=\"TBD\",AG177=\"TBD\"),\"TBD\",astmrnd(BM177,0))","v":{"$error":"#VALUE!"}},{"$f":"IF(Menu!$C$10>Menu!$C$11,Menu!$C$10,IF(BN177>100,Menu!$C$10,Menu!$C$11))","v":{"$error":"#VALUE!"}},{"$f":"IF(AH177=\"TBD\",\"TBD\",((AH177-100)/100)*BO177*G177)","v":{"$error":"#VALUE!"}},{"$f":"(AK177*0.15)+(AM177*0.3)+(AO177*0.15)+(AQ177*0.4)","v":{"$error":"#VALUE!"}},{"$f":"IF(OR(AK177=\"TBD\",AM177=\"TBD\",AO177=\"TBD\",AQ177=\"TBD\"),\"TBD\",astmrnd(BQ177,0))","v":{"$error":"#VALUE!"}},{"$f":"IF(Menu!$C$10>Menu!$C$11,Menu!$C$10,IF(BR177>100,Menu!$C$10,Menu!$C$11))","v":{"$error":"#VALUE!"}},{"$f":"IF(AR177=\"TBD\",\"TBD\",((AR177-100)/100)*BS177*G177)","v":{"$error":"#VALUE!"}},{"$f":"(AU177*0.15)+(AW177*0.3)+(AY177*0.15)+(BA177*0.4)","v":{"$error":"#VALUE!"}},{"$f":"IF(OR(AU177=\"TBD\",AW177=\"TBD\",AY177=\"TBD\",BA177=\"TBD\"),\"TBD\",astmrnd(BU177,0))","v":{"$error":"#VALUE!"}},{"$f":"IF(Menu!$C$10>Menu!$C$11,Menu!$C$10,IF(BV177>100,Menu!$C$10,Menu!$C$11))","v":{"$error":"#VALUE!"}},{"$f":"IF(BB177=\"TBD\",\"TBD\",((BB177-100)/100)*BW177*G177)","v":{"$error":"#VALUE!"}}]
[null,null,null,null,42]
[null,null,null,null,42]
[null,null,null,null,42]
[null,null,{"$f":"IF(B181=0,\"\",$C$6)","v":""},null,43,null,null,null,null,null,null,null,{"$f":"BG181","v":0},null,null,null,null,{"$f":"BI181","v":0},null,null,null,null,{"$f":"BK181","v":0},null,null,{"$f":"IF(I181=0,\"NA\",ABS(I181-$H181))","v":"NA"},{"$f":"IF(Z181=\"NA\",\"NA\",IF(Z181<0.46,105-(11.1111*Z181),IF(Z181<1.01,181.8181-(181.8181*Z181),\"TBD\")))","v":"NA"},{"$f":"IF(J181=0,\"NA\",ABS(J181-$R$4))","v":"NA"},{"$f":"IF(AB181=\"NA\",\"NA\",IF(J181<1,\"TBD\",IF(AB181<1.01,105-(5*AB181),IF(AB181<2.01,140-(40*AB181),\"TBD\"))))","v":"NA"},{"$f":"IF(K181=0,\"NA\",ABS(K181-$T$4))","v":"NA"},{"$f":"IF(AD181=\"NA\",\"NA\",IF(AD181<1.01,105-(5*AD181),IF(AD181<$BG$7,168-(69*AD181),\"TBD\")))","v":"NA"},{"$f":"IF(BG181=0,\"NA\",BG181)","v":"NA"},{"$f":"IF(Z181=\"NA\",\"NA\",IF(Search!$W$3=2,100,IF(AF181>$BM$7,105,IF(AF181>$BN$7,(($BQ$7*AF181)-$BR$7),IF(AF181>$BO$7,(($BS$7*AF181)-$BT$7),\"TBD\")))))","v":"NA"},{"$f":"IF(OR(AA181=\"TBD\",AC181=\"TBD\",AE181=\"TBD\",AG181=\"TBD\"),\"TBD\",IF(Z181=\"NA\",\"NA\",BN181))","v":"NA"},{"$f":"IF(Z181=\"NA\",\"NA\",IF(BP181=\"TBD\",\"TBD\",astmrnd(BP181,2)))","v":"NA"},{"$f":"IF(N181=0,\"NA\",ABS(N181-$H181))","v":"NA"},{"$f":"IF(AJ181=\"NA\",\"NA\",IF(AJ181<0.46,105-(11.1111*AJ181),IF(AJ181<1.01,181.8181-(181.8181*AJ181),\"TBD\")))","v":"NA"},{"$f":"IF(O181=0,\"NA\",ABS(O181-$R$4))","v":"NA"},{"$f":"IF(AL181=\"NA\",\"NA\",IF(O181<1,\"TBD\",IF(AL181<1.01,105-(5*AL181),IF(AL181<2.01,140-(40*AL181),\"TBD\"))))","v":"NA"},{"$f":"IF(P181=0,\"NA\",ABS(P181-$T$4))","v":"NA"},{"$f":"IF(AN181=\"NA\",\"NA\",IF(AN181<1.01,105-(5*AN181),IF(AN181<$BG$7,168-(69*AN181),\"TBD\")))","v":"NA"},{"$f":"IF(BI181=0,\"NA\",BI181)","v":"NA"},{"$f":"IF(AJ181=\"NA\",\"NA\",IF(Search!$W$3=2,100,IF(AP181>$BM$7,105,IF(AP181>$BN$7,(($BQ$7*AP181)-$BR$7),IF(AP181>$BO$7,(($BS$7*AP181)-$BT$7),\"TBD\")))))","v":"NA"},{"$f":"IF(OR(AK181=\"TBD\",AM181=\"TBD\",AO181=\"TBD\",AQ181=\"TBD\"),\"TBD\",IF(AJ181=\"NA\",\"NA\",BR181))","v":"NA"},{"$f":"IF(AJ181=\"NA\",\"NA\",IF(BT181=\"TBD\",\"TBD\",astmrnd(BT181,2)))","v":"NA"},{"$f":"IF(S181=0,\"NA\",ABS(S181-$H181))","v":"NA"},{"$f":"IF(AT181=\"NA\",\"NA\",IF(AT181<0.46,105-(11.1111*AT181),IF(AT181<1.01,181.8181-(181.8181*AT181),\"TBD\")))","v":"NA"},{"$f":"IF(T181=0,\"NA\",ABS(T181-$R$4))","v":"NA"},{"$f":"IF(AV181=\"NA\",\"NA\",IF(T181<1,\"TBD\",IF(AV181<1.01,105-(5*AV181),IF(AV181<2.01,140-(40*AV181),\"TBD\"))))","v":"NA"},{"$f":"IF(U181=0,\"NA\",ABS(U181-$T$4))","v":"NA"},{"$f":"IF(AX181=\"NA\",\"NA\",IF(AX181<1.01,105-(5*AX181),IF(AX181<$BG$7,168-(69*AX181),\"TBD\")))","v":"NA"},{"$f":"IF(BK181=0,\"NA\",BK181)","v":"NA"},{"$f":"IF(AT181=\"NA\",\"NA\",IF(Search!$W$3=2,100,IF(AZ181>$BM$7,105,IF(AZ181>$BN$7,(($BQ$7*AZ181)-$BR$7),IF(AZ181>$BO$7,(($BS$7*AZ181)-$BT$7),\"TBD\")))))","v":"NA"},{"$f":"IF(OR(AU181=\"TBD\",AW181=\"TBD\",AY181=\"TBD\",BA181=\"TBD\"),\"TBD\",IF(AT181=\"NA\",\"NA\",BV181))","v":"NA"},{"$f":"IF(AT181=\"NA\",\"NA\",IF(BX181=\"TBD\",\"TBD\",astmrnd(BX181,2)))","v":"NA"},null,null,{"$f":"IF(SUM(L181:L184)=0,0,AVERAGE(L181:L184))","v":0},{"$f":"IF(OR(Search!$W$3=4,Search!$W$3=5,BF181=0),0,astmrnd(BF181,2))","v":0},{"$f":"IF(SUM(Q181:Q184)=0,0,AVERAGE(Q181:Q184))","v":0},{"$f":"IF(OR(Search!$W$3=4,Search!$W$3=5,BH181=0),0,astmrnd(BH181,2))","v":0},{"$f":"IF(SUM(V181:V184)=0,0,AVERAGE(V181:V184))","v":0},{"$f":"IF(OR(Search!$W$3=4,Search!$W$3=5,BJ181=0),0,astmrnd(BJ181,2))","v":0},null,{"$f":"(AA181*0.15)+(AC181*0.3)+(AE181*0.15)+(AG181*0.4)","v":{"$error":"#VALUE!"}},{"$f":"IF(OR(AA181=\"TBD\",AC181=\"TBD\",AE181=\"TBD\",AG181=\"TBD\"),\"TBD\",astmrnd(BM181,0))","v":{"$error":"#VALUE!"}},{"$f":"IF(Menu!$C$10>Menu!$C$11,Menu!$C$10,IF(BN181>100,Menu!$C$10,Menu!$C$11))","v":{"$error":"#VALUE!"}},{"$f":"IF(AH181=\"TBD\",\"TBD\",((AH181-100)/100)*BO181*G181)","v":{"$error":"#VALUE!"}},{"$f":"(AK181*0.15)+(AM181*0.3)+(AO181*0.15)+(AQ181*0.4)","v":{"$error":"#VALUE!"}},{"$f":"IF(OR(AK181=\"TBD\",AM181=\"TBD\",AO181=\"TBD\",AQ181=\"TBD\"),\"TBD\",astmrnd(BQ181,0))","v":{"$error":"#VALUE!"}},{"$f":"IF(Menu!$C$10>Menu!$C$11,Menu!$C$10,IF(BR181>100,Menu!$C$10,Menu!$C$11))","v":{"$error":"#VALUE!"}},{"$f":"IF(AR181=\"TBD\",\"TBD\",((AR181-100)/100)*BS181*G181)","v":{"$error":"#VALUE!"}},{"$f":"(AU181*0.15)+(AW181*0.3)+(AY181*0.15)+(BA181*0.4)","v":{"$error":"#VALUE!"}},{"$f":"IF(OR(AU181=\"TBD\",AW181=\"TBD\",AY181=\"TBD\",BA181=\"TBD\"),\"TBD\",astmrnd(BU181,0))","v":{"$error":"#VALUE!"}},{"$f":"IF(Menu!$C$10>Menu!$C$11,Menu!$C$10,IF(BV181>100,Menu!$C$10,Menu!$C$11))","v":{"$error":"#VALUE!"}},{"$f":"IF(BB181=\"TBD\",\"TBD\",((BB181-100)/100)*BW181*G181)","v":{"$error":"#VALUE!"}}]
[null,null,null,null,43]
[null,null,null,null,43]
[null,null,null,null,43]
[null,null,{"$f":"IF(B185=0,\"\",$C$6)","v":""},null,44,null,null,null,null,null,null,null,{"$f":"BG185","v":0},null,null,null,null,{"$f":"BI185","v":0},null,null,null,null,{"$f":"BK185","v":0},null,null,{"$f":"IF(I185=0,\"NA\",ABS(I185-$H185))","v":"NA"},{"$f":"IF(Z185=\"NA\",\"NA\",IF(Z185<0.46,105-(11.1111*Z185),IF(Z185<1.01,181.8181-(181.8181*Z185),\"TBD\")))","v":"NA"},{"$f":"IF(J185=0,\"NA\",ABS(J185-$R$4))","v":"NA"},{"$f":"IF(AB185=\"NA\",\"NA\",IF(J185<1,\"TBD\",IF(AB185<1.01,105-(5*AB185),IF(AB185<2.01,140-(40*AB185),\"TBD\"))))","v":"NA"},{"$f":"IF(K185=0,\"NA\",ABS(K185-$T$4))","v":"NA"},{"$f":"IF(AD185=\"NA\",\"NA\",IF(AD185<1.01,105-(5*AD185),IF(AD185<$BG$7,168-(69*AD185),\"TBD\")))","v":"NA"},{"$f":"IF(BG185=0,\"NA\",BG185)","v":"NA"},{"$f":"IF(Z185=\"NA\",\"NA\",IF(Search!$W$3=2,100,IF(AF185>$BM$7,105,IF(AF185>$BN$7,(($BQ$7*AF185)-$BR$7),IF(AF185>$BO$7,(($BS$7*AF185)-$BT$7),\"TBD\")))))","v":"NA"},{"$f":"IF(OR(AA185=\"TBD\",AC185=\"TBD\",AE185=\"TBD\",AG185=\"TBD\"),\"TBD\",IF(Z185=\"NA\",\"NA\",BN185))","v":"NA"},{"$f":"IF(Z185=\"NA\",\"NA\",IF(BP185=\"TBD\",\"TBD\",astmrnd(BP185,2)))","v":"NA"},{"$f":"IF(N185=0,\"NA\",ABS(N185-$H185))","v":"NA"},{"$f":"IF(AJ185=\"NA\",\"NA\",IF(AJ185<0.46,105-(11.1111*AJ185),IF(AJ185<1.01,181.8181-(181.8181*AJ185),\"TBD\")))","v":"NA"},{"$f":"IF(O185=0,\"NA\",ABS(O185-$R$4))","v":"NA"},{"$f":"IF(AL185=\"NA\",\"NA\",IF(O185<1,\"TBD\",IF(AL185<1.01,105-(5*AL185),IF(AL185<2.01,140-(40*AL185),\"TBD\"))))","v":"NA"},{"$f":"IF(P185=0,\"NA\",ABS(P185-$T$4))","v":"NA"},{"$f":"IF(AN185=\"NA\",\"NA\",IF(AN185<1.01,105-(5*AN185),IF(AN185<$BG$7,168-(69*AN185),\"TBD\")))","v":"NA"},{"$f":"IF(BI185=0,\"NA\",BI185)","v":"NA"},{"$f":"IF(AJ185=\"NA\",\"NA\",IF(Search!$W$3=2,100,IF(AP185>$BM$7,105,IF(AP185>$BN$7,(($BQ$7*AP185)-$BR$7),IF(AP185>$BO$7,(($BS$7*AP185)-$BT$7),\"TBD\")))))","v":"NA"},{"$f":"IF(OR(AK185=\"TBD\",AM185=\"TBD\",AO185=\"TBD\",AQ185=\"TBD\"),\"TBD\",IF(AJ185=\"NA\",\"NA\",BR185))","v":"NA"},{"$f":"IF(AJ185=\"NA\",\"NA\",IF(BT185=\"TBD\",\"TBD\",astmrnd(BT185,2)))","v":"NA"},{"$f":"IF(S185=0,\"NA\",ABS(S185-$H185))","v":"NA"},{"$f":"IF(AT185=\"NA\",\"NA\",IF(AT185<0.46,105-(11.1111*AT185),IF(AT185<1.01,181.8181-(181.8181*AT185),\"TBD\")))","v":"NA"},{"$f":"IF(T185=0,\"NA\",ABS(T185-$R$4))","v":"NA"},{"$f":"IF(AV185=\"NA\",\"NA\",IF(T185<1,\"TBD\",IF(AV185<1.01,105-(5*AV185),IF(AV185<2.01,140-(40*AV185),\"TBD\"))))","v":"NA"},{"$f":"IF(U185=0,\"NA\",ABS(U185-$T$4))","v":"NA"},{"$f":"IF(AX185=\"NA\",\"NA\",IF(AX185<1.01,105-(5*AX185),IF(AX185<$BG$7,168-(69*AX185),\"TBD\")))","v":"NA"},{"$f":"IF(BK185=0,\"NA\",BK185)","v":"NA"},{"$f":"IF(AT185=\"NA\",\"NA\",IF(Search!$W$3=2,100,IF(AZ185>$BM$7,105,IF(AZ185>$BN$7,(($BQ$7*AZ185)-$BR$7),IF(AZ185>$BO$7,(($BS$7*AZ185)-$BT$7),\"TBD\")))))","v":"NA"},{"$f":"IF(OR(AU185=\"TBD\",AW185=\"TBD\",AY185=\"TBD\",BA185=\"TBD\"),\"TBD\",IF(AT185=\"NA\",\"NA\",BV185))","v":"NA"},{"$f":"IF(AT185=\"NA\",\"NA\",IF(BX185=\"TBD\",\"TBD\",astmrnd(BX185,2)))","v":"NA"},null,null,{"$f":"IF(SUM(L185:L188)=0,0,AVERAGE(L185:L188))","v":0},{"$f":"IF(OR(Search!$W$3=4,Search!$W$3=5,BF185=0),0,astmrnd(BF185,2))","v":0},{"$f":"IF(SUM(Q185:Q188)=0,0,AVERAGE(Q185:Q188))","v":0},{"$f":"IF(OR(Search!$W$3=4,Search!$W$3=5,BH185=0),0,astmrnd(BH185,2))","v":0},{"$f":"IF(SUM(V185:V188)=0,0,AVERAGE(V185:V188))","v":0},{"$f":"IF(OR(Search!$W$3=4,Search!$W$3=5,BJ185=0),0,astmrnd(BJ185,2))","v":0},null,{"$f":"(AA185*0.15)+(AC185*0.3)+(AE185*0.15)+(AG185*0.4)","v":{"$error":"#VALUE!"}},{"$f":"IF(OR(AA185=\"TBD\",AC185=\"TBD\",AE185=\"TBD\",AG185=\"TBD\"),\"TBD\",astmrnd(BM185,0))","v":{"$error":"#VALUE!"}},{"$f":"IF(Menu!$C$10>Menu!$C$11,Menu!$C$10,IF(BN185>100,Menu!$C$10,Menu!$C$11))","v":{"$error":"#VALUE!"}},{"$f":"IF(AH185=\"TBD\",\"TBD\",((AH185-100)/100)*BO185*G185)","v":{"$error":"#VALUE!"}},{"$f":"(AK185*0.15)+(AM185*0.3)+(AO185*0.15)+(AQ185*0.4)","v":{"$error":"#VALUE!"}},{"$f":"IF(OR(AK185=\"TBD\",AM185=\"TBD\",AO185=\"TBD\",AQ185=\"TBD\"),\"TBD\",astmrnd(BQ185,0))","v":{"$error":"#VALUE!"}},{"$f":"IF(Menu!$C$10>Menu!$C$11,Menu!$C$10,IF(BR185>100,Menu!$C$10,Menu!$C$11))","v":{"$error":"#VALUE!"}},{"$f":"IF(AR185=\"TBD\",\"TBD\",((AR185-100)/100)*BS185*G185)","v":{"$error":"#VALUE!"}},{"$f":"(AU185*0.15)+(AW185*0.3)+(AY185*0.15)+(BA185*0.4)","v":{"$error":"#VALUE!"}},{"$f":"IF(OR(AU185=\"TBD\",AW185=\"TBD\",AY185=\"TBD\",BA185=\"TBD\"),\"TBD\",astmrnd(BU185,0))","v":{"$error":"#VALUE!"}},{"$f":"IF(Menu!$C$10>Menu!$C$11,Menu!$C$10,IF(BV185>100,Menu!$C$10,Menu!$C$11))","v":{"$error":"#VALUE!"}},{"$f":"IF(BB185=\"TBD\",\"TBD\",((BB185-100)/100)*BW185*G185)","v":{"$error":"#VALUE!"}}]
[null,null,null,null,44]
[null,null,null,null,44]
[null,null,null,null,44]
[null,null,{"$f":"IF(B189=0,\"\",$C$6)","v":""},null,45,null,null,null,null,null,null,null,{"$f":"BG189","v":0},null,null,null,null,{"$f":"BI189","v":0},null,null,null,null,{"$f":"BK189","v":0},null,null,{"$f":"IF(I189=0,\"NA\",ABS(I189-$H189))","v":"NA"},{"$f":"IF(Z189=\"NA\",\"NA\",IF(Z189<0.46,105-(11.1111*Z189),IF(Z189<1.01,181.8181-(181.8181*Z189),\"TBD\")))","v":"NA"},{"$f":"IF(J189=0,\"NA\",ABS(J189-$R$4))","v":"NA"},{"$f":"IF(AB189=\"NA\",\"NA\",IF(J189<1,\"TBD\",IF(AB189<1.01,105-(5*AB189),IF(AB189<2.01,140-(40*AB189),\"TBD\"))))","v":"NA"},{"$f":"IF(K189=0,\"NA\",ABS(K189-$T$4))","v":"NA"},{"$f":"IF(AD189=\"NA\",\"NA\",IF(AD189<1.01,105-(5*AD189),IF(AD189<$BG$7,168-(69*AD189),\"TBD\")))","v":"NA"},{"$f":"IF(BG189=0,\"NA\",BG189)","v":"NA"},{"$f":"IF(Z189=\"NA\",\"NA\",IF(Search!$W$3=2,100,IF(AF189>$BM$7,105,IF(AF189>$BN$7,(($BQ$7*AF189)-$BR$7),IF(AF189>$BO$7,(($BS$7*AF189)-$BT$7),\"TBD\")))))","v":"NA"},{"$f":"IF(OR(AA189=\"TBD\",AC189=\"TBD\",AE189=\"TBD\",AG189=\"TBD\"),\"TBD\",IF(Z189=\"NA\",\"NA\",BN189))","v":"NA"},{"$f":"IF(Z189=\"NA\",\"NA\",IF(BP189=\"TBD\",\"TBD\",astmrnd(BP189,2)))","v":"NA"},{"$f":"IF(N189=0,\"NA\",ABS(N189-$H189))","v":"NA"},{"$f":"IF(AJ189=\"NA\",\"NA\",IF(AJ189<0.46,105-(11.1111*AJ189),IF(AJ189<1.01,181.8181-(181.8181*AJ189),\"TBD\")))","v":"NA"},{"$f":"IF(O189=0,\"NA\",ABS(O189-$R$4))","v":"NA"},{"$f":"IF(AL189=\"NA\",\"NA\",IF(O189<1,\"TBD\",IF(AL189<1.01,105-(5*AL189),IF(AL189<2.01,140-(40*AL189),\"TBD\"))))","v":"NA"},{"$f":"IF(P189=0,\"NA\",ABS(P189-$T$4))","v":"NA"},{"$f":"IF(AN189=\"NA\",\"NA\",IF(AN189<1.01,105-(5*AN189),IF(AN189<$BG$7,168-(69*AN189),\"TBD\")))","v":"NA"},{"$f":"IF(BI189=0,\"NA\",BI189)","v":"NA"},{"$f":"IF(AJ189=\"NA\",\"NA\",IF(Search!$W$3=2,100,IF(AP189>$BM$7,105,IF(AP189>$BN$7,(($BQ$7*AP189)-$BR$7),IF(AP189>$BO$7,(($BS$7*AP189)-$BT$7),\"TBD\")))))","v":"NA"},{"$f":"IF(OR(AK189=\"TBD\",AM189=\"TBD\",AO189=\"TBD\",AQ189=\"TBD\"),\"TBD\",IF(AJ189=\"NA\",\"NA\",BR189))","v":"NA"},{"$f":"IF(AJ189=\"NA\",\"NA\",IF(BT189=\"TBD\",\"TBD\",astmrnd(BT189,2)))","v":"NA"},{"$f":"IF(S189=0,\"NA\",ABS(S189-$H189))","v":"NA"},{"$f":"IF(AT189=\"NA\",\"NA\",IF(AT189<0.46,105-(11.1111*AT189),IF(AT189<1.01,181.8181-(181.8181*AT189),\"TBD\")))","v":"NA"},{"$f":"IF(T189=0,\"NA\",ABS(T189-$R$4))","v":"NA"},{"$f":"IF(AV189=\"NA\",\"NA\",IF(T189<1,\"TBD\",IF(AV189<1.01,105-(5*AV189),IF(AV189<2.01,140-(40*AV189),\"TBD\"))))","v":"NA"},{"$f":"IF(U189=0,\"NA\",ABS(U189-$T$4))","v":"NA"},{"$f":"IF(AX189=\"NA\",\"NA\",IF(AX189<1.01,105-(5*AX189),IF(AX189<$BG$7,168-(69*AX189),\"TBD\")))","v":"NA"},{"$f":"IF(BK189=0,\"NA\",BK189)","v":"NA"},{"$f":"IF(AT189=\"NA\",\"NA\",IF(Search!$W$3=2,100,IF(AZ189>$BM$7,105,IF(AZ189>$BN$7,(($BQ$7*AZ189)-$BR$7),IF(AZ189>$BO$7,(($BS$7*AZ189)-$BT$7),\"TBD\")))))","v":"NA"},{"$f":"IF(OR(AU189=\"TBD\",AW189=\"TBD\",AY189=\"TBD\",BA189=\"TBD\"),\"TBD\",IF(AT189=\"NA\",\"NA\",BV189))","v":"NA"},{"$f":"IF(AT189=\"NA\",\"NA\",IF(BX189=\"TBD\",\"TBD\",astmrnd(BX189,2)))","v":"NA"},null,null,{"$f":"IF(SUM(L189:L192)=0,0,AVERAGE(L189:L192))","v":0},{"$f":"IF(OR(Search!$W$3=4,Search!$W$3=5,BF189=0),0,astmrnd(BF189,2))","v":0},{"$f":"IF(SUM(Q189:Q192)=0,0,AVERAGE(Q189:Q192))","v":0},{"$f":"IF(OR(Search!$W$3=4,Search!$W$3=5,BH189=0),0,astmrnd(BH189,2))","v":0},{"$f":"IF(SUM(V189:V192)=0,0,AVERAGE(V189:V192))","v":0},{"$f":"IF(OR(Search!$W$3=4,Search!$W$3=5,BJ189=0),0,astmrnd(BJ189,2))","v":0},null,{"$f":"(AA189*0.15)+(AC189*0.3)+(AE189*0.15)+(AG189*0.4)","v":{"$error":"#VALUE!"}},{"$f":"IF(OR(AA189=\"TBD\",AC189=\"TBD\",AE189=\"TBD\",AG189=\"TBD\"),\"TBD\",astmrnd(BM189,0))","v":{"$error":"#VALUE!"}},{"$f":"IF(Menu!$C$10>Menu!$C$11,Menu!$C$10,IF(BN189>100,Menu!$C$10,Menu!$C$11))","v":{"$error":"#VALUE!"}},{"$f":"IF(AH189=\"TBD\",\"TBD\",((AH189-100)/100)*BO189*G189)","v":{"$error":"#VALUE!"}},{"$f":"(AK189*0.15)+(AM189*0.3)+(AO189*0.15)+(AQ189*0.4)","v":{"$error":"#VALUE!"}},{"$f":"IF(OR(AK189=\"TBD\",AM189=\"TBD\",AO189=\"TBD\",AQ189=\"TBD\"),\"TBD\",astmrnd(BQ189,0))","v":{"$error":"#VALUE!"}},{"$f":"IF(Menu!$C$10>Menu!$C$11,Menu!$C$10,IF(BR189>100,Menu!$C$10,Menu!$C$11))","v":{"$error":"#VALUE!"}},{"$f":"IF(AR189=\"TBD\",\"TBD\",((AR189-100)/100)*BS189*G189)","v":{"$error":"#VALUE!"}},{"$f":"(AU189*0.15)+(AW189*0.3)+(AY189*0.15)+(BA189*0.4)","v":{"$error":"#VALUE!"}},{"$f":"IF(OR(AU189=\"TBD\",AW189=\"TBD\",AY189=\"TBD\",BA189=\"TBD\"),\"TBD\",astmrnd(BU189,0))","v":{"$error":"#VALUE!"}},{"$f":"IF(Menu!$C$10>Menu!$C$11,Menu!$C$10,IF(BV189>100,Menu!$C$10,Menu!$C$11))","v":{"$error":"#VALUE!"}},{"$f":"IF(BB189=\"TBD\",\"TBD\",((BB189-100)/100)*BW189*G189)","v":{"$error":"#VALUE!"}}]
[null,null,null,null,45]
[null,null,null,null,45]
[null,null,null,null,45]
[null,null,{"$f":"IF(B193=0,\"\",$C$6)","v":""},null,46,null,null,null,null,null,null,null,{"$f":"BG193","v":0},null,null,null,null,{"$f":"BI193","v":0},null,null,null,null,{"$f":"BK193","v":0},null,null,{"$f":"IF(I193=0,\"NA\",ABS(I193-$H193))","v":"NA"},{"$f":"IF(Z193=\"NA\",\"NA\",IF(Z193<0.46,105-(11.1111*Z193),IF(Z193<1.01,181.8181-(181.8181*Z193),\"TBD\")))","v":"NA"},{"$f":"IF(J193=0,\"NA\",ABS(J193-$R$4))","v":"NA"},{"$f":"IF(AB193=\"NA\",\"NA\",IF(J193<1,\"TBD\",IF(AB193<1.01,105-(5*AB193),IF(AB193<2.01,140-(40*AB193),\"TBD\"))))","v":"NA"},{"$f":"IF(K193=0,\"NA\",ABS(K193-$T$4))","v":"NA"},{"$f":"IF(AD193=\"NA\",\"NA\",IF(AD193<1.01,105-(5*AD193),IF(AD193<$BG$7,168-(69*AD193),\"TBD\")))","v":"NA"},{"$f":"IF(BG193=0,\"NA\",BG193)","v":"NA"},{"$f":"IF(Z193=\"NA\",\"NA\",IF(Search!$W$3=2,100,IF(AF193>$BM$7,105,IF(AF193>$BN$7,(($BQ$7*AF193)-$BR$7),IF(AF193>$BO$7,(($BS$7*AF193)-$BT$7),\"TBD\")))))","v":"NA"},{"$f":"IF(OR(AA193=\"TBD\",AC193=\"TBD\",AE193=\"TBD\",AG193=\"TBD\"),\"TBD\",IF(Z193=\"NA\",\"NA\",BN193))","v":"NA"},{"$f":"IF(Z193=\"NA\",\"NA\",IF(BP193=\"TBD\",\"TBD\",astmrnd(BP193,2)))","v":"NA"},{"$f":"IF(N193=0,\"NA\",ABS(N193-$H193))","v":"NA"},{"$f":"IF(AJ193=\"NA\",\"NA\",IF(AJ193<0.46,105-(11.1111*AJ193),IF(AJ193<1.01,181.8181-(181.8181*AJ193),\"TBD\")))","v":"NA"},{"$f":"IF(O193=0,\"NA\",ABS(O193-$R$4))","v":"NA"},{"$f":"IF(AL193=\"NA\",\"NA\",IF(O193<1,\"TBD\",IF(AL193<1.01,105-(5*AL193),IF(AL193<2.01,140-(40*AL193),\"TBD\"))))","v":"NA"},{"$f":"IF(P193=0,\"NA\",ABS(P193-$T$4))","v":"NA"},{"$f":"IF(AN193=\"NA\",\"NA\",IF(AN193<1.01,105-(5*AN193),IF(AN193<$BG$7,168-(69*AN193),\"TBD\")))","v":"NA"},{"$f":"IF(BI193=0,\"NA\",BI193)","v":"NA"},{"$f":"IF(AJ193=\"NA\",\"NA\",IF(Search!$W$3=2,100,IF(AP193>$BM$7,105,IF(AP193>$BN$7,(($BQ$7*AP193)-$BR$7),IF(AP193>$BO$7,(($BS$7*AP193)-$BT$7),\"TBD\")))))","v":"NA"},{"$f":"IF(OR(AK193=\"TBD\",AM193=\"TBD\",AO193=\"TBD\",AQ193=\"TBD\"),\"TBD\",IF(AJ193=\"NA\",\"NA\",BR193))","v":"NA"},{"$f":"IF(AJ193=\"NA\",\"NA\",IF(BT193=\"TBD\",\"TBD\",astmrnd(BT193,2)))","v":"NA"},{"$f":"IF(S193=0,\"NA\",ABS(S193-$H193))","v":"NA"},{"$f":"IF(AT193=\"NA\",\"NA\",IF(AT193<0.46,105-(11.1111*AT193),IF(AT193<1.01,181.8181-(181.8181*AT193),\"TBD\")))","v":"NA"},{"$f":"IF(T193=0,\"NA\",ABS(T193-$R$4))","v":"NA"},{"$f":"IF(AV193=\"NA\",\"NA\",IF(T193<1,\"TBD\",IF(AV193<1.01,105-(5*AV193),IF(AV193<2.01,140-(40*AV193),\"TBD\"))))","v":"NA"},{"$f":"IF(U193=0,\"NA\",ABS(U193-$T$4))","v":"NA"},{"$f":"IF(AX193=\"NA\",\"NA\",IF(AX193<1.01,105-(5*AX193),IF(AX193<$BG$7,168-(69*AX193),\"TBD\")))","v":"NA"},{"$f":"IF(BK193=0,\"NA\",BK193)","v":"NA"},{"$f":"IF(AT193=\"NA\",\"NA\",IF(Search!$W$3=2,100,IF(AZ193>$BM$7,105,IF(AZ193>$BN$7,(($BQ$7*AZ193)-$BR$7),IF(AZ193>$BO$7,(($BS$7*AZ193)-$BT$7),\"TBD\")))))","v":"NA"},{"$f":"IF(OR(AU193=\"TBD\",AW193=\"TBD\",AY193=\"TBD\",BA193=\"TBD\"),\"TBD\",IF(AT193=\"NA\",\"NA\",BV193))","v":"NA"},{"$f":"IF(AT193=\"NA\",\"NA\",IF(BX193=\"TBD\",\"TBD\",astmrnd(BX193,2)))","v":"NA"},null,null,{"$f":"IF(SUM(L193:L196)=0,0,AVERAGE(L193:L196))","v":0},{"$f":"IF(OR(Search!$W$3=4,Search!$W$3=5,BF193=0),0,astmrnd(BF193,2))","v":0},{"$f":"IF(SUM(Q193:Q196)=0,0,AVERAGE(Q193:Q196))","v":0},{"$f":"IF(OR(Search!$W$3=4,Search!$W$3=5,BH193=0),0,astmrnd(BH193,2))","v":0},{"$f":"IF(SUM(V193:V196)=0,0,AVERAGE(V193:V196))","v":0},{"$f":"IF(OR(Search!$W$3=4,Search!$W$3=5,BJ193=0),0,astmrnd(BJ193,2))","v":0},null,{"$f":"(AA193*0.15)+(AC193*0.3)+(AE193*0.15)+(AG193*0.4)","v":{"$error":"#VALUE!"}},{"$f":"IF(OR(AA193=\"TBD\",AC193=\"TBD\",AE193=\"TBD\",AG193=\"TBD\"),\"TBD\",astmrnd(BM193,0))","v":{"$error":"#VALUE!"}},{"$f":"IF(Menu!$C$10>Menu!$C$11,Menu!$C$10,IF(BN193>100,Menu!$C$10,Menu!$C$11))","v":{"$error":"#VALUE!"}},{"$f":"IF(AH193=\"TBD\",\"TBD\",((AH193-100)/100)*BO193*G193)","v":{"$error":"#VALUE!"}},{"$f":"(AK193*0.15)+(AM193*0.3)+(AO193*0.15)+(AQ193*0.4)","v":{"$error":"#VALUE!"}},{"$f":"IF(OR(AK193=\"TBD\",AM193=\"TBD\",AO193=\"TBD\",AQ193=\"TBD\"),\"TBD\",astmrnd(BQ193,0))","v":{"$error":"#VALUE!"}},{"$f":"IF(Menu!$C$10>Menu!$C$11,Menu!$C$10,IF(BR193>100,Menu!$C$10,Menu!$C$11))","v":{"$error":"#VALUE!"}},{"$f":"IF(AR193=\"TBD\",\"TBD\",((AR193-100)/100)*BS193*G193)","v":{"$error":"#VALUE!"}},{"$f":"(AU193*0.15)+(AW193*0.3)+(AY193*0.15)+(BA193*0.4)","v":{"$error":"#VALUE!"}},{"$f":"IF(OR(AU193=\"TBD\",AW193=\"TBD\",AY193=\"TBD\",BA193=\"TBD\"),\"TBD\",astmrnd(BU193,0))","v":{"$error":"#VALUE!"}},{"$f":"IF(Menu!$C$10>Menu!$C$11,Menu!$C$10,IF(BV193>100,Menu!$C$10,Menu!$C$11))","v":{"$error":"#VALUE!"}},{"$f":"IF(BB193=\"TBD\",\"TBD\",((BB193-100)/100)*BW193*G193)","v":{"$error":"#VALUE!"}}]
[null,null,null,null,46]
[null,null,null,null,46]
[null,null,null,null,46]
[null,null,{"$f":"IF(B197=0,\"\",$C$6)","v":""},null,47,null,null,null,null,null,null,null,{"$f":"BG197","v":0},null,null,null,null,{"$f":"BI197","v":0},null,null,null,null,{"$f":"BK197","v":0},null,null,{"$f":"IF(I197=0,\"NA\",ABS(I197-$H197))","v":"NA"},{"$f":"IF(Z197=\"NA\",\"NA\",IF(Z197<0.46,105-(11.1111*Z197),IF(Z197<1.01,181.8181-(181.8181*Z197),\"TBD\")))","v":"NA"},{"$f":"IF(J197=0,\"NA\",ABS(J197-$R$4))","v":"NA"},{"$f":"IF(AB197=\"NA\",\"NA\",IF(J197<1,\"TBD\",IF(AB197<1.01,105-(5*AB197),IF(AB197<2.01,140-(40*AB197),\"TBD\"))))","v":"NA"},{"$f":"IF(K197=0,\"NA\",ABS(K197-$T$4))","v":"NA"},{"$f":"IF(AD197=\"NA\",\"NA\",IF(AD197<1.01,105-(5*AD197),IF(AD197<$BG$7,168-(69*AD197),\"TBD\")))","v":"NA"},{"$f":"IF(BG197=0,\"NA\",BG197)","v":"NA"},{"$f":"IF(Z197=\"NA\",\"NA\",IF(Search!$W$3=2,100,IF(AF197>$BM$7,105,IF(AF197>$BN$7,(($BQ$7*AF197)-$BR$7),IF(AF197>$BO$7,(($BS$7*AF197)-$BT$7),\"TBD\")))))","v":"NA"},{"$f":"IF(OR(AA197=\"TBD\",AC197=\"TBD\",AE197=\"TBD\",AG197=\"TBD\"),\"TBD\",IF(Z197=\"NA\",\"NA\",BN197))","v":"NA"},{"$f":"IF(Z197=\"NA\",\"NA\",IF(BP197=\"TBD\",\"TBD\",astmrnd(BP197,2)))","v":"NA"},{"$f":"IF(N197=0,\"NA\",ABS(N197-$H197))","v":"NA"},{"$f":"IF(AJ197=\"NA\",\"NA\",IF(AJ197<0.46,105-(11.1111*AJ197),IF(AJ197<1.01,181.8181-(181.8181*AJ197),\"TBD\")))","v":"NA"},{"$f":"IF(O197=0,\"NA\",ABS(O197-$R$4))","v":"NA"},{"$f":"IF(AL197=\"NA\",\"NA\",IF(O197<1,\"TBD\",IF(AL197<1.01,105-(5*AL197),IF(AL197<2.01,140-(40*AL197),\"TBD\"))))","v":"NA"},{"$f":"IF(P197=0,\"NA\",ABS(P197-$T$4))","v":"NA"},{"$f":"IF(AN197=\"NA\",\"NA\",IF(AN197<1.01,105-(5*AN197),IF(AN197<$BG$7,168-(69*AN197),\"TBD\")))","v":"NA"},{"$f":"IF(BI197=0,\"NA\",BI197)","v":"NA"},{"$f":"IF(AJ197=\"NA\",\"NA\",IF(Search!$W$3=2,100,IF(AP197>$BM$7,105,IF(AP197>$BN$7,(($BQ$7*AP197)-$BR$7),IF(AP197>$BO$7,(($BS$7*AP197)-$BT$7),\"TBD\")))))","v":"NA"},{"$f":"IF(OR(AK197=\"TBD\",AM197=\"TBD\",AO197=\"TBD\",AQ197=\"TBD\"),\"TBD\",IF(AJ197=\"NA\",\"NA\",BR197))","v":"NA"},{"$f":"IF(AJ197=\"NA\",\"NA\",IF(BT197=\"TBD\",\"TBD\",astmrnd(BT197,2)))","v":"NA"},{"$f":"IF(S197=0,\"NA\",ABS(S197-$H197))","v":"NA"},{"$f":"IF(AT197=\"NA\",\"NA\",IF(AT197<0.46,105-(11.1111*AT197),IF(AT197<1.01,181.8181-(181.8181*AT197),\"TBD\")))","v":"NA"},{"$f":"IF(T197=0,\"NA\",ABS(T197-$R$4))","v":"NA"},{"$f":"IF(AV197=\"NA\",\"NA\",IF(T197<1,\"TBD\",IF(AV197<1.01,105-(5*AV197),IF(AV197<2.01,140-(40*AV197),\"TBD\"))))","v":"NA"},{"$f":"IF(U197=0,\"NA\",ABS(U197-$T$4))","v":"NA"},{"$f":"IF(AX197=\"NA\",\"NA\",IF(AX197<1.01,105-(5*AX197),IF(AX197<$BG$7,168-(69*AX197),\"TBD\")))","v":"NA"},{"$f":"IF(BK197=0,\"NA\",BK197)","v":"NA"},{"$f":"IF(AT197=\"NA\",\"NA\",IF(Search!$W$3=2,100,IF(AZ197>$BM$7,105,IF(AZ197>$BN$7,(($BQ$7*AZ197)-$BR$7),IF(AZ197>$BO$7,(($BS$7*AZ197)-$BT$7),\"TBD\")))))","v":"NA"},{"$f":"IF(OR(AU197=\"TBD\",AW197=\"TBD\",AY197=\"TBD\",BA197=\"TBD\"),\"TBD\",IF(AT197=\"NA\",\"NA\",BV197))","v":"NA"},{"$f":"IF(AT197=\"NA\",\"NA\",IF(BX197=\"TBD\",\"TBD\",astmrnd(BX197,2)))","v":"NA"},null,null,{"$f":"IF(SUM(L197:L200)=0,0,AVERAGE(L197:L200))","v":0},{"$f":"IF(OR(Search!$W$3=4,Search!$W$3=5,BF197=0),0,astmrnd(BF197,2))","v":0},{"$f":"IF(SUM(Q197:Q200)=0,0,AVERAGE(Q197:Q200))","v":0},{"$f":"IF(OR(Search!$W$3=4,Search!$W$3=5,BH197=0),0,astmrnd(BH197,2))","v":0},{"$f":"IF(SUM(V197:V200)=0,0,AVERAGE(V197:V200))","v":0},{"$f":"IF(OR(Search!$W$3=4,Search!$W$3=5,BJ197=0),0,astmrnd(BJ197,2))","v":0},null,{"$f":"(AA197*0.15)+(AC197*0.3)+(AE197*0.15)+(AG197*0.4)","v":{"$error":"#VALUE!"}},{"$f":"IF(OR(AA197=\"TBD\",AC197=\"TBD\",AE197=\"TBD\",AG197=\"TBD\"),\"TBD\",astmrnd(BM197,0))","v":{"$error":"#VALUE!"}},{"$f":"IF(Menu!$C$10>Menu!$C$11,Menu!$C$10,IF(BN197>100,Menu!$C$10,Menu!$C$11))","v":{"$error":"#VALUE!"}},{"$f":"IF(AH197=\"TBD\",\"TBD\",((AH197-100)/100)*BO197*G197)","v":{"$error":"#VALUE!"}},{"$f":"(AK197*0.15)+(AM197*0.3)+(AO197*0.15)+(AQ197*0.4)","v":{"$error":"#VALUE!"}},{"$f":"IF(OR(AK197=\"TBD\",AM197=\"TBD\",AO197=\"TBD\",AQ197=\"TBD\"),\"TBD\",astmrnd(BQ197,0))","v":{"$error":"#VALUE!"}},{"$f":"IF(Menu!$C$10>Menu!$C$11,Menu!$C$10,IF(BR197>100,Menu!$C$10,Menu!$C$11))","v":{"$error":"#VALUE!"}},{"$f":"IF(AR197=\"TBD\",\"TBD\",((AR197-100)/100)*BS197*G197)","v":{"$error":"#VALUE!"}},{"$f":"(AU197*0.15)+(AW197*0.3)+(AY197*0.15)+(BA197*0.4)","v":{"$error":"#VALUE!"}},{"$f":"IF(OR(AU197=\"TBD\",AW197=\"TBD\",AY197=\"TBD\",BA197=\"TBD\"),\"TBD\",astmrnd(BU197,0))","v":{"$error":"#VALUE!"}},{"$f":"IF(Menu!$C$10>Menu!$C$11,Menu!$C$10,IF(BV197>100,Menu!$C$10,Menu!$C$11))","v":{"$error":"#VALUE!"}},{"$f":"IF(BB197=\"TBD\",\"TBD\",((BB197-100)/100)*BW197*G197)","v":{"$error":"#VALUE!"}}]
[null,null,null,null,47]
[null,null,null,null,47]
[null,null,null,null,47]
[null,null,{"$f":"IF(B201=0,\"\",$C$6)","v":""},null,48,null,null,null,null,null,null,null,{"$f":"BG201","v":0},null,null,null,null,{"$f":"BI201","v":0},null,null,null,null,{"$f":"BK201","v":0},null,null,{"$f":"IF(I201=0,\"NA\",ABS(I201-$H201))","v":"NA"},{"$f":"IF(Z201=\"NA\",\"NA\",IF(Z201<0.46,105-(11.1111*Z201),IF(Z201<1.01,181.8181-(181.8181*Z201),\"TBD\")))","v":"NA"},{"$f":"IF(J201=0,\"NA\",ABS(J201-$R$4))","v":"NA"},{"$f":"IF(AB201=\"NA\",\"NA\",IF(J201<1,\"TBD\",IF(AB201<1.01,105-(5*AB201),IF(AB201<2.01,140-(40*AB201),\"TBD\"))))","v":"NA"},{"$f":"IF(K201=0,\"NA\",ABS(K201-$T$4))","v":"NA"},{"$f":"IF(AD201=\"NA\",\"NA\",IF(AD201<1.01,105-(5*AD201),IF(AD201<$BG$7,168-(69*AD201),\"TBD\")))","v":"NA"},{"$f":"IF(BG201=0,\"NA\",BG201)","v":"NA"},{"$f":"IF(Z201=\"NA\",\"NA\",IF(Search!$W$3=2,100,IF(AF201>$BM$7,105,IF(AF201>$BN$7,(($BQ$7*AF201)-$BR$7),IF(AF201>$BO$7,(($BS$7*AF201)-$BT$7),\"TBD\")))))","v":"NA"},{"$f":"IF(OR(AA201=\"TBD\",AC201=\"TBD\",AE201=\"TBD\",AG201=\"TBD\"),\"TBD\",IF(Z201=\"NA\",\"NA\",BN201))","v":"NA"},{"$f":"IF(Z201=\"NA\",\"NA\",IF(BP201=\"TBD\",\"TBD\",astmrnd(BP201,2)))","v":"NA"},{"$f":"IF(N201=0,\"NA\",ABS(N201-$H201))","v":"NA"},{"$f":"IF(AJ201=\"NA\",\"NA\",IF(AJ201<0.46,105-(11.1111*AJ201),IF(AJ201<1.01,181.8181-(181.8181*AJ201),\"TBD\")))","v":"NA"},{"$f":"IF(O201=0,\"NA\",ABS(O201-$R$4))","v":"NA"},{"$f":"IF(AL201=\"NA\",\"NA\",IF(O201<1,\"TBD\",IF(AL201<1.01,105-(5*AL201),IF(AL201<2.01,140-(40*AL201),\"TBD\"))))","v":"NA"},{"$f":"IF(P201=0,\"NA\",ABS(P201-$T$4))","v":"NA"},{"$f":"IF(AN201=\"NA\",\"NA\",IF(AN201<1.01,105-(5*AN201),IF(AN201<$BG$7,168-(69*AN201),\"TBD\")))","v":"NA"},{"$f":"IF(BI201=0,\"NA\",BI201)","v":"NA"},{"$f":"IF(AJ201=\"NA\",\"NA\",IF(Search!$W$3=2,100,IF(AP201>$BM$7,105,IF(AP201>$BN$7,(($BQ$7*AP201)-$BR$7),IF(AP201>$BO$7,(($BS$7*AP201)-$BT$7),\"TBD\")))))","v":"NA"},{"$f":"IF(OR(AK201=\"TBD\",AM201=\"TBD\",AO201=\"TBD\",AQ201=\"TBD\"),\"TBD\",IF(AJ201=\"NA\",\"NA\",BR201))","v":"NA"},{"$f":"IF(AJ201=\"NA\",\"NA\",IF(BT201=\"TBD\",\"TBD\",astmrnd(BT201,2)))","v":"NA"},{"$f":"IF(S201=0,\"NA\",ABS(S201-$H201))","v":"NA"},{"$f":"IF(AT201=\"NA\",\"NA\",IF(AT201<0.46,105-(11.1111*AT201),IF(AT201<1.01,181.8181-(181.8181*AT201),\"TBD\")))","v":"NA"},{"$f":"IF(T201=0,\"NA\",ABS(T201-$R$4))","v":"NA"},{"$f":"IF(AV201=\"NA\",\"NA\",IF(T201<1,\"TBD\",IF(AV201<1.01,105-(5*AV201),IF(AV201<2.01,140-(40*AV201),\"TBD\"))))","v":"NA"},{"$f":"IF(U201=0,\"NA\",ABS(U201-$T$4))","v":"NA"},{"$f":"IF(AX201=\"NA\",\"NA\",IF(AX201<1.01,105-(5*AX201),IF(AX201<$BG$7,168-(69*AX201),\"TBD\")))","v":"NA"},{"$f":"IF(BK201=0,\"NA\",BK201)","v":"NA"},{"$f":"IF(AT201=\"NA\",\"NA\",IF(Search!$W$3=2,100,IF(AZ201>$BM$7,105,IF(AZ201>$BN$7,(($BQ$7*AZ201)-$BR$7),IF(AZ201>$BO$7,(($BS$7*AZ201)-$BT$7),\"TBD\")))))","v":"NA"},{"$f":"IF(OR(AU201=\"TBD\",AW201=\"TBD\",AY201=\"TBD\",BA201=\"TBD\"),\"TBD\",IF(AT201=\"NA\",\"NA\",BV201))","v":"NA"},{"$f":"IF(AT201=\"NA\",\"NA\",IF(BX201=\"TBD\",\"TBD\",astmrnd(BX201,2)))","v":"NA"},null,null,{"$f":"IF(SUM(L201:L204)=0,0,AVERAGE(L201:L204))","v":0},{"$f":"IF(OR(Search!$W$3=4,Search!$W$3=5,BF201=0),0,astmrnd(BF201,2))","v":0},{"$f":"IF(SUM(Q201:Q204)=0,0,AVERAGE(Q201:Q204))","v":0},{"$f":"IF(OR(Search!$W$3=4,Search!$W$3=5,BH201=0),0,astmrnd(BH201,2))","v":0},{"$f":"IF(SUM(V201:V204)=0,0,AVERAGE(V201:V204))","v":0},{"$f":"IF(OR(Search!$W$3=4,Search!$W$3=5,BJ201=0),0,astmrnd(BJ201,2))","v":0},null,{"$f":"(AA201*0.15)+(AC201*0.3)+(AE201*0.15)+(AG201*0.4)","v":{"$error":"#VALUE!"}},{"$f":"IF(OR(AA201=\"TBD\",AC201=\"TBD\",AE201=\"TBD\",AG201=\"TBD\"),\"TBD\",astmrnd(BM201,0))","v":{"$error":"#VALUE!"}},{"$f":"IF(Menu!$C$10>Menu!$C$11,Menu!$C$10,IF(BN201>100,Menu!$C$10,Menu!$C$11))","v":{"$error":"#VALUE!"}},{"$f":"IF(AH201=\"TBD\",\"TBD\",((AH201-100)/100)*BO201*G201)","v":{"$error":"#VALUE!"}},{"$f":"(AK201*0.15)+(AM201*0.3)+(AO201*0.15)+(AQ201*0.4)","v":{"$error":"#VALUE!"}},{"$f":"IF(OR(AK201=\"TBD\",AM201=\"TBD\",AO201=\"TBD\",AQ201=\"TBD\"),\"TBD\",astmrnd(BQ201,0))","v":{"$error":"#VALUE!"}},{"$f":"IF(Menu!$C$10>Menu!$C$11,Menu!$C$10,IF(BR201>100,Menu!$C$10,Menu!$C$11))","v":{"$error":"#VALUE!"}},{"$f":"IF(AR201=\"TBD\",\"TBD\",((AR201-100)/100)*BS201*G201)","v":{"$error":"#VALUE!"}},{"$f":"(AU201*0.15)+(AW201*0.3)+(AY201*0.15)+(BA201*0.4)","v":{"$error":"#VALUE!"}},{"$f":"IF(OR(AU201=\"TBD\",AW201=\"TBD\",AY201=\"TBD\",BA201=\"TBD\"),\"TBD\",astmrnd(BU201,0))","v":{"$error":"#VALUE!"}},{"$f":"IF(Menu!$C$10>Menu!$C$11,Menu!$C$10,IF(BV201>100,Menu!$C$10,Menu!$C$11))","v":{"$error":"#VALUE!"}},{"$f":"IF(BB201=\"TBD\",\"TBD\",((BB201-100)/100)*BW201*G201)","v":{"$error":"#VALUE!"}}]
[null,null,null,null,48]
[null,null,null,null,48]
[null,null,null,null,48]
[null,null,{"$f":"IF(B205=0,\"\",$C$6)","v":""},null,49,null,null,null,null,null,null,null,{"$f":"BG205","v":0},null,null,null,null,{"$f":"BI205","v":0},null,null,null,null,{"$f":"BK205","v":0},null,null,{"$f":"IF(I205=0,\"NA\",ABS(I205-$H205))","v":"NA"},{"$f":"IF(Z205=\"NA\",\"NA\",IF(Z205<0.46,105-(11.1111*Z205),IF(Z205<1.01,181.8181-(181.8181*Z205),\"TBD\")))","v":"NA"},{"$f":"IF(J205=0,\"NA\",ABS(J205-$R$4))","v":"NA"},{"$f":"IF(AB205=\"NA\",\"NA\",IF(J205<1,\"TBD\",IF(AB205<1.01,105-(5*AB205),IF(AB205<2.01,140-(40*AB205),\"TBD\"))))","v":"NA"},{"$f":"IF(K205=0,\"NA\",ABS(K205-$T$4))","v":"NA"},{"$f":"IF(AD205=\"NA\",\"NA\",IF(AD205<1.01,105-(5*AD205),IF(AD205<$BG$7,168-(69*AD205),\"TBD\")))","v":"NA"},{"$f":"IF(BG205=0,\"NA\",BG205)","v":"NA"},{"$f":"IF(Z205=\"NA\",\"NA\",IF(Search!$W$3=2,100,IF(AF205>$BM$7,105,IF(AF205>$BN$7,(($BQ$7*AF205)-$BR$7),IF(AF205>$BO$7,(($BS$7*AF205)-$BT$7),\"TBD\")))))","v":"NA"},{"$f":"IF(OR(AA205=\"TBD\",AC205=\"TBD\",AE205=\"TBD\",AG205=\"TBD\"),\"TBD\",IF(Z205=\"NA\",\"NA\",BN205))","v":"NA"},{"$f":"IF(Z205=\"NA\",\"NA\",IF(BP205=\"TBD\",\"TBD\",astmrnd(BP205,2)))","v":"NA"},{"$f":"IF(N205=0,\"NA\",ABS(N205-$H205))","v":"NA"},{"$f":"IF(AJ205=\"NA\",\"NA\",IF(AJ205<0.46,105-(11.1111*AJ205),IF(AJ205<1.01,181.8181-(181.8181*AJ205),\"TBD\")))","v":"NA"},{"$f":"IF(O205=0,\"NA\",ABS(O205-$R$4))","v":"NA"},{"$f":"IF(AL205=\"NA\",\"NA\",IF(O205<1,\"TBD\",IF(AL205<1.01,105-(5*AL205),IF(AL205<2.01,140-(40*AL205),\"TBD\"))))","v":"NA"},{"$f":"IF(P205=0,\"NA\",ABS(P205-$T$4))","v":"NA"},{"$f":"IF(AN205=\"NA\",\"NA\",IF(AN205<1.01,105-(5*AN205),IF(AN205<$BG$7,168-(69*AN205),\"TBD\")))","v":"NA"},{"$f":"IF(BI205=0,\"NA\",BI205)","v":"NA"},{"$f":"IF(AJ205=\"NA\",\"NA\",IF(Search!$W$3=2,100,IF(AP205>$BM$7,105,IF(AP205>$BN$7,(($BQ$7*AP205)-$BR$7),IF(AP205>$BO$7,(($BS$7*AP205)-$BT$7),\"TBD\")))))","v":"NA"},{"$f":"IF(OR(AK205=\"TBD\",AM205=\"TBD\",AO205=\"TBD\",AQ205=\"TBD\"),\"TBD\",IF(AJ205=\"NA\",\"NA\",BR205))","v":"NA"},{"$f":"IF(AJ205=\"NA\",\"NA\",IF(BT205=\"TBD\",\"TBD\",astmrnd(BT205,2)))","v":"NA"},{"$f":"IF(S205=0,\"NA\",ABS(S205-$H205))","v":"NA"},{"$f":"IF(AT205=\"NA\",\"NA\",IF(AT205<0.46,105-(11.1111*AT205),IF(AT205<1.01,181.8181-(181.8181*AT205),\"TBD\")))","v":"NA"},{"$f":"IF(T205=0,\"NA\",ABS(T205-$R$4))","v":"NA"},{"$f":"IF(AV205=\"NA\",\"NA\",IF(T205<1,\"TBD\",IF(AV205<1.01,105-(5*AV205),IF(AV205<2.01,140-(40*AV205),\"TBD\"))))","v":"NA"},{"$f":"IF(U205=0,\"NA\",ABS(U205-$T$4))","v":"NA"},{"$f":"IF(AX205=\"NA\",\"NA\",IF(AX205<1.01,105-(5*AX205),IF(AX205<$BG$7,168-(69*AX205),\"TBD\")))","v":"NA"},{"$f":"IF(BK205=0,\"NA\",BK205)","v":"NA"},{"$f":"IF(AT205=\"NA\",\"NA\",IF(Search!$W$3=2,100,IF(AZ205>$BM$7,105,IF(AZ205>$BN$7,(($BQ$7*AZ205)-$BR$7),IF(AZ205>$BO$7,(($BS$7*AZ205)-$BT$7),\"TBD\")))))","v":"NA"},{"$f":"IF(OR(AU205=\"TBD\",AW205=\"TBD\",AY205=\"TBD\",BA205=\"TBD\"),\"TBD\",IF(AT205=\"NA\",\"NA\",BV205))","v":"NA"},{"$f":"IF(AT205=\"NA\",\"NA\",IF(BX205=\"TBD\",\"TBD\",astmrnd(BX205,2)))","v":"NA"},null,null,{"$f":"IF(SUM(L205:L208)=0,0,AVERAGE(L205:L208))","v":0},{"$f":"IF(OR(Search!$W$3=4,Search!$W$3=5,BF205=0),0,astmrnd(BF205,2))","v":0},{"$f":"IF(SUM(Q205:Q208)=0,0,AVERAGE(Q205:Q208))","v":0},{"$f":"IF(OR(Search!$W$3=4,Search!$W$3=5,BH205=0),0,astmrnd(BH205,2))","v":0},{"$f":"IF(SUM(V205:V208)=0,0,AVERAGE(V205:V208))","v":0},{"$f":"IF(OR(Search!$W$3=4,Search!$W$3=5,BJ205=0),0,astmrnd(BJ205,2))","v":0},null,{"$f":"(AA205*0.15)+(AC205*0.3)+(AE205*0.15)+(AG205*0.4)","v":{"$error":"#VALUE!"}},{"$f":"IF(OR(AA205=\"TBD\",AC205=\"TBD\",AE205=\"TBD\",AG205=\"TBD\"),\"TBD\",astmrnd(BM205,0))","v":{"$error":"#VALUE!"}},{"$f":"IF(Menu!$C$10>Menu!$C$11,Menu!$C$10,IF(BN205>100,Menu!$C$10,Menu!$C$11))","v":{"$error":"#VALUE!"}},{"$f":"IF(AH205=\"TBD\",\"TBD\",((AH205-100)/100)*BO205*G205)","v":{"$error":"#VALUE!"}},{"$f":"(AK205*0.15)+(AM205*0.3)+(AO205*0.15)+(AQ205*0.4)","v":{"$error":"#VALUE!"}},{"$f":"IF(OR(AK205=\"TBD\",AM205=\"TBD\",AO205=\"TBD\",AQ205=\"TBD\"),\"TBD\",astmrnd(BQ205,0))","v":{"$error":"#VALUE!"}},{"$f":"IF(Menu!$C$10>Menu!$C$11,Menu!$C$10,IF(BR205>100,Menu!$C$10,Menu!$C$11))","v":{"$error":"#VALUE!"}},{"$f":"IF(AR205=\"TBD\",\"TBD\",((AR205-100)/100)*BS205*G205)","v":{"$error":"#VALUE!"}},{"$f":"(AU205*0.15)+(AW205*0.3)+(AY205*0.15)+(BA205*0.4)","v":{"$error":"#VALUE!"}},{"$f":"IF(OR(AU205=\"TBD\",AW205=\"TBD\",AY205=\"TBD\",BA205=\"TBD\"),\"TBD\",astmrnd(BU205,0))","v":{"$error":"#VALUE!"}},{"$f":"IF(Menu!$C$10>Menu!$C$11,Menu!$C$10,IF(BV205>100,Menu!$C$10,Menu!$C$11))","v":{"$error":"#VALUE!"}},{"$f":"IF(BB205=\"TBD\",\"TBD\",((BB205-100)/100)*BW205*G205)","v":{"$error":"#VALUE!"}}]
[null,null,null,null,49]
[null,null,null,null,49]
[null,null,null,null,49]
[null,null,{"$f":"IF(B209=0,\"\",$C$6)","v":""},null,50,null,null,null,null,null,null,null,{"$f":"BG209","v":0},null,null,null,null,{"$f":"BI209","v":0},null,null,null,null,{"$f":"BK209","v":0},null,null,{"$f":"IF(I209=0,\"NA\",ABS(I209-$H209))","v":"NA"},{"$f":"IF(Z209=\"NA\",\"NA\",IF(Z209<0.46,105-(11.1111*Z209),IF(Z209<1.01,181.8181-(181.8181*Z209),\"TBD\")))","v":"NA"},{"$f":"IF(J209=0,\"NA\",ABS(J209-$R$4))","v":"NA"},{"$f":"IF(AB209=\"NA\",\"NA\",IF(J209<1,\"TBD\",IF(AB209<1.01,105-(5*AB209),IF(AB209<2.01,140-(40*AB209),\"TBD\"))))","v":"NA"},{"$f":"IF(K209=0,\"NA\",ABS(K209-$T$4))","v":"NA"},{"$f":"IF(AD209=\"NA\",\"NA\",IF(AD209<1.01,105-(5*AD209),IF(AD209<$BG$7,168-(69*AD209),\"TBD\")))","v":"NA"},{"$f":"IF(BG209=0,\"NA\",BG209)","v":"NA"},{"$f":"IF(Z209=\"NA\",\"NA\",IF(Search!$W$3=2,100,IF(AF209>$BM$7,105,IF(AF209>$BN$7,(($BQ$7*AF209)-$BR$7),IF(AF209>$BO$7,(($BS$7*AF209)-$BT$7),\"TBD\")))))","v":"NA"},{"$f":"IF(OR(AA209=\"TBD\",AC209=\"TBD\",AE209=\"TBD\",AG209=\"TBD\"),\"TBD\",IF(Z209=\"NA\",\"NA\",BN209))","v":"NA"},{"$f":"IF(Z209=\"NA\",\"NA\",IF(BP209=\"TBD\",\"TBD\",astmrnd(BP209,2)))","v":"NA"},{"$f":"IF(N209=0,\"NA\",ABS(N209-$H209))","v":"NA"},{"$f":"IF(AJ209=\"NA\",\"NA\",IF(AJ209<0.46,105-(11.1111*AJ209),IF(AJ209<1.01,181.8181-(181.8181*AJ209),\"TBD\")))","v":"NA"},{"$f":"IF(O209=0,\"NA\",ABS(O209-$R$4))","v":"NA"},{"$f":"IF(AL209=\"NA\",\"NA\",IF(O209<1,\"TBD\",IF(AL209<1.01,105-(5*AL209),IF(AL209<2.01,140-(40*AL209),\"TBD\"))))","v":"NA"},{"$f":"IF(P209=0,\"NA\",ABS(P209-$T$4))","v":"NA"},{"$f":"IF(AN209=\"NA\",\"NA\",IF(AN209<1.01,105-(5*AN209),IF(AN209<$BG$7,168-(69*AN209),\"TBD\")))","v":"NA"},{"$f":"IF(BI209=0,\"NA\",BI209)","v":"NA"},{"$f":"IF(AJ209=\"NA\",\"NA\",IF(Search!$W$3=2,100,IF(AP209>$BM$7,105,IF(AP209>$BN$7,(($BQ$7*AP209)-$BR$7),IF(AP209>$BO$7,(($BS$7*AP209)-$BT$7),\"TBD\")))))","v":"NA"},{"$f":"IF(OR(AK209=\"TBD\",AM209=\"TBD\",AO209=\"TBD\",AQ209=\"TBD\"),\"TBD\",IF(AJ209=\"NA\",\"NA\",BR209))","v":"NA"},{"$f":"IF(AJ209=\"NA\",\"NA\",IF(BT209=\"TBD\",\"TBD\",astmrnd(BT209,2)))","v":"NA"},{"$f":"IF(S209=0,\"NA\",ABS(S209-$H209))","v":"NA"},{"$f":"IF(AT209=\"NA\",\"NA\",IF(AT209<0.46,105-(11.1111*AT209),IF(AT209<1.01,181.8181-(181.8181*AT209),\"TBD\")))","v":"NA"},{"$f":"IF(T209=0,\"NA\",ABS(T209-$R$4))","v":"NA"},{"$f":"IF(AV209=\"NA\",\"NA\",IF(T209<1,\"TBD\",IF(AV209<1.01,105-(5*AV209),IF(AV209<2.01,140-(40*AV209),\"TBD\"))))","v":"NA"},{"$f":"IF(U209=0,\"NA\",ABS(U209-$T$4))","v":"NA"},{"$f":"IF(AX209=\"NA\",\"NA\",IF(AX209<1.01,105-(5*AX209),IF(AX209<$BG$7,168-(69*AX209),\"TBD\")))","v":"NA"},{"$f":"IF(BK209=0,\"NA\",BK209)","v":"NA"},{"$f":"IF(AT209=\"NA\",\"NA\",IF(Search!$W$3=2,100,IF(AZ209>$BM$7,105,IF(AZ209>$BN$7,(($BQ$7*AZ209)-$BR$7),IF(AZ209>$BO$7,(($BS$7*AZ209)-$BT$7),\"TBD\")))))","v":"NA"},{"$f":"IF(OR(AU209=\"TBD\",AW209=\"TBD\",AY209=\"TBD\",BA209=\"TBD\"),\"TBD\",IF(AT209=\"NA\",\"NA\",BV209))","v":"NA"},{"$f":"IF(AT209=\"NA\",\"NA\",IF(BX209=\"TBD\",\"TBD\",astmrnd(BX209,2)))","v":"NA"},null,null,{"$f":"IF(SUM(L209:L212)=0,0,AVERAGE(L209:L212))","v":0},{"$f":"IF(OR(Search!$W$3=4,Search!$W$3=5,BF209=0),0,astmrnd(BF209,2))","v":0},{"$f":"IF(SUM(Q209:Q212)=0,0,AVERAGE(Q209:Q212))","v":0},{"$f":"IF(OR(Search!$W$3=4,Search!$W$3=5,BH209=0),0,astmrnd(BH209,2))","v":0},{"$f":"IF(SUM(V209:V212)=0,0,AVERAGE(V209:V212))","v":0},{"$f":"IF(OR(Search!$W$3=4,Search!$W$3=5,BJ209=0),0,astmrnd(BJ209,2))","v":0},null,{"$f":"(AA209*0.15)+(AC209*0.3)+(AE209*0.15)+(AG209*0.4)","v":{"$error":"#VALUE!"}},{"$f":"IF(OR(AA209=\"TBD\",AC209=\"TBD\",AE209=\"TBD\",AG209=\"TBD\"),\"TBD\",astmrnd(BM209,0))","v":{"$error":"#VALUE!"}},{"$f":"IF(Menu!$C$10>Menu!$C$11,Menu!$C$10,IF(BN209>100,Menu!$C$10,Menu!$C$11))","v":{"$error":"#VALUE!"}},{"$f":"IF(AH209=\"TBD\",\"TBD\",((AH209-100)/100)*BO209*G209)","v":{"$error":"#VALUE!"}},{"$f":"(AK209*0.15)+(AM209*0.3)+(AO209*0.15)+(AQ209*0.4)","v":{"$error":"#VALUE!"}},{"$f":"IF(OR(AK209=\"TBD\",AM209=\"TBD\",AO209=\"TBD\",AQ209=\"TBD\"),\"TBD\",astmrnd(BQ209,0))","v":{"$error":"#VALUE!"}},{"$f":"IF(Menu!$C$10>Menu!$C$11,Menu!$C$10,IF(BR209>100,Menu!$C$10,Menu!$C$11))","v":{"$error":"#VALUE!"}},{"$f":"IF(AR209=\"TBD\",\"TBD\",((AR209-100)/100)*BS209*G209)","v":{"$error":"#VALUE!"}},{"$f":"(AU209*0.15)+(AW209*0.3)+(AY209*0.15)+(BA209*0.4)","v":{"$error":"#VALUE!"}},{"$f":"IF(OR(AU209=\"TBD\",AW209=\"TBD\",AY209=\"TBD\",BA209=\"TBD\"),\"TBD\",astmrnd(BU209,0))","v":{"$error":"#VALUE!"}},{"$f":"IF(Menu!$C$10>Menu!$C$11,Menu!$C$10,IF(BV209>100,Menu!$C$10,Menu!$C$11))","v":{"$error":"#VALUE!"}},{"$f":"IF(BB209=\"TBD\",\"TBD\",((BB209-100)/100)*BW209*G209)","v":{"$error":"#VALUE!"}}]
[null,null,null,null,50]
[null,null,null,null,50]
[null,null,null,null,50]
[null,null,null,null,null,null,"Average",null,{"$f":"AVERAGE(I13:I212)","v":{"$error":"#DIV/0!"}},{"$f":"AVERAGE(J13:J212)","v":{"$error":"#DIV/0!"}},{"$f":"AVERAGE(K13:K212)","v":{"$error":"#DIV/0!"}},{"$f":"AVERAGE(L13:L212)","v":{"$error":"#DIV/0!"}},"----------",{"$f":"AVERAGE(N13:N212)","v":{"$error":"#DIV/0!"}},{"$f":"AVERAGE(O13:O212)","v":{"$error":"#DIV/0!"}},{"$f":"AVERAGE(P13:P212)","v":{"$error":"#DIV/0!"}},{"$f":"AVERAGE(Q13:Q212)","v":{"$error":"#DIV/0!"}},"----------",{"$f":"AVERAGE(S13:S212)","v":{"$error":"#DIV/0!"}},{"$f":"AVERAGE(T13:T212)","v":{"$error":"#DIV/0!"}},{"$f":"AVERAGE(U13:U212)","v":{"$error":"#DIV/0!"}},{"$f":"AVERAGE(V13:V212)","v":{"$error":"#DIV/0!"}},"----------",{"$f":"AVERAGE(X13:X212)","v":{"$error":"#DIV/0!"}},{"$f":"AVERAGE(Y13:Y212)","v":{"$error":"#DIV/0!"}}]
[null,null,null,null,null,null,"Standard Dev.",null,{"$f":"STDEVP(I13:I212)","v":{"$error":"#DIV/0!"}},{"$f":"STDEVP(J13:J212)","v":{"$error":"#DIV/0!"}},{"$f":"STDEVP(K13:K212)","v":{"$error":"#DIV/0!"}},{"$f":"STDEVP(L13:L212)","v":{"$error":"#DIV/0!"}},"----------",{"$f":"STDEVP(N13:N212)","v":{"$error":"#DIV/0!"}},{"$f":"STDEVP(O13:O212)","v":{"$error":"#DIV/0!"}},{"$f":"STDEVP(P13:P212)","v":{"$error":"#DIV/0!"}},{"$f":"STDEVP(Q13:Q212)","v":{"$error":"#DIV/0!"}},"----------",{"$f":"STDEVP(S13:S212)","v":{"$error":"#DIV/0!"}},{"$f":"STDEVP(T13:T212)","v":{"$error":"#DIV/0!"}},{"$f":"STDEVP(U13:U212)","v":{"$error":"#DIV/0!"}},{"$f":"STDEVP(V13:V212)","v":{"$error":"#DIV/0!"}},"----------",{"$f":"STDEVP(X13:X212)","v":{"$error":"#DIV/0!"}},{"$f":"STDEVP(Y13:Y212)","v":{"$error":"#DIV/0!"}}]
[null,null,null,null,null,null,"Variance",null,{"$f":"VARP(I13:I212)","v":{"$error":"#DIV/0!"}},{"$f":"VARP(J13:J212)","v":{"$error":"#DIV/0!"}},{"$f":"VARP(K13:K212)","v":{"$error":"#DIV/0!"}},{"$f":"VARP(L13:L212)","v":{"$error":"#DIV/0!"}},"----------",{"$f":"VARP(N13:N212)","v":{"$error":"#DIV/0!"}},{"$f":"VARP(O13:O212)","v":{"$error":"#DIV/0!"}},{"$f":"VARP(P13:P212)","v":{"$error":"#DIV/0!"}},{"$f":"VARP(Q13:Q212)","v":{"$error":"#DIV/0!"}},"----------",{"$f":"VARP(S13:S212)","v":{"$error":"#DIV/0!"}},{"$f":"VARP(T13:T212)","v":{"$error":"#DIV/0!"}},{"$f":"VARP(U13:U212)","v":{"$error":"#DIV/0!"}},{"$f":"VARP(V13:V212)","v":{"$error":"#DIV/0!"}},"----------",{"$f":"VARP(X13:X212)","v":{"$error":"#DIV/0!"}},{"$f":"VARP(Y13:Y212)","v":{"$error":"#DIV/0!"}}]
[null,null,null,null,null,null,"Coeff. Of Var.",null,{"$f":"(I214/I213)*100","v":{"$error":"#DIV/0!"}},{"$f":"(J214/J213)*100","v":{"$error":"#DIV/0!"}},{"$f":"(K214/K213)*100","v":{"$error":"#DIV/0!"}},{"$f":"(L214/L213)*100","v":{"$error":"#DIV/0!"}},"----------",{"$f":"(N214/N213)*100","v":{"$error":"#DIV/0!"}},{"$f":"(O214/O213)*100","v":{"$error":"#DIV/0!"}},{"$f":"(P214/P213)*100","v":{"$error":"#DIV/0!"}},{"$f":"(Q214/Q213)*100","v":{"$error":"#DIV/0!"}},"----------",{"$f":"(S214/S213)*100","v":{"$error":"#DIV/0!"}},{"$f":"(T214/T213)*100","v":{"$error":"#DIV/0!"}},{"$f":"(U214/U213)*100","v":{"$error":"#DIV/0!"}},{"$f":"(V214/V213)*100","v":{"$error":"#DIV/0!"}},"----------",{"$f":"(X214/X213)*100","v":{"$error":"#DIV/0!"}},{"$f":"(Y214/Y213)*100","v":{"$error":"#DIV/0!"}}]
[null,null,null,null,null,null,"Minimum",null,{"$f":"MIN(I13:I212)","v":0},{"$f":"MIN(J13:J212)","v":0},{"$f":"MIN(K13:K212)","v":0},{"$f":"MIN(L13:L212)","v":0},"----------",{"$f":"MIN(N13:N212)","v":0},{"$f":"MIN(O13:O212)","v":0},{"$f":"MIN(P13:P212)","v":0},{"$f":"MIN(Q13:Q212)","v":0},"----------",{"$f":"MIN(S13:S212)","v":0},{"$f":"MIN(T13:T212)","v":0},{"$f":"MIN(U13:U212)","v":0},{"$f":"MIN(V13:V212)","v":0},"----------",{"$f":"MIN(X13:X212)","v":0},{"$f":"MIN(Y13:Y212)","v":0}]
[null,null,null,null,null,null,"Maximum",null,{"$f":"MAX(I13:I212)","v":0},{"$f":"MAX(J13:J212)","v":0},{"$f":"MAX(K13:K212)","v":0},{"$f":"MAX(L13:L212)","v":0},"----------",{"$f":"MAX(N13:N212)","v":0},{"$f":"MAX(O13:O212)","v":0},{"$f":"MAX(P13:P212)","v":0},{"$f":"MAX(Q13:Q212)","v":0},"----------",{"$f":"MAX(S13:S212)","v":0},{"$f":"MAX(T13:T212)","v":0},{"$f":"MAX(U13:U212)","v":0},{"$f":"MAX(V13:V212)","v":0},"----------",{"$f":"MAX(X13:X212)","v":0},{"$f":"MAX(Y13:Y212)","v":0}]

{"sheet":"STA Summary","index":2,"n_rows":64,"n_cols":55,"rows_kept":64,"cut":false,"hidden":true,"merged":[[1,0,1,13],[21,10,22,10],[18,2,18,5],[30,6,30,9],[23,4,26,4],[17,10,17,13],[20,2,20,5],[20,6,20,9],[20,10,20,13],[21,11,22,11],[23,11,26,11],[23,10,26,10],[29,2,29,5],[23,8,26,8],[12,3,12,4],[8,3,8,4],[16,2,16,5],[31,6,31,9],[31,10,31,13],[30,10,30,13],[29,10,29,13],[29,6,29,9],[32,2,32,5],[21,5,22,5],[23,2,26,2],[30,2,30,5],[31,2,31,5],[23,1,26,1],[21,6,22,6],[21,2,22,2],[23,3,26,3],[9,23,9,24],[10,23,10,24],[12,23,12,24],[13,23,13,24],[11,23,11,24],[9,3,9,4],[10,3,10,4],[11,3,11,4],[17,2,17,5],[17,6,17,9],[13,3,13,4],[14,23,14,24],[21,1,22,1],[21,7,22,7],[21,8,22,8],[21,9,22,9],[21,4,22,4],[21,3,22,3],[23,12,26,12],[21,12,22,12],[21,13,22,13],[58,39,58,40],[57,8,57,12],[57,13,57,17],[58,18,58,22],[57,18,57,22],[58,25,58,26],[57,23,57,24],[32,10,32,13],[32,6,32,9],[23,6,26,6],[23,7,26,7],[58,51,58,52],[58,27,58,28],[58,29,58,30],[58,31,58,32],[58,35,58,36],[58,37,58,38],[58,45,58,46],[58,49,58,50],[58,47,58,48],[58,41,58,42]]}
[]
[{"$f":"Search!AE1","v":"MDOT HMA STA Worksheet v1.10 - FY 2022 [effective for contracts containing frequently used special provision 12SP501(U), 12SP501(V), 12SP501(W), 20SP501(R) and/or 20SP501(S)]"}]
[]
[]
[]
[]
[null,"HMA Properties STA Summary"]
[]
[null,"Control Section",{"$f":"Properties!C2","v":""},"Binder Method",null,{"$f":"Properties!G2","v":"Ignition"},null,null,"Property",null,"Binder ","AV","VMA","Density",null,null,null,null,null,null,null,null,null,null,null,null,null,null,null,"Sublot"]
[null,"Job Number",{"$f":"Properties!C3","v":""},"Plant Location",null,{"$f":"Properties!G3","v":""},null,null,"Target or Min Density",null,{"$f":"H61","v":0},{"$f":"Properties!R4","v":3},{"$f":"Properties!T4","v":13},{"$f":"Properties!V4","v":92},null,null,null,null,null,null,null,null,null,null,null,null,null,null,null,{"$f":"Properties!$BF$7","v":1}]
[null,"Testing Lab",{"$f":"Properties!C4","v":""},"Plant ID",null,{"$f":"Properties!G4","v":"10-03"},null,null,"Dev./Target - Full/Inc.",null,{"$f":"Properties!P5","v":"≤ 0.45"},{"$f":"Properties!R5","v":"≤ 1.00"},{"$f":"Properties!T5","v":"≤ 1.00"},{"$f":"Properties!V5","v":"92.00 ≤"}]
[null,"Lab Location",{"$f":"Properties!C5","v":""},"Shldr Mix/Vibe Res.",null,{"$f":"Properties!G5","v":"No"},null,null,"Dev.Target - Dis.",null,{"$f":"Properties!P6","v":"0.46 - 1.00"},{"$f":"Properties!R6","v":"1.01 - 2.00"},{"$f":"Properties!T6","v":"1.01 - 2.00"},{"$f":"Properties!V6","v":"90.00 - 92.00"}]
[null,"Mix Type",{"$f":"Properties!C6","v":"2E03"},"Density QA",null,{"$f":"Properties!G6","v":"Std QA"},null,null,"Dev./Target - Sec. l.1.C",null,{"$f":"Properties!P7","v":"1.00 <"},{"$f":"Properties!R7","v":"2.00 <"},{"$f":"Properties!T7","v":"2.00 <"},{"$f":"Properties!V7","v":"< 90.00"}]
[null,"Mix Design #",{"$f":"Properties!C7","v":""},"Specification",null,{"$f":"Menu!F10","v":"12SP501U"}]
[null,"Contractor",{"$f":"Properties!C8","v":"Ace-Saginaw Paving Co"}]
[]
[null,"JMF",{"$f":"D61","v":0}]
[null,"STA #",{"$f":"E61","v":1}]
[null,"Sample Date",{"$f":"B61","v":"00:00:00"}]
[null,null,{"$f":"IF($K$24=0,\"Tests of Record\",\"\")","v":""},null,null,null,null,null,null,null,{"$f":"IF($K$24>0,\"Tests of Record\",\"\")","v":"Tests of Record"}]
[null,null,"MDOT QA",null,null,null,"Contractor Random QC",null,null,null,"MDOT Dispute Claim"]
[null,"Property","Binder Content","AV","VMA","Density","Binder Content","AV","VMA","Density","Binder Content","AV","VMA","Density"]
[]
[null,"Test Results",{"$f":"IF(I61=0,\"\",I61)","v":""},{"$f":"IF(J61=0,\"\",J61)","v":""},{"$f":"IF(K61=0,\"\",K61)","v":""},{"$f":"IF(L61=0,\"\",L61)","v":""},{"$f":"IF(N61=0,\"\",N61)","v":""},{"$f":"IF(O61=0,\"\",O61)","v":""},{"$f":"IF(P61=0,\"\",P61)","v":""},{"$f":"IF(Q61=0,\"\",Q61)","v":""},{"$f":"IF(S61=0,\"\",S61)","v":""},{"$f":"IF(T61=0,\"\",T61)","v":""},{"$f":"IF(U61=0,\"\",U61)","v":""},{"$f":"IF(V61=0,\"\",V61)","v":""}]
[null,null,null,null,null,{"$f":"IF(L62=0,\"\",L62)","v":""},null,null,null,{"$f":"IF(Q62=0,\"\",Q62)","v":""},null,null,null,{"$f":"IF(V62=0,\"\",V62)","v":""}]
[null,null,null,null,null,{"$f":"IF(L63=0,\"\",L63)","v":""},null,null,null,{"$f":"IF(Q63=0,\"\",Q63)","v":""},null,null,null,{"$f":"IF(V63=0,\"\",V63)","v":""}]
[null,null,null,null,null,{"$f":"IF(L64=0,\"\",L64)","v":""},null,null,null,{"$f":"IF(Q64=0,\"\",Q64)","v":""},null,null,null,{"$f":"IF(V64=0,\"\",V64)","v":""}]
[null,"Dev. From Target or Avg Density",{"$f":"IF(Z61=\"NA\",\"\",Z61)","v":""},{"$f":"IF(AB61=\"NA\",\"\",AB61)","v":""},{"$f":"IF(AD61=\"NA\",\"\",AD61)","v":""},{"$f":"IF(M61=0,\"\",M61)","v":""},{"$f":"IF(AJ61=\"NA\",\"\",AJ61)","v":""},{"$f":"IF(AL61=\"NA\",\"\",AL61)","v":""},{"$f":"IF(AN61=\"NA\",\"\",AN61)","v":""},{"$f":"IF(R61=0,\"\",R61)","v":""},{"$f":"IF(AT61=\"NA\",\"\",AT61)","v":""},{"$f":"IF(AV61=\"NA\",\"\",AV61)","v":""},{"$f":"IF(AX61=\"NA\",\"\",AX61)","v":""},{"$f":"IF(W61=0,\"\",W61)","v":""}]
[null,"PF",{"$f":"IF(C24=\"\",\"\",AA61)","v":""},{"$f":"IF(C24=\"\",\"\",AC61)","v":""},{"$f":"IF(C24=\"\",\"\",AE61)","v":""},{"$f":"IF(C24=\"\",\"\",AG61)","v":""},{"$f":"IF(G24=\"\",\"\",AK61)","v":""},{"$f":"IF(G24=\"\",\"\",AM61)","v":""},{"$f":"IF(G24=\"\",\"\",AO61)","v":""},{"$f":"IF(G24=\"\",\"\",AQ61)","v":""},{"$f":"IF(K24=\"\",\"\",AU61)","v":""},{"$f":"IF(K24=\"\",\"\",AW61)","v":""},{"$f":"IF(K24=\"\",\"\",AY61)","v":""},{"$f":"IF(K24=\"\",\"\",BA61)","v":""}]
[null,"OSPF",{"$f":"IF(C24=\"\",\"\",AH61)","v":""},null,null,null,{"$f":"IF(G24=\"\",\"\",AR61)","v":""},null,null,null,{"$f":"IF(K24=\"\",\"\",BB61)","v":""}]
[null,"STA Tons",{"$f":"IF(C24=\"\",\"\",G61)","v":""},null,null,null,{"$f":"IF(G24=\"\",\"\",G61)","v":""},null,null,null,{"$f":"IF(K24=\"\",\"\",G61)","v":""}]
[null,"Unit Price (ton)",{"$f":"IF(C24=\"\",\"\",IF(Menu!$C$10>Menu!$C$11,Menu!$C$10,IF(C30>100,Menu!$C$10,Menu!$C$11)))","v":""},null,null,null,{"$f":"IF(G24=\"\",\"\",IF(Menu!$C$10>Menu!$C$11,Menu!$C$10,IF(G30>100,Menu!$C$10,Menu!$C$11)))","v":""},null,null,null,{"$f":"IF(K24=\"\",\"\",IF(Menu!$C$10>Menu!$C$11,Menu!$C$10,IF(K30>100,Menu!$C$10,Menu!$C$11)))","v":""}]
[null,"STA Pay Adjustment",{"$f":"IF(C24=\"\",\"\",AI61)","v":""},null,null,null,{"$f":"IF(G24=\"\",\"\",AS61)","v":""},null,null,null,{"$f":"IF(K24=\"\",\"\",BC61)","v":""}]
[]
[]
[]
[null,"Notes:"]
[]
[]
[]
[]
[]
[]
[]
[]
[]
[]
[]
[]
[]
[]
[]
[]
[]
[]
[]
[]
[null,null,null,null,null,null,null,"Target","MDOT QA",null,null,null,null,"Contractor Random QC",null,null,null,null,"MDOT QA Dispute Resolution\n",null,null,null,null,"Mix Info",null,"MDOT STA Quality Assurance Results",null,null,null,null,null,null,null,{"$f":"IF($S$13=0,\"Tests of Record\",\"\")","v":"Tests of Record"},null,"Contractor STA Random Quality Control Results",null,null,null,null,null,null,null,null,null,"MDOT STA Dispute Claim Results",null,null,null,null,null,null,null,{"$f":"IF($S$13>0,\"Tests of Record\",\"\")","v":""}]
[null,null,null,null,null,null,null,null,null,null,null,null,null,null,null,null,null,null,"***Fill out only if there is a dispute***",null,null,null,null,null,null,"Binder Content",null,"Air Voids",null,"VMA",null,"Density",null,null,null,"Binder Content",null,"Air Voids",null,"VMA",null,"Density",null,null,null,"Binder Content",null,"Air Voids",null,"VMA",null,"Density"]
[null,"Sample Date","Mix Type","JMF ","STA #","STA Core #","STA Tons","Target Binder Content","QA Binder Content","QA AV","QAVMA","QA Density","QA Avg Density","QC Binder Content","QC AV","QC VMA","QC Density","QC STA Density","Dispute Binder Content","Dispute AV","DisputeVMA","DisputeDensity","Dispute Avg Density ","QA P200/Pbe Ratio","QC P200/Pbe Ratio","QA Bndr Dev. Target","QA Binder PF","QA AV Dev. Target","QA AV PF","QA VMA Dev. Target","QA VMA PF","QA Avg Density","QA Density PF","QA OSPF","QA STA Pay Adjustment","QC Bndr Dev. Target","QC Binder PF","QC AV Dev. Target","QC AV PF","QC VMA Dev. Target","QC VMA PF","QC Avg Density","QC Density PF","QC OSPF","QC STA Pay Adjustment","Dispute Bndr Dev. Target","Dispute Binder PF","Dispute AV Dev. Target","Dispute AV PF","Dispute VMA Dev. Target","Dispute VMA PF","Dispute Avg Density","Dispute Density PF","Dispute OSPF","Dispute STA Pay Adjustment"]
[null,null,"",null,1,null,null,null,null,null,null,null,0,null,null,null,null,0,null,null,null,null,0,null,null,"NA","NA","NA","NA","NA","NA",0,"NA","NA","NA","NA","NA","NA","NA","NA","NA","NA","NA","NA","NA","NA","NA","NA","NA","NA","NA","NA","NA","NA","NA"]
[null,null,null,null,1]
[null,null,null,null,1]
[null,null,null,null,1]

{"sheet":"Search","index":3,"n_rows":133,"n_cols":31,"rows_kept":133,"cut":false,"hidden":true,"merged":[[1,5,1,11]]}
[null,null,null,null,null,null,null,null,null,null,null,null,null,null,null,null,null,null,null,null,null,null,null,null,null,null,null,null,null,null,"MDOT HMA STA Worksheet v1.10 - FY 2022 [effective for contracts containing frequently used special provision 12SP501(U), 12SP501(V), 12SP501(W), 20SP501(R) and/or 20SP501(S)]"]
[null,null,null,null,null,"Mix Type",null,null,null,null,null,null,null,"Mix Selection",null,null,null,null,null,null,null,null,null,null,null,null,null,null,null,null,"1/14/22"]
[null,null,null,"Sublot",null,null,null,"Air Voids","Target VMA","Incentive","Disincentive","RQL",null,1,null,null,null,null,2,"Shoulder Regression",null,null,1,"Application",null,null,null,null,null,null,"v1.01-Updated Data Summary Sheet and Contractor/Plant List"]
[null,null,null,1,null,1,"2E03",3,13,null,null,null,null,null,null,null,null,null,1,"Yes",null,null,1,"Std QA",92,null,null,null,null,null,"V1.02-Updated Contractor/Plant List and changed Air Voids to 3.0% for E10, E30 and E50 mixes"]
[null,null,null,2,null,2,"2E1",3,13,null,null,null,null,null,null,null,null,null,2,"No",null,null,2,"Alternate QA","NA",null,null,null,null,null,"v1.03-Updated Air Voids targets to 3.0% for all mix types"]
[null,null,null,3,null,3,"2E3",3,13,null,null,null,null,null,null,null,null,null,null,null,null,null,3,"Tier 3 Shoulder",90,null,null,null,null,null,"v1.04-Updated Contractor/Plant List and Added Base Price"]
[null,null,null,4,null,4,"2E10",3,13,null,null,null,null,null,null,null,null,null,null,null,null,null,4,null,null,null,null,null,null,null,"v1.05-Corrected errors"]
[null,null,null,5,null,5,"2E30",3,13,null,null,null,null,{"$f":"IF(N27<3.1,1,2)","v":1},"Spec","VMA Lower Limit","VMA Disincentive Range","VMA Deviation from Target",null,null,null,null,5,null,null,null,null,null,null,null,"V1.06-Updated to new Spec limits and Combined STA spreadsheets for use with 12SP501U, 12SP501V and 12SP501W"]
[null,null,null,6,null,6,"2E50",3,13,null,null,null,null,1,"12SP501U",2.0099999999999998,"1.01 - 2.00","2.00 <",null,null,null,null,null,null,null,null,null,null,null,null,"V1.07-Updated the property incentive/disincentive tables to match the calculations"]
[null,null,null,7,null,7,"3E03",3,14,null,null,null,null,2,"12SP501V",2.44,"1.01 - 2.43","2.43 <",null,null,null,null,1,"Binder Method",null,null,null,null,null,null,"V1.08-Updated to include 12SP501W for Tier 3 Shoulder Density and drop down for "]
[null,null,null,8,null,8,"3E1",3,14,null,null,null,null,null,null,null,null,null,null,null,null,null,1,"Ignition",null,null,null,null,null,null,"v1.09-updated to for use with 20SP501S and 20SP501R. "]
[null,null,null,9,null,9,"3E3",3,14,null,null,null,null,null,null,null,null,null,null,null,null,null,2,"Solvent Extraction",null,null,null,null,null,null,"v1.10-updated mix types to 2020 Standard Specifications"]
[null,null,null,10,null,10,"3E10",3,14]
[null,null,null,11,null,11,"3E30",3,14,null,null,null,null,{"$f":"IF($W$3=3,3,$N$8)","v":1},"Spec","Density Incentive","Density Lower Limit","Density RQL Limit","i","ii","iii","iv","v"]
[null,null,null,12,null,12,"3E50",3,14,null,null,null,null,1,"12SP501U",94,92,90,105,2.5,130,10,820]
[null,null,null,13,null,13,"4E03",3,15,null,null,null,null,2,"12SP501V",94,92,90,105,2.5,130,10,820]
[null,null,null,14,null,14,"4E1",3,15,null,null,null,null,3,"12SP501W-Tier 3",92,90,88,105,2.5,125,10,800]
[null,null,null,15,null,15,"4E3",3,15]
[null,null,null,16,null,16,"4E10",3,15]
[null,null,null,17,null,17,"4E30",3,15,null,null,null,null,{"$f":"IF($W$3=3,3,$N$8)","v":1},"Spec","Density Insentive Range","Density Disincentive Range","Density Deviation from Target"]
[null,null,null,18,null,18,"4E50",3,15,null,null,null,null,1,"12SP501U","92.00 ≤","90.00 - 92.00","< 90.00"]
[null,null,null,19,null,19,"5E03",3,16,null,null,null,null,2,"12SP501V","92.00 ≤","90.00 - 92.00","< 90.00"]
[null,null,null,20,null,20,"5E1",3,16,null,null,null,null,3,"12SP501W-Tier 3","90.00 ≤","88.00 - 90.00","< 88.00"]
[null,null,null,21,null,21,"5E3",3,16]
[null,null,null,22,null,22,"5E10",3,16]
[null,null,null,23,null,23,"5E30",3,16]
[null,null,null,24,null,24,"5E50",3,16,null,null,null,null,1,"Spec Number "]
[null,null,null,25,null,25,"LVSP",3,15,null,null,null,null,1,"12SP501U-07 (06-08-18)"]
[null,null,null,26,null,26,"Gap-Graded Superpave",3,18,null,null,null,null,2,"12SP501U-08 (06-14-19)"]
[null,null,null,27,null,27,"2EL",3,13,null,null,null,null,3,"12SP501U-09 (12-13-19)"]
[null,null,null,28,null,28,"2EML",3,13,null,null,null,null,4,"12SP501V-08 (05-31-18)"]
[null,null,null,29,null,29,"2EMH",3,13,null,null,null,null,5,"12SP501V-09 (06-14-19)"]
[null,null,null,30,null,30,"2EH",3,13,null,null,null,null,6,"12SP501V-10 (12-13-19)",null,null,null,null,null,null,null,1,"Contractors",null,1,"Plant ID"]
[null,null,null,31,null,31,"3EL",3,14,null,null,null,null,7,"20SP501R-03 (09-17-21)",null,null,null,null,null,null,null,1,"Ace-Saginaw Paving Co",null,1,"ACE ASPHALT","BURTON","10-03"]
[null,null,null,32,null,32,"3EML",3,14,null,null,null,null,8,"20SP501S-02 (02-17-21)",null,null,null,null,null,null,null,2,"Aggregate Industries",null,2,"ACE ASPHALT","DAVISURG","10-04"]
[null,null,null,33,null,33,"3EMH",3,14,null,null,null,null,null,null,null,null,null,null,null,null,null,3,"Ajax Paving Industries",null,3,"ACE ASPHALT","PORT HURON","10-05"]
[null,null,null,34,null,34,"3EH",3,14,null,null,null,null,null,null,null,null,null,null,null,null,null,4,"Albrecht  Sand & Gravel",null,4,"AJAX PAVING INDUSTRIES","BRIGHTON","20-05"]
[null,null,null,35,null,35,"4EL",3,15,null,null,null,null,null,null,null,null,null,null,null,null,null,5,"Allied Construction",null,5,"AJAX PAVING INDUSTRIES","ROMULUS","20-07"]
[null,null,null,36,null,36,"4EML",3,15,null,null,null,null,null,null,null,null,null,null,null,null,null,6,"Angelo Luppino",null,6,"AJAX PAVING INDUSTRIES","AUBURN HILLS","20-08"]
[null,null,null,37,null,37,"4EMH",3,15,null,null,null,null,null,null,null,null,null,null,null,null,null,7,"Asphalt Paving",null,7,"AJAX PAVING INDUSTRIES","WARREN","20-10"]
[null,null,null,38,null,38,"4EH",3,15,null,null,null,null,null,null,null,null,null,null,null,null,null,8,"ATP Precision Paving",null,8,"AJAX PAVING INDUSTRIES","ROCHESTER HILLS","20-12"]
[null,null,null,39,null,39,"5EL",3,16,null,null,null,null,null,null,null,null,null,null,null,null,null,9,"Bacco Construction",null,9,"AJAX PAVING INDUSTRIES","ROCKWOOD","20-13"]
[null,null,null,40,null,40,"5EML",3,16,null,null,null,null,null,null,null,null,null,null,null,null,null,10,"Barrett Paving Materials",null,10,"AJAX PAVING INDUSTRIES","NEW HAVEN","20-14"]
[null,null,null,41,null,41,"5EMH",3,16,null,null,null,null,null,null,null,null,null,null,null,null,null,11,"Black Gold Paving",null,11,"ALBRECHT SAND & GRAVEL","SNOVER","22-01"]
[null,null,null,42,null,42,"5EH",3,16,null,null,null,null,null,null,null,null,null,null,null,null,null,12,"Bolen Asphalt Paving",null,12,"ANGELO LUPPINO","KIMBALL WISC.","38-01"]
[null,null,null,43,null,43,"SMA",3,18,null,null,null,null,null,null,null,null,null,null,null,null,null,13,"Cadillac Ashpalt",null,13,"ASPHALT PAVING","MUSKEGON","370-01"]
[null,null,null,44,null,44,null,3,15,null,null,null,null,null,null,null,null,null,null,null,null,null,14,"Central Asphalt",null,14,"ATP PRECISION PAVING","INTERLOCHEN","355-01"]
[null,null,null,45,null,45,null,3,15,null,null,null,null,null,null,null,null,null,null,null,null,null,15,"Edw. C. Levy Co.",null,15,"BACCO CONSTRUCTION COMPANY","PORTABLE","50-01"]
[null,null,null,46,null,46,null,3,15,null,null,null,null,null,null,null,null,null,null,null,null,null,16,"Elmer's Crane & Dozer",null,16,"BACCO CONSTRUCTION COMPANY","PORTABLE","50-02"]
[null,null,null,47,null,47,null,3,16,null,null,null,null,null,null,null,null,null,null,null,null,null,17,"Gerken Paving",null,17,"BACCO CONSTRUCTION COMPANY","PORTABLE","50-03"]
[null,null,null,48,null,48,null,3,16,null,null,null,null,null,null,null,null,null,null,null,null,null,18,"H&D",null,18,"BLACK GOLD PAVING","WAYLAND","55-01"]
[null,null,null,49,null,49,null,3,16,null,null,null,null,null,null,null,null,null,null,null,null,null,19,"John Carlo",null,19,"CADILLAC ASPHALT","ROMULUS","60-01"]
[null,null,null,50,null,50,null,3,16,null,null,null,null,null,null,null,null,null,null,null,null,null,20,"Lakeland Asphalt",null,20,"CADILLAC ASPHALT","TROY","60-02"]
[null,null,null,null,null,51,null,3,16,null,null,null,null,null,null,null,null,null,null,null,null,null,21,"Lansing Asphalt",null,21,"CADILLAC ASPHALT","ANN ARBOR","60-06"]
[null,null,null,null,null,52,null,3,14,null,null,null,null,null,null,null,null,null,null,null,null,null,22,"Lois Kay Contracting",null,22,"CADILLAC ASPHALT","FLINT","60-07"]
[null,null,null,null,null,53,null,3,14,null,null,null,null,null,null,null,null,null,null,null,null,null,23,"Mathy Construction",null,23,"CADILLAC ASPHALT","MT. CLEMENS","60-08"]
[null,null,null,null,null,54,null,3,14,null,null,null,null,null,null,null,null,null,null,null,null,null,24,"Michigan Paving & Materials",null,24,"CADILLAC ASPHALT","SMITHCREEK","60-09"]
[null,null,null,null,null,55,null,3,14,null,null,null,null,null,null,null,null,null,null,null,null,null,25,"Nagle Paving Co",null,25,"CADILLAC ASPHALT","BURTON","60-10"]
[null,null,null,null,null,56,null,3,14,null,null,null,null,null,null,null,null,null,null,null,null,null,26,"Niblock Excavating & Asphalt",null,26,"BOLEN ASPHALT PAVING","WEST BRANCH","100-01"]
[null,null,null,null,null,57,null,3,15,null,null,null,null,null,null,null,null,null,null,null,null,null,27,"Northeast Asphalt, Inc.",null,27,"BOLEN ASPHALT PAVING","LACHINE","100-02"]
[null,null,null,null,null,58,null,3,15,null,null,null,null,null,null,null,null,null,null,null,null,null,28,"Northwoods Paving",null,28,"CADILLAC ASPHALT","WIXOM","40-02"]
[null,null,null,null,null,59,null,3,15,null,null,null,null,null,null,null,null,null,null,null,null,null,29,"Omans Contracting",null,29,"CADILLAC ASPHALT","DETROIT","40-03"]
[null,null,null,null,null,60,null,3,15,null,null,null,null,null,null,null,null,null,null,null,null,null,30,"Payne & Dolan",null,30,"CADILLAC ASPHALT","CLARKSTON","40-04"]
[null,null,null,null,null,61,null,3,15,null,null,null,null,null,null,null,null,null,null,null,null,null,31,"Pyramid Paving & Contracting",null,31,"CADILLAC ASPHALT","BELLEVILLE","40-05"]
[null,null,null,null,null,62,null,3,15,null,null,null,null,null,null,null,null,null,null,null,null,null,32,"Rieth-Riley Constrction",null,32,"CADILLAC ASPHALT","WHITMORE LAKE","40-06"]
[null,null,null,null,null,63,null,3,15,null,null,null,null,null,null,null,null,null,null,null,null,null,33,"Smith Paving",null,33,"CENTRAL ASPHALT ","MT. PLEASANT","310-03"]
[null,null,null,null,null,null,null,null,null,null,null,null,null,null,null,null,null,null,null,null,null,null,34,"Superior Asphalt",null,34,"ELMER’S CRANE & DOZER","TRAVERSE CITY ","175-02"]
[null,null,null,null,null,null,null,null,null,null,null,null,null,null,null,null,null,null,null,null,null,null,35,"Tackett & Sons",null,35,"GERKEN PAVING","SYLVANIA OHIO","550-01"]
[null,null,null,null,null,null,null,null,null,null,null,null,null,null,null,null,null,null,null,null,null,null,36,"Wyoming Asphalt Paving",null,36,"GERKEN PAVING","MONROE","550-02"]
[null,null,null,null,null,null,null,null,null,null,null,null,null,null,null,null,null,null,null,null,null,null,37,null,null,37,"GERKEN PAVING","JONESVILLE","550-03"]
[null,null,null,null,null,null,null,null,null,null,null,null,null,null,null,null,null,null,null,null,null,null,38,null,null,38,"GERKEN PAVING","PIONEER OHIO","550-04"]
[null,null,null,null,null,null,null,null,null,null,null,null,null,null,null,null,null,null,null,null,null,null,39,null,null,39,"GERKEN PAVING","ADRIAN","550-05"]
[null,null,null,null,null,null,null,null,null,null,null,null,null,null,null,null,null,null,null,null,null,null,40,null,null,40,"GERKEN PAVING","JONESVILLE","550-06"]
[null,null,null,null,null,null,null,null,null,null,null,null,null,null,null,null,null,null,null,null,null,null,41,null,null,41,"JOHN CARLO INC.","SHELBY TWP.","115-02"]
[null,null,null,null,null,null,null,null,null,null,null,null,null,null,null,null,null,null,null,null,null,null,42,null,null,42,"LAKELAND ASPHALT","BATTLE CREEK","32-76"]
[null,null,null,null,null,null,null,null,null,null,null,null,null,null,null,null,null,null,null,null,null,null,43,null,null,43,"LANSING ASPHALT, INC.","LANSING","450-02"]
[null,null,null,null,null,null,null,null,null,null,null,null,null,null,null,null,null,null,null,null,null,null,44,null,null,44,"MATHY CONSTRUCTION","PORTABLE","260-07"]
[null,null,null,null,null,null,null,null,null,null,null,null,null,null,null,null,null,null,null,null,null,null,45,null,null,45,"MATHY CONSTRUCTION","PORTABLE ","260-08"]
[null,null,null,null,null,null,null,null,null,null,null,null,null,null,null,null,null,null,null,null,null,null,46,null,null,46,"MATHY CONSTRUCTION","PORTABLE","260-09"]
[null,null,null,null,null,null,null,null,null,null,null,null,null,null,null,null,null,null,null,null,null,null,47,null,null,47,"MATHY CONSTRUCTION","PORTABLE","260-10"]
[null,null,null,null,null,null,null,null,null,null,null,null,null,null,null,null,null,null,null,null,null,null,48,null,null,48,"MATHY CONSTRUCTION","POTABLE","260-11"]
[null,null,null,null,null,null,null,null,null,null,null,null,null,null,null,null,null,null,null,null,null,null,49,null,null,49,"MATHY CONSTRUCTION","PORTABLE","260-12"]
[null,null,null,null,null,null,null,null,null,null,null,null,null,null,null,null,null,null,null,null,null,null,50,null,null,50,"MICHIGAN PAVING & MATERIALS","LAWRENCE","240-03"]
[null,null,null,null,null,null,null,null,null,null,null,null,null,null,null,null,null,null,null,null,null,null,null,null,null,51,"MICHIGAN PAVING & MATERIALS","LANSING","420-05"]
[null,null,null,null,null,null,null,null,null,null,null,null,null,null,null,null,null,null,null,null,null,null,null,null,null,52,"MICHIGAN PAVING & MATERIALS","GRAND RAPIDS","440-07"]
[null,null,null,null,null,null,null,null,null,null,null,null,null,null,null,null,null,null,null,null,null,null,null,null,null,53,"MICHIGAN PAVING & MATERIALS","KALAMAZOO","440-08"]
[null,null,null,null,null,null,null,null,null,null,null,null,null,null,null,null,null,null,null,null,null,null,null,null,null,54,"MICHIGAN PAVING & MATERIALS","GALESBURG","440-10"]
[null,null,null,null,null,null,null,null,null,null,null,null,null,null,null,null,null,null,null,null,null,null,null,null,null,55,"MICHIGAN PAVING & MATERIALS","JACKSON","440-11"]
[null,null,null,null,null,null,null,null,null,null,null,null,null,null,null,null,null,null,null,null,null,null,null,null,null,56,"MICHIGAN PAVING & MATERIALS","COMSTOCK PARK","440-12"]
[null,null,null,null,null,null,null,null,null,null,null,null,null,null,null,null,null,null,null,null,null,null,null,null,null,57,"MICHIGAN PAVING & MATERIALS","COLDWATER","440-13"]
[null,null,null,null,null,null,null,null,null,null,null,null,null,null,null,null,null,null,null,null,null,null,null,null,null,58,"NAGLE PAVING CO.","NOVI/LIVONIA","325-01"]
[null,null,null,null,null,null,null,null,null,null,null,null,null,null,null,null,null,null,null,null,null,null,null,null,null,59,"OMANS CONTRACTING","HESPERIA","340-01"]
[null,null,null,null,null,null,null,null,null,null,null,null,null,null,null,null,null,null,null,null,null,null,null,null,null,60,"PAYNE & DOLAN INC.","PORTABLE","350-01"]
[null,null,null,null,null,null,null,null,null,null,null,null,null,null,null,null,null,null,null,null,null,null,null,null,null,61,"PAYNE & DOLAN INC.","PORTABLE","350-03"]
[null,null,null,null,null,null,null,null,null,null,null,null,null,null,null,null,null,null,null,null,null,null,null,null,null,62,"PAYNE & DOLAN INC.","PORTABLE","350-05"]
[null,null,null,null,null,null,null,null,null,null,null,null,null,null,null,null,null,null,null,null,null,null,null,null,null,63,"PAYNE & DOLAN INC.","PORTABLE","350-07"]
[null,null,null,null,null,null,null,null,null,null,null,null,null,null,null,null,null,null,null,null,null,null,null,null,null,64,"PAYNE & DOLAN INC.","PORTABLE","350-08"]
[null,null,null,null,null,null,null,null,null,null,null,null,null,null,null,null,null,null,null,null,null,null,null,null,null,65,"PAYNE & DOLAN INC.","PORTABLE","350-11"]
[null,null,null,null,null,null,null,null,null,null,null,null,null,null,null,null,null,null,null,null,null,null,null,null,null,66,"PAYNE & DOLAN INC.","PORTABLE","350-13"]
[null,null,null,null,null,null,null,null,null,null,null,null,null,null,null,null,null,null,null,null,null,null,null,null,null,67,"PAYNE & DOLAN INC.","PORTABLE","350-14"]
[null,null,null,null,null,null,null,null,null,null,null,null,null,null,null,null,null,null,null,null,null,null,null,null,null,68,"PAYNE & DOLAN INC.","PORTABLE","350-15"]
[null,null,null,null,null,null,null,null,null,null,null,null,null,null,null,null,null,null,null,null,null,null,null,null,null,69,"PAYNE & DOLAN INC.","PORTABLE","350-16"]
[null,null,null,null,null,null,null,null,null,null,null,null,null,null,null,null,null,null,null,null,null,null,null,null,null,70,"PAYNE & DOLAN INC.","PORTABLE","350-17"]
[null,null,null,null,null,null,null,null,null,null,null,null,null,null,null,null,null,null,null,null,null,null,null,null,null,71,"PAYNE & DOLAN INC.","PORTABLE","350-19"]
[null,null,null,null,null,null,null,null,null,null,null,null,null,null,null,null,null,null,null,null,null,null,null,null,null,72,"PAYNE & DOLAN INC.","PORTABLE","350-23"]
[null,null,null,null,null,null,null,null,null,null,null,null,null,null,null,null,null,null,null,null,null,null,null,null,null,73,"PAYNE & DOLAN INC.","PORTABLE","350-24"]
[null,null,null,null,null,null,null,null,null,null,null,null,null,null,null,null,null,null,null,null,null,null,null,null,null,74,"PYRAMID PAVING","ESSEXVILLE","345-01"]
[null,null,null,null,null,null,null,null,null,null,null,null,null,null,null,null,null,null,null,null,null,null,null,null,null,75,"PYRAMID PAVING","WEST BRANCH","345-02"]
[null,null,null,null,null,null,null,null,null,null,null,null,null,null,null,null,null,null,null,null,null,null,null,null,null,76,"RIETH-RILEY CONSTRUCTION","MASON","110-02"]
[null,null,null,null,null,null,null,null,null,null,null,null,null,null,null,null,null,null,null,null,null,null,null,null,null,77,"RIETH-RILEY CONSTRUCTION","GRAND RAPIDS","110-03"]
[null,null,null,null,null,null,null,null,null,null,null,null,null,null,null,null,null,null,null,null,null,null,null,null,null,78,"RIETH-RILEY CONSTRUCTION","ZEELAND","110-04"]
[null,null,null,null,null,null,null,null,null,null,null,null,null,null,null,null,null,null,null,null,null,null,null,null,null,79,"RIETH-RILEY CONSTRUCTION","KALAMAZOO","110-05"]
[null,null,null,null,null,null,null,null,null,null,null,null,null,null,null,null,null,null,null,null,null,null,null,null,null,80,"RIETH-RILEY CONSTRUCTION","BENTON HARBOR","160-01"]
[null,null,null,null,null,null,null,null,null,null,null,null,null,null,null,null,null,null,null,null,null,null,null,null,null,81,"RIETH-RILEY CONSTRUCTION","BAYSHORE","210-01"]
[null,null,null,null,null,null,null,null,null,null,null,null,null,null,null,null,null,null,null,null,null,null,null,null,null,82,"RIETH-RILEY CONSTRUCTION","LEVERING","210-02"]
[null,null,null,null,null,null,null,null,null,null,null,null,null,null,null,null,null,null,null,null,null,null,null,null,null,83,"RIETH-RILEY CONSTRUCTION","PORTABLE","210-03"]
[null,null,null,null,null,null,null,null,null,null,null,null,null,null,null,null,null,null,null,null,null,null,null,null,null,84,"RIETH-RILEY CONSTRUCTION","HUDSON TWP ","210-05"]
[null,null,null,null,null,null,null,null,null,null,null,null,null,null,null,null,null,null,null,null,null,null,null,null,null,85,"RIETH-RILEY CONSTRUCTION","MANTON ","390-05"]
[null,null,null,null,null,null,null,null,null,null,null,null,null,null,null,null,null,null,null,null,null,null,null,null,null,86,"RIETH-RILEY CONSTRUCTION","LUDINGTON","390-16"]
[null,null,null,null,null,null,null,null,null,null,null,null,null,null,null,null,null,null,null,null,null,null,null,null,null,87,"RIETH-RILEY CONSTRUCTION","BIG RAPIDS","390-17"]
[null,null,null,null,null,null,null,null,null,null,null,null,null,null,null,null,null,null,null,null,null,null,null,null,null,88,"RIETH-RILEY CONSTRUCTION","ADA","390-19"]
[null,null,null,null,null,null,null,null,null,null,null,null,null,null,null,null,null,null,null,null,null,null,null,null,null,89,"RIETH-RILEY CONSTRUCTION","TRAVERSE CITY ","390-20"]
[null,null,null,null,null,null,null,null,null,null,null,null,null,null,null,null,null,null,null,null,null,null,null,null,null,90,"RIETH-RILEY CONSTRUCTION","ROSCOMMON","390-21"]
[null,null,null,null,null,null,null,null,null,null,null,null,null,null,null,null,null,null,null,null,null,null,null,null,null,91,"RIETH-RILEY CONSTRUCTION","LANSING","390-22"]
[null,null,null,null,null,null,null,null,null,null,null,null,null,null,null,null,null,null,null,null,null,null,null,null,null,92,"SAGINAW ASPHALT PAVING","SAGINAW","410-06"]
[null,null,null,null,null,null,null,null,null,null,null,null,null,null,null,null,null,null,null,null,null,null,null,null,null,93,"SAGINAW ASPHALT PAVING","NORTH LAKE","410-10"]
[null,null,null,null,null,null,null,null,null,null,null,null,null,null,null,null,null,null,null,null,null,null,null,null,null,94,"SAGINAW ASPHALT PAVING","CARROLLTON","410-11"]
[null,null,null,null,null,null,null,null,null,null,null,null,null,null,null,null,null,null,null,null,null,null,null,null,null,95,"SAGINAW ASPHALT PAVING","UBLY","410-13"]
[null,null,null,null,null,null,null,null,null,null,null,null,null,null,null,null,null,null,null,null,null,null,null,null,null,96,"SMITH PAVING","PORTABLE","415-01"]
[null,null,null,null,null,null,null,null,null,null,null,null,null,null,null,null,null,null,null,null,null,null,null,null,null,97,"SUPERIOR ASPHALT, INC.","GRAND RAPIDS","450-01"]
[null,null,null,null,null,null,null,null,null,null,null,null,null,null,null,null,null,null,null,null,null,null,null,null,null,98,"TACKET & SONS, LLC","JONESVILLE","455-01"]
[null,null,null,null,null,null,null,null,null,null,null,null,null,null,null,null,null,null,null,null,null,null,null,null,null,99]
[null,null,null,null,null,null,null,null,null,null,null,null,null,null,null,null,null,null,null,null,null,null,null,null,null,100]

{"sheet":"Data Summary","index":4,"n_rows":52,"n_cols":73,"rows_kept":52,"cut":false,"hidden":true,"merged":[]}
[]
[null,"Control Section","Job Number","Testing Lab","Lab Location","MDOT Mix Design No.","Unit Price $/ton","Density QA","Mix Type","Binder\nMethod","JMF","Shldr Mix/Vibe Res.","Contractor","Plant Location","Plant ID","Sta #","STA Tons","LSL Density","Target Binder Content","Target AV","QA Binder Content","QA Binder Deviation from Target","QA Binder PF","QA Air Voids","QA AV Deviation from Target","QA Air Voids PF","QA VMA","QA VMA Deviation from Target","QA VMA PF","QA Density Core 1","QA Density Core 2","QA Density Core 3","QA Density Core 4","QA Average Density","QA Density PF","QA OSPF","QA STA Pay Adjustment","QA P200/Pbe Ratio","QC Binder Content","QC Binder Deviation from Target","QC Binder PF","QC Air Voids","QC AV Deviation from Target","QC Air Voids PF","QC VMA","QC VMA Deviation from Target","QC VMA PF","QC Density Core 1","QC Density Core 2","QC Density Core 3","QC Density Core 4","QC Average Density","QC Density PF","QC OSPF","QC STA Pay Adjustment","QC P200/Pbe Ratio","Dispute Binder Content","Dispute Binder Deviation from Target","Dispute Binder PF","Dispute Air Voids","Dispute AV Deviation from Target","Dispute Air Voids PF","Dispute VMA","Dispute VMA Deviation from Target","Dispute VMA PF","Dispute Density Core 1","Dispute Density Core 2","Dispute Density Core 3","Dispute Density Core 4","Dispute Average Density","Dispute Density PF","Dispute OSPF","Dispute STA Pay Adjustment"]
[null,{"$f":"IF(Menu!$C$5=0,\"\",Menu!$C$5)","v":""},{"$f":"IF(Menu!$C$6=0,\"\",Menu!$C$6)","v":""},{"$f":"IF(Menu!$C$7=0,\"\",Menu!$C$7)","v":""},{"$f":"IF(Menu!$C$8=0,\"\",Menu!$C$8)","v":""},{"$f":"IF(Menu!$C$9=0,\"\",Menu!$C$9)","v":""},{"$f":"IF(Menu!$C$10=0,\"\",Menu!$C$10)","v":""},{"$f":"IF(Menu!$F$7=0,\"\",Menu!$F$7)","v":"Std QA"},{"$f":"IF(Menu!$F$5=0,\"\",Menu!$F$5)","v":"2E03"},{"$f":"IF(Menu!$F$8=0,\"\",Menu!$F$8)","v":"Ignition"},{"$f":"IF(Properties!D13=0,\"\",Properties!D13)","v":""},{"$f":"IF(Properties!$G$5=0,\"\",Properties!$G$5)","v":"No"},{"$f":"IF(Properties!$C$9=0,\"\",Properties!$C$9)","v":""},{"$f":"IF(Properties!$G$3=0,\"\",Properties!$G$3)","v":""},{"$f":"IF(Properties!$G$4=0,\"\",Properties!$G$4)","v":"10-03"},{"$f":"IF(Properties!E13=0,\"\",Properties!E13)","v":1},{"$f":"IF(Properties!G13=0,\"\",Properties!G13)","v":""},{"$f":"IF(Menu!$G$17=0,\"\",Menu!$G$17)","v":92},{"$f":"IF(Properties!H13=0,\"\",Properties!H13)","v":""},{"$f":"IF(Properties!$R$4=0,\"\",Properties!$R$4)","v":3},{"$f":"IF(Properties!I13=0,\"\",Properties!I13)","v":""},{"$f":"Properties!Z13","v":"NA"},{"$f":"Properties!AA13","v":"NA"},{"$f":"IF(Properties!J13=0,\"\",Properties!J13)","v":""},{"$f":"Properties!AB13","v":"NA"},{"$f":"Properties!AC13","v":"NA"},{"$f":"Properties!K13","v":0},{"$f":"Properties!AD13","v":"NA"},{"$f":"Properties!AE13","v":"NA"},{"$f":"IF(Properties!$L13=0,\"\",Properties!$L13)","v":""},{"$f":"IF(Properties!$L14=0,\"\",Properties!$L14)","v":""},{"$f":"IF(Properties!$L15=0,\"\",Properties!$L15)","v":""},{"$f":"IF(Properties!$L16=0,\"\",Properties!$L16)","v":""},{"$f":"IF(Properties!AF13=0,\"\",Properties!AF13)","v":"NA"},{"$f":"Properties!AG13","v":"NA"},{"$f":"Properties!AH13","v":"NA"},{"$f":"Properties!AI13","v":"NA"},{"$f":"IF(Properties!X13=0,\"\",Properties!X13)","v":""},{"$f":"IF(Properties!N13=0,\"\",Properties!N13)","v":""},{"$f":"Properties!AJ13","v":"NA"},{"$f":"Properties!AK13","v":"NA"},{"$f":"IF(Properties!O13=0,\"\",Properties!O13)","v":""},{"$f":"Properties!AL13","v":"NA"},{"$f":"Properties!AM13","v":"NA"},{"$f":"IF(Properties!P13=0,\"\",Properties!P13)","v":""},{"$f":"Properties!AN13","v":"NA"},{"$f":"Properties!AO13","v":"NA"},{"$f":"IF(Properties!$Q13=0,\"\",Properties!$Q13)","v":""},{"$f":"IF(Properties!$Q14=0,\"\",Properties!$Q14)","v":""},{"$f":"IF(Properties!$Q15=0,\"\",Properties!$Q15)","v":""},{"$f":"IF(Properties!$Q16=0,\"\",Properties!$Q16)","v":""},{"$f":"IF(Properties!AP13=0,\"\",Properties!AP13)","v":"NA"},{"$f":"Properties!AQ13","v":"NA"},{"$f":"Properties!AR13","v":"NA"},{"$f":"Properties!AS13","v":"NA"},{"$f":"IF(Properties!Y13=0,\"\",Properties!Y13)","v":""},{"$f":"IF(Properties!S13=0,\"\",Properties!S13)","v":""},{"$f":"Properties!AT13","v":"NA"},{"$f":"Properties!AU13","v":"NA"},{"$f":"IF(Properties!T13=0,\"\",Properties!T13)","v":""},{"$f":"Properties!AV13","v":"NA"},{"$f":"Properties!AW13","v":"NA"},{"$f":"IF(Properties!U13=0,\"\",Properties!U13)","v":""},{"$f":"Properties!AX13","v":"NA"},{"$f":"Properties!AY13","v":"NA"},{"$f":"IF(Properties!$V13=0,\"\",Properties!$V13)","v":""},{"$f":"IF(Properties!$V14=0,\"\",Properties!$V14)","v":""},{"$f":"IF(Properties!$V15=0,\"\",Properties!$V15)","v":""},{"$f":"IF(Properties!$V16=0,\"\",Properties!$V16)","v":""},{"$f":"IF(Properties!W13=0,\"\",Properties!W13)","v":""},{"$f":"Properties!BA13","v":"NA"},{"$f":"Properties!BB13","v":"NA"},{"$f":"Properties!BC13","v":"NA"}]
[null,{"$f":"IF(Menu!$C$5=0,\"\",Menu!$C$5)","v":""},{"$f":"IF(Menu!$C$6=0,\"\",Menu!$C$6)","v":""},{"$f":"IF(Menu!$C$7=0,\"\",Menu!$C$7)","v":""},{"$f":"IF(Menu!$C$8=0,\"\",Menu!$C$8)","v":""},{"$f":"IF(Menu!$C$9=0,\"\",Menu!$C$9)","v":""},{"$f":"IF(Menu!$C$10=0,\"\",Menu!$C$10)","v":""},{"$f":"IF(Menu!$F$7=0,\"\",Menu!$F$7)","v":"Std QA"},{"$f":"IF(Menu!$F$5=0,\"\",Menu!$F$5)","v":"2E03"},{"$f":"IF(Menu!$F$8=0,\"\",Menu!$F$8)","v":"Ignition"},{"$f":"IF(Properties!D17=0,\"\",Properties!D17)","v":""},{"$f":"IF(Properties!$G$5=0,\"\",Properties!$G$5)","v":"No"},{"$f":"IF(Properties!$C$9=0,\"\",Properties!$C$9)","v":""},{"$f":"IF(Properties!$G$3=0,\"\",Properties!$G$3)","v":""},{"$f":"IF(Properties!$G$4=0,\"\",Properties!$G$4)","v":"10-03"},{"$f":"IF(Properties!E17=0,\"\",Properties!E17)","v":2},{"$f":"IF(Properties!G17=0,\"\",Properties!G17)","v":""},{"$f":"IF(Menu!$G$17=0,\"\",Menu!$G$17)","v":92},{"$f":"IF(Properties!H17=0,\"\",Properties!H17)","v":""},{"$f":"IF(Properties!$R$4=0,\"\",Properties!$R$4)","v":3},{"$f":"IF(Properties!I17=0,\"\",Properties!I17)","v":""},{"$f":"Properties!Z17","v":"NA"},{"$f":"Properties!AA17","v":"NA"},{"$f":"IF(Properties!J17=0,\"\",Properties!J17)","v":""},{"$f":"Properties!AB17","v":"NA"},{"$f":"Properties!AC17","v":"NA"},{"$f":"Properties!K17","v":0},{"$f":"Properties!AD17","v":"NA"},{"$f":"Properties!AE17","v":"NA"},{"$f":"IF(Properties!$L17=0,\"\",Properties!$L17)","v":""},{"$f":"IF(Properties!$L18=0,\"\",Properties!$L18)","v":""},{"$f":"IF(Properties!$L19=0,\"\",Properties!$L19)","v":""},{"$f":"IF(Properties!$L20=0,\"\",Properties!$L20)","v":""},{"$f":"IF(Properties!AF17=0,\"\",Properties!AF17)","v":"NA"},{"$f":"Properties!AG17","v":"NA"},{"$f":"Properties!AH17","v":"NA"},{"$f":"Properties!AI17","v":"NA"},{"$f":"IF(Properties!X17=0,\"\",Properties!X17)","v":""},{"$f":"IF(Properties!N17=0,\"\",Properties!N17)","v":""},{"$f":"Properties!AJ17","v":"NA"},{"$f":"Properties!AK17","v":"NA"},{"$f":"IF(Properties!O17=0,\"\",Properties!O17)","v":""},{"$f":"Properties!AL17","v":"NA"},{"$f":"Properties!AM17","v":"NA"},{"$f":"IF(Properties!P17=0,\"\",Properties!P17)","v":""},{"$f":"Properties!AN17","v":"NA"},{"$f":"Properties!AO17","v":"NA"},{"$f":"IF(Properties!$Q17=0,\"\",Properties!$Q17)","v":""},{"$f":"IF(Properties!$Q18=0,\"\",Properties!$Q18)","v":""},{"$f":"IF(Properties!$Q19=0,\"\",Properties!$Q19)","v":""},{"$f":"IF(Properties!$Q20=0,\"\",Properties!$Q20)","v":""},{"$f":"IF(Properties!AP17=0,\"\",Properties!AP17)","v":"NA"},{"$f":"Properties!AQ17","v":"NA"},{"$f":"Properties!AR17","v":"NA"},{"$f":"Properties!AS17","v":"NA"},{"$f":"IF(Properties!Y17=0,\"\",Properties!Y17)","v":""},{"$f":"IF(Properties!S17=0,\"\",Properties!S17)","v":""},{"$f":"Properties!AT17","v":"NA"},{"$f":"Properties!AU17","v":"NA"},{"$f":"IF(Properties!T17=0,\"\",Properties!T17)","v":""},{"$f":"Properties!AV17","v":"NA"},{"$f":"Properties!AW17","v":"NA"},{"$f":"IF(Properties!U17=0,\"\",Properties!U17)","v":""},{"$f":"Properties!AX17","v":"NA"},{"$f":"Properties!AY17","v":"NA"},{"$f":"IF(Properties!$V17=0,\"\",Properties!$V17)","v":""},{"$f":"IF(Properties!$V18=0,\"\",Properties!$V18)","v":""},{"$f":"IF(Properties!$V19=0,\"\",Properties!$V19)","v":""},{"$f":"IF(Properties!$V20=0,\"\",Properties!$V20)","v":""},{"$f":"IF(Properties!W17=0,\"\",Properties!W17)","v":""},{"$f":"Properties!BA17","v":"NA"},{"$f":"Properties!BB17","v":"NA"},{"$f":"Properties!BC17","v":"NA"}]
[null,{"$f":"IF(Menu!$C$5=0,\"\",Menu!$C$5)","v":""},{"$f":"IF(Menu!$C$6=0,\"\",Menu!$C$6)","v":""},{"$f":"IF(Menu!$C$7=0,\"\",Menu!$C$7)","v":""},{"$f":"IF(Menu!$C$8=0,\"\",Menu!$C$8)","v":""},{"$f":"IF(Menu!$C$9=0,\"\",Menu!$C$9)","v":""},{"$f":"IF(Menu!$C$10=0,\"\",Menu!$C$10)","v":""},{"$f":"IF(Menu!$F$7=0,\"\",Menu!$F$7)","v":"Std QA"},{"$f":"IF(Menu!$F$5=0,\"\",Menu!$F$5)","v":"2E03"},{"$f":"IF(Menu!$F$8=0,\"\",Menu!$F$8)","v":"Ignition"},{"$f":"IF(Properties!D21=0,\"\",Properties!D21)","v":""},{"$f":"IF(Properties!$G$5=0,\"\",Properties!$G$5)","v":"No"},{"$f":"IF(Properties!$C$9=0,\"\",Properties!$C$9)","v":""},{"$f":"IF(Properties!$G$3=0,\"\",Properties!$G$3)","v":""},{"$f":"IF(Properties!$G$4=0,\"\",Properties!$G$4)","v":"10-03"},{"$f":"IF(Properties!E21=0,\"\",Properties!E21)","v":3},{"$f":"IF(Properties!G21=0,\"\",Properties!G21)","v":""},{"$f":"IF(Menu!$G$17=0,\"\",Menu!$G$17)","v":92},{"$f":"IF(Properties!H21=0,\"\",Properties!H21)","v":""},{"$f":"IF(Properties!$R$4=0,\"\",Properties!$R$4)","v":3},{"$f":"IF(Properties!I21=0,\"\",Properties!I21)","v":""},{"$f":"Properties!Z21","v":"NA"},{"$f":"Properties!AA21","v":"NA"},{"$f":"IF(Properties!J21=0,\"\",Properties!J21)","v":""},{"$f":"Properties!AB21","v":"NA"},{"$f":"Properties!AC21","v":"NA"},{"$f":"Properties!K21","v":0},{"$f":"Properties!AD21","v":"NA"},{"$f":"Properties!AE21","v":"NA"},{"$f":"IF(Properties!$L21=0,\"\",Properties!$L21)","v":""},{"$f":"IF(Properties!$L22=0,\"\",Properties!$L22)","v":""},{"$f":"IF(Properties!$L23=0,\"\",Properties!$L23)","v":""},{"$f":"IF(Properties!$L24=0,\"\",Properties!$L24)","v":""},{"$f":"IF(Properties!AF21=0,\"\",Properties!AF21)","v":"NA"},{"$f":"Properties!AG21","v":"NA"},{"$f":"Properties!AH21","v":"NA"},{"$f":"Properties!AI21","v":"NA"},{"$f":"IF(Properties!X21=0,\"\",Properties!X21)","v":""},{"$f":"IF(Properties!N21=0,\"\",Properties!N21)","v":""},{"$f":"Properties!AJ21","v":"NA"},{"$f":"Properties!AK21","v":"NA"},{"$f":"IF(Properties!O21=0,\"\",Properties!O21)","v":""},{"$f":"Properties!AL21","v":"NA"},{"$f":"Properties!AM21","v":"NA"},{"$f":"IF(Properties!P21=0,\"\",Properties!P21)","v":""},{"$f":"Properties!AN21","v":"NA"},{"$f":"Properties!AO21","v":"NA"},{"$f":"IF(Properties!$Q21=0,\"\",Properties!$Q21)","v":""},{"$f":"IF(Properties!$Q22=0,\"\",Properties!$Q22)","v":""},{"$f":"IF(Properties!$Q23=0,\"\",Properties!$Q23)","v":""},{"$f":"IF(Properties!$Q24=0,\"\",Properties!$Q24)","v":""},{"$f":"IF(Properties!AP21=0,\"\",Properties!AP21)","v":"NA"},{"$f":"Properties!AQ21","v":"NA"},{"$f":"Properties!AR21","v":"NA"},{"$f":"Properties!AS21","v":"NA"},{"$f":"IF(Properties!Y21=0,\"\",Properties!Y21)","v":""},{"$f":"IF(Properties!S21=0,\"\",Properties!S21)","v":""},{"$f":"Properties!AT21","v":"NA"},{"$f":"Properties!AU21","v":"NA"},{"$f":"IF(Properties!T21=0,\"\",Properties!T21)","v":""},{"$f":"Properties!AV21","v":"NA"},{"$f":"Properties!AW21","v":"NA"},{"$f":"IF(Properties!U21=0,\"\",Properties!U21)","v":""},{"$f":"Properties!AX21","v":"NA"},{"$f":"Properties!AY21","v":"NA"},{"$f":"IF(Properties!$V21=0,\"\",Properties!$V21)","v":""},{"$f":"IF(Properties!$V22=0,\"\",Properties!$V22)","v":""},{"$f":"IF(Properties!$V23=0,\"\",Properties!$V23)","v":""},{"$f":"IF(Properties!$V24=0,\"\",Properties!$V24)","v":""},{"$f":"IF(Properties!W21=0,\"\",Properties!W21)","v":""},{"$f":"Properties!BA21","v":"NA"},{"$f":"Properties!BB21","v":"NA"},{"$f":"Properties!BC21","v":"NA"}]
[null,{"$f":"IF(Menu!$C$5=0,\"\",Menu!$C$5)","v":""},{"$f":"IF(Menu!$C$6=0,\"\",Menu!$C$6)","v":""},{"$f":"IF(Menu!$C$7=0,\"\",Menu!$C$7)","v":""},{"$f":"IF(Menu!$C$8=0,\"\",Menu!$C$8)","v":""},{"$f":"IF(Menu!$C$9=0,\"\",Menu!$C$9)","v":""},{"$f":"IF(Menu!$C$10=0,\"\",Menu!$C$10)","v":""},{"$f":"IF(Menu!$F$7=0,\"\",Menu!$F$7)","v":"Std QA"},{"$f":"IF(Menu!$F$5=0,\"\",Menu!$F$5)","v":"2E03"},{"$f":"IF(Menu!$F$8=0,\"\",Menu!$F$8)","v":"Ignition"},{"$f":"IF(Properties!D25=0,\"\",Properties!D25)","v":""},{"$f":"IF(Properties!$G$5=0,\"\",Properties!$G$5)","v":"No"},{"$f":"IF(Properties!$C$9=0,\"\",Properties!$C$9)","v":""},{"$f":"IF(Properties!$G$3=0,\"\",Properties!$G$3)","v":""},{"$f":"IF(Properties!$G$4=0,\"\",Properties!$G$4)","v":"10-03"},{"$f":"IF(Properties!E25=0,\"\",Properties!E25)","v":4},{"$f":"IF(Properties!G25=0,\"\",Properties!G25)","v":""},{"$f":"IF(Menu!$G$17=0,\"\",Menu!$G$17)","v":92},{"$f":"IF(Properties!H25=0,\"\",Properties!H25)","v":""},{"$f":"IF(Properties!$R$4=0,\"\",Properties!$R$4)","v":3},{"$f":"IF(Properties!I25=0,\"\",Properties!I25)","v":""},{"$f":"Properties!Z25","v":"NA"},{"$f":"Properties!AA25","v":"NA"},{"$f":"IF(Properties!J25=0,\"\",Properties!J25)","v":""},{"$f":"Properties!AB25","v":"NA"},{"$f":"Properties!AC25","v":"NA"},{"$f":"Properties!K25","v":0},{"$f":"Properties!AD25","v":"NA"},{"$f":"Properties!AE25","v":"NA"},{"$f":"IF(Properties!$L25=0,\"\",Properties!$L25)","v":""},{"$f":"IF(Properties!$L26=0,\"\",Properties!$L26)","v":""},{"$f":"IF(Properties!$L27=0,\"\",Properties!$L27)","v":""},{"$f":"IF(Properties!$L28=0,\"\",Properties!$L28)","v":""},{"$f":"IF(Properties!AF25=0,\"\",Properties!AF25)","v":"NA"},{"$f":"Properties!AG25","v":"NA"},{"$f":"Properties!AH25","v":"NA"},{"$f":"Properties!AI25","v":"NA"},{"$f":"IF(Properties!X25=0,\"\",Properties!X25)","v":""},{"$f":"IF(Properties!N25=0,\"\",Properties!N25)","v":""},{"$f":"Properties!AJ25","v":"NA"},{"$f":"Properties!AK25","v":"NA"},{"$f":"IF(Properties!O25=0,\"\",Properties!O25)","v":""},{"$f":"Properties!AL25","v":"NA"},{"$f":"Properties!AM25","v":"NA"},{"$f":"IF(Properties!P25=0,\"\",Properties!P25)","v":""},{"$f":"Properties!AN25","v":"NA"},{"$f":"Properties!AO25","v":"NA"},{"$f":"IF(Properties!$Q25=0,\"\",Properties!$Q25)","v":""},{"$f":"IF(Properties!$Q26=0,\"\",Properties!$Q26)","v":""},{"$f":"IF(Properties!$Q27=0,\"\",Properties!$Q27)","v":""},{"$f":"IF(Properties!$Q28=0,\"\",Properties!$Q28)","v":""},{"$f":"IF(Properties!AP25=0,\"\",Properties!AP25)","v":"NA"},{"$f":"Properties!AQ25","v":"NA"},{"$f":"Properties!AR25","v":"NA"},{"$f":"Properties!AS25","v":"NA"},{"$f":"IF(Properties!Y25=0,\"\",Properties!Y25)","v":""},{"$f":"IF(Properties!S25=0,\"\",Properties!S25)","v":""},{"$f":"Properties!AT25","v":"NA"},{"$f":"Properties!AU25","v":"NA"},{"$f":"IF(Properties!T25=0,\"\",Properties!T25)","v":""},{"$f":"Properties!AV25","v":"NA"},{"$f":"Properties!AW25","v":"NA"},{"$f":"IF(Properties!U25=0,\"\",Properties!U25)","v":""},{"$f":"Properties!AX25","v":"NA"},{"$f":"Properties!AY25","v":"NA"},{"$f":"IF(Properties!$V25=0,\"\",Properties!$V25)","v":""},{"$f":"IF(Properties!$V26=0,\"\",Properties!$V26)","v":""},{"$f":"IF(Properties!$V27=0,\"\",Properties!$V27)","v":""},{"$f":"IF(Properties!$V28=0,\"\",Properties!$V28)","v":""},{"$f":"IF(Properties!W25=0,\"\",Properties!W25)","v":""},{"$f":"Properties!BA25","v":"NA"},{"$f":"Properties!BB25","v":"NA"},{"$f":"Properties!BC25","v":"NA"}]
[null,{"$f":"IF(Menu!$C$5=0,\"\",Menu!$C$5)","v":""},{"$f":"IF(Menu!$C$6=0,\"\",Menu!$C$6)","v":""},{"$f":"IF(Menu!$C$7=0,\"\",Menu!$C$7)","v":""},{"$f":"IF(Menu!$C$8=0,\"\",Menu!$C$8)","v":""},{"$f":"IF(Menu!$C$9=0,\"\",Menu!$C$9)","v":""},{"$f":"IF(Menu!$C$10=0,\"\",Menu!$C$10)","v":""},{"$f":"IF(Menu!$F$7=0,\"\",Menu!$F$7)","v":"Std QA"},{"$f":"IF(Menu!$F$5=0,\"\",Menu!$F$5)","v":"2E03"},{"$f":"IF(Menu!$F$8=0,\"\",Menu!$F$8)","v":"Ignition"},{"$f":"IF(Properties!D29=0,\"\",Properties!D29)","v":""},{"$f":"IF(Properties!$G$5=0,\"\",Properties!$G$5)","v":"No"},{"$f":"IF(Properties!$C$9=0,\"\",Properties!$C$9)","v":""},{"$f":"IF(Properties!$G$3=0,\"\",Properties!$G$3)","v":""},{"$f":"IF(Properties!$G$4=0,\"\",Properties!$G$4)","v":"10-03"},{"$f":"IF(Properties!E29=0,\"\",Properties!E29)","v":5},{"$f":"IF(Properties!G29=0,\"\",Properties!G29)","v":""},{"$f":"IF(Menu!$G$17=0,\"\",Menu!$G$17)","v":92},{"$f":"IF(Properties!H29=0,\"\",Properties!H29)","v":""},{"$f":"IF(Properties!$R$4=0,\"\",Properties!$R$4)","v":3},{"$f":"IF(Properties!I29=0,\"\",Properties!I29)","v":""},{"$f":"Properties!Z29","v":"NA"},{"$f":"Properties!AA29","v":"NA"},{"$f":"IF(Properties!J29=0,\"\",Properties!J29)","v":""},{"$f":"Properties!AB29","v":"NA"},{"$f":"Properties!AC29","v":"NA"},{"$f":"Properties!K29","v":0},{"$f":"Properties!AD29","v":"NA"},{"$f":"Properties!AE29","v":"NA"},{"$f":"IF(Properties!$L29=0,\"\",Properties!$L29)","v":""},{"$f":"IF(Properties!$L30=0,\"\",Properties!$L30)","v":""},{"$f":"IF(Properties!$L31=0,\"\",Properties!$L31)","v":""},{"$f":"IF(Properties!$L32=0,\"\",Properties!$L32)","v":""},{"$f":"IF(Properties!AF29=0,\"\",Properties!AF29)","v":"NA"},{"$f":"Properties!AG29","v":"NA"},{"$f":"Properties!AH29","v":"NA"},{"$f":"Properties!AI29","v":"NA"},{"$f":"IF(Properties!X29=0,\"\",Properties!X29)","v":""},{"$f":"IF(Properties!N29=0,\"\",Properties!N29)","v":""},{"$f":"Properties!AJ29","v":"NA"},{"$f":"Properties!AK29","v":"NA"},{"$f":"IF(Properties!O29=0,\"\",Properties!O29)","v":""},{"$f":"Properties!AL29","v":"NA"},{"$f":"Properties!AM29","v":"NA"},{"$f":"IF(Properties!P29=0,\"\",Properties!P29)","v":""},{"$f":"Properties!AN29","v":"NA"},{"$f":"Properties!AO29","v":"NA"},{"$f":"IF(Properties!$Q29=0,\"\",Properties!$Q29)","v":""},{"$f":"IF(Properties!$Q30=0,\"\",Properties!$Q30)","v":""},{"$f":"IF(Properties!$Q31=0,\"\",Properties!$Q31)","v":""},{"$f":"IF(Properties!$Q32=0,\"\",Properties!$Q32)","v":""},{"$f":"IF(Properties!AP29=0,\"\",Properties!AP29)","v":"NA"},{"$f":"Properties!AQ29","v":"NA"},{"$f":"Properties!AR29","v":"NA"},{"$f":"Properties!AS29","v":"NA"},{"$f":"IF(Properties!Y29=0,\"\",Properties!Y29)","v":""},{"$f":"IF(Properties!S29=0,\"\",Properties!S29)","v":""},{"$f":"Properties!AT29","v":"NA"},{"$f":"Properties!AU29","v":"NA"},{"$f":"IF(Properties!T29=0,\"\",Properties!T29)","v":""},{"$f":"Properties!AV29","v":"NA"},{"$f":"Properties!AW29","v":"NA"},{"$f":"IF(Properties!U29=0,\"\",Properties!U29)","v":""},{"$f":"Properties!AX29","v":"NA"},{"$f":"Properties!AY29","v":"NA"},{"$f":"IF(Properties!$V29=0,\"\",Properties!$V29)","v":""},{"$f":"IF(Properties!$V30=0,\"\",Properties!$V30)","v":""},{"$f":"IF(Properties!$V31=0,\"\",Properties!$V31)","v":""},{"$f":"IF(Properties!$V32=0,\"\",Properties!$V32)","v":""},{"$f":"IF(Properties!W29=0,\"\",Properties!W29)","v":""},{"$f":"Properties!BA29","v":"NA"},{"$f":"Properties!BB29","v":"NA"},{"$f":"Properties!BC29","v":"NA"}]
[null,{"$f":"IF(Menu!$C$5=0,\"\",Menu!$C$5)","v":""},{"$f":"IF(Menu!$C$6=0,\"\",Menu!$C$6)","v":""},{"$f":"IF(Menu!$C$7=0,\"\",Menu!$C$7)","v":""},{"$f":"IF(Menu!$C$8=0,\"\",Menu!$C$8)","v":""},{"$f":"IF(Menu!$C$9=0,\"\",Menu!$C$9)","v":""},{"$f":"IF(Menu!$C$10=0,\"\",Menu!$C$10)","v":""},{"$f":"IF(Menu!$F$7=0,\"\",Menu!$F$7)","v":"Std QA"},{"$f":"IF(Menu!$F$5=0,\"\",Menu!$F$5)","v":"2E03"},{"$f":"IF(Menu!$F$8=0,\"\",Menu!$F$8)","v":"Ignition"},{"$f":"IF(Properties!D33=0,\"\",Properties!D33)","v":""},{"$f":"IF(Properties!$G$5=0,\"\",Properties!$G$5)","v":"No"},{"$f":"IF(Properties!$C$9=0,\"\",Properties!$C$9)","v":""},{"$f":"IF(Properties!$G$3=0,\"\",Properties!$G$3)","v":""},{"$f":"IF(Properties!$G$4=0,\"\",Properties!$G$4)","v":"10-03"},{"$f":"IF(Properties!E33=0,\"\",Properties!E33)","v":6},{"$f":"IF(Properties!G33=0,\"\",Properties!G33)","v":""},{"$f":"IF(Menu!$G$17=0,\"\",Menu!$G$17)","v":92},{"$f":"IF(Properties!H33=0,\"\",Properties!H33)","v":""},{"$f":"IF(Properties!$R$4=0,\"\",Properties!$R$4)","v":3},{"$f":"IF(Properties!I33=0,\"\",Properties!I33)","v":""},{"$f":"Properties!Z33","v":"NA"},{"$f":"Properties!AA33","v":"NA"},{"$f":"IF(Properties!J33=0,\"\",Properties!J33)","v":""},{"$f":"Properties!AB33","v":"NA"},{"$f":"Properties!AC33","v":"NA"},{"$f":"Properties!K33","v":0},{"$f":"Properties!AD33","v":"NA"},{"$f":"Properties!AE33","v":"NA"},{"$f":"IF(Properties!$L33=0,\"\",Properties!$L33)","v":""},{"$f":"IF(Properties!$L34=0,\"\",Properties!$L34)","v":""},{"$f":"IF(Properties!$L35=0,\"\",Properties!$L35)","v":""},{"$f":"IF(Properties!$L36=0,\"\",Properties!$L36)","v":""},{"$f":"IF(Properties!AF33=0,\"\",Properties!AF33)","v":"NA"},{"$f":"Properties!AG33","v":"NA"},{"$f":"Properties!AH33","v":"NA"},{"$f":"Properties!AI33","v":"NA"},{"$f":"IF(Properties!X33=0,\"\",Properties!X33)","v":""},{"$f":"IF(Properties!N33=0,\"\",Properties!N33)","v":""},{"$f":"Properties!AJ33","v":"NA"},{"$f":"Properties!AK33","v":"NA"},{"$f":"IF(Properties!O33=0,\"\",Properties!O33)","v":""},{"$f":"Properties!AL33","v":"NA"},{"$f":"Properties!AM33","v":"NA"},{"$f":"IF(Properties!P33=0,\"\",Properties!P33)","v":""},{"$f":"Properties!AN33","v":"NA"},{"$f":"Properties!AO33","v":"NA"},{"$f":"IF(Properties!$Q33=0,\"\",Properties!$Q33)","v":""},{"$f":"IF(Properties!$Q34=0,\"\",Properties!$Q34)","v":""},{"$f":"IF(Properties!$Q35=0,\"\",Properties!$Q35)","v":""},{"$f":"IF(Properties!$Q36=0,\"\",Properties!$Q36)","v":""},{"$f":"IF(Properties!AP33=0,\"\",Properties!AP33)","v":"NA"},{"$f":"Properties!AQ33","v":"NA"},{"$f":"Properties!AR33","v":"NA"},{"$f":"Properties!AS33","v":"NA"},{"$f":"IF(Properties!Y33=0,\"\",Properties!Y33)","v":""},{"$f":"IF(Properties!S33=0,\"\",Properties!S33)","v":""},{"$f":"Properties!AT33","v":"NA"},{"$f":"Properties!AU33","v":"NA"},{"$f":"IF(Properties!T33=0,\"\",Properties!T33)","v":""},{"$f":"Properties!AV33","v":"NA"},{"$f":"Properties!AW33","v":"NA"},{"$f":"IF(Properties!U33=0,\"\",Properties!U33)","v":""},{"$f":"Properties!AX33","v":"NA"},{"$f":"Properties!AY33","v":"NA"},{"$f":"IF(Properties!$V33=0,\"\",Properties!$V33)","v":""},{"$f":"IF(Properties!$V34=0,\"\",Properties!$V34)","v":""},{"$f":"IF(Properties!$V35=0,\"\",Properties!$V35)","v":""},{"$f":"IF(Properties!$V36=0,\"\",Properties!$V36)","v":""},{"$f":"IF(Properties!W33=0,\"\",Properties!W33)","v":""},{"$f":"Properties!BA33","v":"NA"},{"$f":"Properties!BB33","v":"NA"},{"$f":"Properties!BC33","v":"NA"}]
[null,{"$f":"IF(Menu!$C$5=0,\"\",Menu!$C$5)","v":""},{"$f":"IF(Menu!$C$6=0,\"\",Menu!$C$6)","v":""},{"$f":"IF(Menu!$C$7=0,\"\",Menu!$C$7)","v":""},{"$f":"IF(Menu!$C$8=0,\"\",Menu!$C$8)","v":""},{"$f":"IF(Menu!$C$9=0,\"\",Menu!$C$9)","v":""},{"$f":"IF(Menu!$C$10=0,\"\",Menu!$C$10)","v":""},{"$f":"IF(Menu!$F$7=0,\"\",Menu!$F$7)","v":"Std QA"},{"$f":"IF(Menu!$F$5=0,\"\",Menu!$F$5)","v":"2E03"},{"$f":"IF(Menu!$F$8=0,\"\",Menu!$F$8)","v":"Ignition"},{"$f":"IF(Properties!D37=0,\"\",Properties!D37)","v":""},{"$f":"IF(Properties!$G$5=0,\"\",Properties!$G$5)","v":"No"},{"$f":"IF(Properties!$C$9=0,\"\",Properties!$C$9)","v":""},{"$f":"IF(Properties!$G$3=0,\"\",Properties!$G$3)","v":""},{"$f":"IF(Properties!$G$4=0,\"\",Properties!$G$4)","v":"10-03"},{"$f":"IF(Properties!E37=0,\"\",Properties!E37)","v":7},{"$f":"IF(Properties!G37=0,\"\",Properties!G37)","v":""},{"$f":"IF(Menu!$G$17=0,\"\",Menu!$G$17)","v":92},{"$f":"IF(Properties!H37=0,\"\",Properties!H37)","v":""},{"$f":"IF(Properties!$R$4=0,\"\",Properties!$R$4)","v":3},{"$f":"IF(Properties!I37=0,\"\",Properties!I37)","v":""},{"$f":"Properties!Z37","v":"NA"},{"$f":"Properties!AA37","v":"NA"},{"$f":"IF(Properties!J37=0,\"\",Properties!J37)","v":""},{"$f":"Properties!AB37","v":"NA"},{"$f":"Properties!AC37","v":"NA"},{"$f":"Properties!K37","v":0},{"$f":"Properties!AD37","v":"NA"},{"$f":"Properties!AE37","v":"NA"},{"$f":"IF(Properties!$L37=0,\"\",Properties!$L37)","v":""},{"$f":"IF(Properties!$L38=0,\"\",Properties!$L38)","v":""},{"$f":"IF(Properties!$L39=0,\"\",Properties!$L39)","v":""},{"$f":"IF(Properties!$L40=0,\"\",Properties!$L40)","v":""},{"$f":"IF(Properties!AF37=0,\"\",Properties!AF37)","v":"NA"},{"$f":"Properties!AG37","v":"NA"},{"$f":"Properties!AH37","v":"NA"},{"$f":"Properties!AI37","v":"NA"},{"$f":"IF(Properties!X37=0,\"\",Properties!X37)","v":""},{"$f":"IF(Properties!N37=0,\"\",Properties!N37)","v":""},{"$f":"Properties!AJ37","v":"NA"},{"$f":"Properties!AK37","v":"NA"},{"$f":"IF(Properties!O37=0,\"\",Properties!O37)","v":""},{"$f":"Properties!AL37","v":"NA"},{"$f":"Properties!AM37","v":"NA"},{"$f":"IF(Properties!P37=0,\"\",Properties!P37)","v":""},{"$f":"Properties!AN37","v":"NA"},{"$f":"Properties!AO37","v":"NA"},{"$f":"IF(Properties!$Q37=0,\"\",Properties!$Q37)","v":""},{"$f":"IF(Properties!$Q38=0,\"\",Properties!$Q38)","v":""},{"$f":"IF(Properties!$Q39=0,\"\",Properties!$Q39)","v":""},{"$f":"IF(Properties!$Q40=0,\"\",Properties!$Q40)","v":""},{"$f":"IF(Properties!AP37=0,\"\",Properties!AP37)","v":"NA"},{"$f":"Properties!AQ37","v":"NA"},{"$f":"Properties!AR37","v":"NA"},{"$f":"Properties!AS37","v":"NA"},{"$f":"IF(Properties!Y37=0,\"\",Properties!Y37)","v":""},{"$f":"IF(Properties!S37=0,\"\",Properties!S37)","v":""},{"$f":"Properties!AT37","v":"NA"},{"$f":"Properties!AU37","v":"NA"},{"$f":"IF(Properties!T37=0,\"\",Properties!T37)","v":""},{"$f":"Properties!AV37","v":"NA"},{"$f":"Properties!AW37","v":"NA"},{"$f":"IF(Properties!U37=0,\"\",Properties!U37)","v":""},{"$f":"Properties!AX37","v":"NA"},{"$f":"Properties!AY37","v":"NA"},{"$f":"IF(Properties!$V37=0,\"\",Properties!$V37)","v":""},{"$f":"IF(Properties!$V38=0,\"\",Properties!$V38)","v":""},{"$f":"IF(Properties!$V39=0,\"\",Properties!$V39)","v":""},{"$f":"IF(Properties!$V40=0,\"\",Properties!$V40)","v":""},{"$f":"IF(Properties!W37=0,\"\",Properties!W37)","v":""},{"$f":"Properties!BA37","v":"NA"},{"$f":"Properties!BB37","v":"NA"},{"$f":"Properties!BC37","v":"NA"}]
[null,{"$f":"IF(Menu!$C$5=0,\"\",Menu!$C$5)","v":""},{"$f":"IF(Menu!$C$6=0,\"\",Menu!$C$6)","v":""},{"$f":"IF(Menu!$C$7=0,\"\",Menu!$C$7)","v":""},{"$f":"IF(Menu!$C$8=0,\"\",Menu!$C$8)","v":""},{"$f":"IF(Menu!$C$9=0,\"\",Menu!$C$9)","v":""},{"$f":"IF(Menu!$C$10=0,\"\",Menu!$C$10)","v":""},{"$f":"IF(Menu!$F$7=0,\"\",Menu!$F$7)","v":"Std QA"},{"$f":"IF(Menu!$F$5=0,\"\",Menu!$F$5)","v":"2E03"},{"$f":"IF(Menu!$F$8=0,\"\",Menu!$F$8)","v":"Ignition"},{"$f":"IF(Properties!D41=0,\"\",Properties!D41)","v":""},{"$f":"IF(Properties!$G$5=0,\"\",Properties!$G$5)","v":"No"},{"$f":"IF(Properties!$C$9=0,\"\",Properties!$C$9)","v":""},{"$f":"IF(Properties!$G$3=0,\"\",Properties!$G$3)","v":""},{"$f":"IF(Properties!$G$4=0,\"\",Properties!$G$4)","v":"10-03"},{"$f":"IF(Properties!E41=0,\"\",Properties!E41)","v":8},{"$f":"IF(Properties!G41=0,\"\",Properties!G41)","v":""},{"$f":"IF(Menu!$G$17=0,\"\",Menu!$G$17)","v":92},{"$f":"IF(Properties!H41=0,\"\",Properties!H41)","v":""},{"$f":"IF(Properties!$R$4=0,\"\",Properties!$R$4)","v":3},{"$f":"IF(Properties!I41=0,\"\",Properties!I41)","v":""},{"$f":"Properties!Z41","v":"NA"},{"$f":"Properties!AA41","v":"NA"},{"$f":"IF(Properties!J41=0,\"\",Properties!J41)","v":""},{"$f":"Properties!AB41","v":"NA"},{"$f":"Properties!AC41","v":"NA"},{"$f":"Properties!K41","v":0},{"$f":"Properties!AD41","v":"NA"},{"$f":"Properties!AE41","v":"NA"},{"$f":"IF(Properties!$L41=0,\"\",Properties!$L41)","v":""},{"$f":"IF(Properties!$L42=0,\"\",Properties!$L42)","v":""},{"$f":"IF(Properties!$L43=0,\"\",Properties!$L43)","v":""},{"$f":"IF(Properties!$L44=0,\"\",Properties!$L44)","v":""},{"$f":"IF(Properties!AF41=0,\"\",Properties!AF41)","v":"NA"},{"$f":"Properties!AG41","v":"NA"},{"$f":"Properties!AH41","v":"NA"},{"$f":"Properties!AI41","v":"NA"},{"$f":"IF(Properties!X41=0,\"\",Properties!X41)","v":""},{"$f":"IF(Properties!N41=0,\"\",Properties!N41)","v":""},{"$f":"Properties!AJ41","v":"NA"},{"$f":"Properties!AK41","v":"NA"},{"$f":"IF(Properties!O41=0,\"\",Properties!O41)","v":""},{"$f":"Properties!AL41","v":"NA"},{"$f":"Properties!AM41","v":"NA"},{"$f":"IF(Properties!P41=0,\"\",Properties!P41)","v":""},{"$f":"Properties!AN41","v":"NA"},{"$f":"Properties!AO41","v":"NA"},{"$f":"IF(Properties!$Q41=0,\"\",Properties!$Q41)","v":""},{"$f":"IF(Properties!$Q42=0,\"\",Properties!$Q42)","v":""},{"$f":"IF(Properties!$Q43=0,\"\",Properties!$Q43)","v":""},{"$f":"IF(Properties!$Q44=0,\"\",Properties!$Q44)","v":""},{"$f":"IF(Properties!AP41=0,\"\",Properties!AP41)","v":"NA"},{"$f":"Properties!AQ41","v":"NA"},{"$f":"Properties!AR41","v":"NA"},{"$f":"Properties!AS41","v":"NA"},{"$f":"IF(Properties!Y41=0,\"\",Properties!Y41)","v":""},{"$f":"IF(Properties!S41=0,\"\",Properties!S41)","v":""},{"$f":"Properties!AT41","v":"NA"},{"$f":"Properties!AU41","v":"NA"},{"$f":"IF(Properties!T41=0,\"\",Properties!T41)","v":""},{"$f":"Properties!AV41","v":"NA"},{"$f":"Properties!AW41","v":"NA"},{"$f":"IF(Properties!U41=0,\"\",Properties!U41)","v":""},{"$f":"Properties!AX41","v":"NA"},{"$f":"Properties!AY41","v":"NA"},{"$f":"IF(Properties!$V41=0,\"\",Properties!$V41)","v":""},{"$f":"IF(Properties!$V42=0,\"\",Properties!$V42)","v":""},{"$f":"IF(Properties!$V43=0,\"\",Properties!$V43)","v":""},{"$f":"IF(Properties!$V44=0,\"\",Properties!$V44)","v":""},{"$f":"IF(Properties!W41=0,\"\",Properties!W41)","v":""},{"$f":"Properties!BA41","v":"NA"},{"$f":"Properties!BB41","v":"NA"},{"$f":"Properties!BC41","v":"NA"}]
[null,{"$f":"IF(Menu!$C$5=0,\"\",Menu!$C$5)","v":""},{"$f":"IF(Menu!$C$6=0,\"\",Menu!$C$6)","v":""},{"$f":"IF(Menu!$C$7=0,\"\",Menu!$C$7)","v":""},{"$f":"IF(Menu!$C$8=0,\"\",Menu!$C$8)","v":""},{"$f":"IF(Menu!$C$9=0,\"\",Menu!$C$9)","v":""},{"$f":"IF(Menu!$C$10=0,\"\",Menu!$C$10)","v":""},{"$f":"IF(Menu!$F$7=0,\"\",Menu!$F$7)","v":"Std QA"},{"$f":"IF(Menu!$F$5=0,\"\",Menu!$F$5)","v":"2E03"},{"$f":"IF(Menu!$F$8=0,\"\",Menu!$F$8)","v":"Ignition"},{"$f":"IF(Properties!D45=0,\"\",Properties!D45)","v":""},{"$f":"IF(Properties!$G$5=0,\"\",Properties!$G$5)","v":"No"},{"$f":"IF(Properties!$C$9=0,\"\",Properties!$C$9)","v":""},{"$f":"IF(Properties!$G$3=0,\"\",Properties!$G$3)","v":""},{"$f":"IF(Properties!$G$4=0,\"\",Properties!$G$4)","v":"10-03"},{"$f":"IF(Properties!E45=0,\"\",Properties!E45)","v":9},{"$f":"IF(Properties!G45=0,\"\",Properties!G45)","v":""},{"$f":"IF(Menu!$G$17=0,\"\",Menu!$G$17)","v":92},{"$f":"IF(Properties!H45=0,\"\",Properties!H45)","v":""},{"$f":"IF(Properties!$R$4=0,\"\",Properties!$R$4)","v":3},{"$f":"IF(Properties!I45=0,\"\",Properties!I45)","v":""},{"$f":"Properties!Z45","v":"NA"},{"$f":"Properties!AA45","v":"NA"},{"$f":"IF(Properties!J45=0,\"\",Properties!J45)","v":""},{"$f":"Properties!AB45","v":"NA"},{"$f":"Properties!AC45","v":"NA"},{"$f":"Properties!K45","v":0},{"$f":"Properties!AD45","v":"NA"},{"$f":"Properties!AE45","v":"NA"},{"$f":"IF(Properties!$L45=0,\"\",Properties!$L45)","v":""},{"$f":"IF(Properties!$L46=0,\"\",Properties!$L46)","v":""},{"$f":"IF(Properties!$L47=0,\"\",Properties!$L47)","v":""},{"$f":"IF(Properties!$L48=0,\"\",Properties!$L48)","v":""},{"$f":"IF(Properties!AF45=0,\"\",Properties!AF45)","v":"NA"},{"$f":"Properties!AG45","v":"NA"},{"$f":"Properties!AH45","v":"NA"},{"$f":"Properties!AI45","v":"NA"},{"$f":"IF(Properties!X45=0,\"\",Properties!X45)","v":""},{"$f":"IF(Properties!N45=0,\"\",Properties!N45)","v":""},{"$f":"Properties!AJ45","v":"NA"},{"$f":"Properties!AK45","v":"NA"},{"$f":"IF(Properties!O45=0,\"\",Properties!O45)","v":""},{"$f":"Properties!AL45","v":"NA"},{"$f":"Properties!AM45","v":"NA"},{"$f":"IF(Properties!P45=0,\"\",Properties!P45)","v":""},{"$f":"Properties!AN45","v":"NA"},{"$f":"Properties!AO45","v":"NA"},{"$f":"IF(Properties!$Q45=0,\"\",Properties!$Q45)","v":""},{"$f":"IF(Properties!$Q46=0,\"\",Properties!$Q46)","v":""},{"$f":"IF(Properties!$Q47=0,\"\",Properties!$Q47)","v":""},{"$f":"IF(Properties!$Q48=0,\"\",Properties!$Q48)","v":""},{"$f":"IF(Properties!AP45=0,\"\",Properties!AP45)","v":"NA"},{"$f":"Properties!AQ45","v":"NA"},{"$f":"Properties!AR45","v":"NA"},{"$f":"Properties!AS45","v":"NA"},{"$f":"IF(Properties!Y45=0,\"\",Properties!Y45)","v":""},{"$f":"IF(Properties!S45=0,\"\",Properties!S45)","v":""},{"$f":"Properties!AT45","v":"NA"},{"$f":"Properties!AU45","v":"NA"},{"$f":"IF(Properties!T45=0,\"\",Properties!T45)","v":""},{"$f":"Properties!AV45","v":"NA"},{"$f":"Properties!AW45","v":"NA"},{"$f":"IF(Properties!U45=0,\"\",Properties!U45)","v":""},{"$f":"Properties!AX45","v":"NA"},{"$f":"Properties!AY45","v":"NA"},{"$f":"IF(Properties!$V45=0,\"\",Properties!$V45)","v":""},{"$f":"IF(Properties!$V46=0,\"\",Properties!$V46)","v":""},{"$f":"IF(Properties!$V47=0,\"\",Properties!$V47)","v":""},{"$f":"IF(Properties!$V48=0,\"\",Properties!$V48)","v":""},{"$f":"IF(Properties!W45=0,\"\",Properties!W45)","v":""},{"$f":"Properties!BA45","v":"NA"},{"$f":"Properties!BB45","v":"NA"},{"$f":"Properties!BC45","v":"NA"}]
[null,{"$f":"IF(Menu!$C$5=0,\"\",Menu!$C$5)","v":""},{"$f":"IF(Menu!$C$6=0,\"\",Menu!$C$6)","v":""},{"$f":"IF(Menu!$C$7=0,\"\",Menu!$C$7)","v":""},{"$f":"IF(Menu!$C$8=0,\"\",Menu!$C$8)","v":""},{"$f":"IF(Menu!$C$9=0,\"\",Menu!$C$9)","v":""},{"$f":"IF(Menu!$C$10=0,\"\",Menu!$C$10)","v":""},{"$f":"IF(Menu!$F$7=0,\"\",Menu!$F$7)","v":"Std QA"},{"$f":"IF(Menu!$F$5=0,\"\",Menu!$F$5)","v":"2E03"},{"$f":"IF(Menu!$F$8=0,\"\",Menu!$F$8)","v":"Ignition"},{"$f":"IF(Properties!D49=0,\"\",Properties!D49)","v":""},{"$f":"IF(Properties!$G$5=0,\"\",Properties!$G$5)","v":"No"},{"$f":"IF(Properties!$C$9=0,\"\",Properties!$C$9)","v":""},{"$f":"IF(Properties!$G$3=0,\"\",Properties!$G$3)","v":""},{"$f":"IF(Properties!$G$4=0,\"\",Properties!$G$4)","v":"10-03"},{"$f":"IF(Properties!E49=0,\"\",Properties!E49)","v":10},{"$f":"IF(Properties!G49=0,\"\",Properties!G49)","v":""},{"$f":"IF(Menu!$G$17=0,\"\",Menu!$G$17)","v":92},{"$f":"IF(Properties!H49=0,\"\",Properties!H49)","v":""},{"$f":"IF(Properties!$R$4=0,\"\",Properties!$R$4)","v":3},{"$f":"IF(Properties!I49=0,\"\",Properties!I49)","v":""},{"$f":"Properties!Z49","v":"NA"},{"$f":"Properties!AA49","v":"NA"},{"$f":"IF(Properties!J49=0,\"\",Properties!J49)","v":""},{"$f":"Properties!AB49","v":"NA"},{"$f":"Properties!AC49","v":"NA"},{"$f":"Properties!K49","v":0},{"$f":"Properties!AD49","v":"NA"},{"$f":"Properties!AE49","v":"NA"},{"$f":"IF(Properties!$L49=0,\"\",Properties!$L49)","v":""},{"$f":"IF(Properties!$L50=0,\"\",Properties!$L50)","v":""},{"$f":"IF(Properties!$L51=0,\"\",Properties!$L51)","v":""},{"$f":"IF(Properties!$L52=0,\"\",Properties!$L52)","v":""},{"$f":"IF(Properties!AF49=0,\"\",Properties!AF49)","v":"NA"},{"$f":"Properties!AG49","v":"NA"},{"$f":"Properties!AH49","v":"NA"},{"$f":"Properties!AI49","v":"NA"},{"$f":"IF(Properties!X49=0,\"\",Properties!X49)","v":""},{"$f":"IF(Properties!N49=0,\"\",Properties!N49)","v":""},{"$f":"Properties!AJ49","v":"NA"},{"$f":"Properties!AK49","v":"NA"},{"$f":"IF(Properties!O49=0,\"\",Properties!O49)","v":""},{"$f":"Properties!AL49","v":"NA"},{"$f":"Properties!AM49","v":"NA"},{"$f":"IF(Properties!P49=0,\"\",Properties!P49)","v":""},{"$f":"Properties!AN49","v":"NA"},{"$f":"Properties!AO49","v":"NA"},{"$f":"IF(Properties!$Q49=0,\"\",Properties!$Q49)","v":""},{"$f":"IF(Properties!$Q50=0,\"\",Properties!$Q50)","v":""},{"$f":"IF(Properties!$Q51=0,\"\",Properties!$Q51)","v":""},{"$f":"IF(Properties!$Q52=0,\"\",Properties!$Q52)","v":""},{"$f":"IF(Properties!AP49=0,\"\",Properties!AP49)","v":"NA"},{"$f":"Properties!AQ49","v":"NA"},{"$f":"Properties!AR49","v":"NA"},{"$f":"Properties!AS49","v":"NA"},{"$f":"IF(Properties!Y49=0,\"\",Properties!Y49)","v":""},{"$f":"IF(Properties!S49=0,\"\",Properties!S49)","v":""},{"$f":"Properties!AT49","v":"NA"},{"$f":"Properties!AU49","v":"NA"},{"$f":"IF(Properties!T49=0,\"\",Properties!T49)","v":""},{"$f":"Properties!AV49","v":"NA"},{"$f":"Properties!AW49","v":"NA"},{"$f":"IF(Properties!U49=0,\"\",Properties!U49)","v":""},{"$f":"Properties!AX49","v":"NA"},{"$f":"Properties!AY49","v":"NA"},{"$f":"IF(Properties!$V49=0,\"\",Properties!$V49)","v":""},{"$f":"IF(Properties!$V50=0,\"\",Properties!$V50)","v":""},{"$f":"IF(Properties!$V51=0,\"\",Properties!$V51)","v":""},{"$f":"IF(Properties!$V52=0,\"\",Properties!$V52)","v":""},{"$f":"IF(Properties!W49=0,\"\",Properties!W49)","v":""},{"$f":"Properties!BA49","v":"NA"},{"$f":"Properties!BB49","v":"NA"},{"$f":"Properties!BC49","v":"NA"}]
[null,{"$f":"IF(Menu!$C$5=0,\"\",Menu!$C$5)","v":""},{"$f":"IF(Menu!$C$6=0,\"\",Menu!$C$6)","v":""},{"$f":"IF(Menu!$C$7=0,\"\",Menu!$C$7)","v":""},{"$f":"IF(Menu!$C$8=0,\"\",Menu!$C$8)","v":""},{"$f":"IF(Menu!$C$9=0,\"\",Menu!$C$9)","v":""},{"$f":"IF(Menu!$C$10=0,\"\",Menu!$C$10)","v":""},{"$f":"IF(Menu!$F$7=0,\"\",Menu!$F$7)","v":"Std QA"},{"$f":"IF(Menu!$F$5=0,\"\",Menu!$F$5)","v":"2E03"},{"$f":"IF(Menu!$F$8=0,\"\",Menu!$F$8)","v":"Ignition"},{"$f":"IF(Properties!D53=0,\"\",Properties!D53)","v":""},{"$f":"IF(Properties!$G$5=0,\"\",Properties!$G$5)","v":"No"},{"$f":"IF(Properties!$C$9=0,\"\",Properties!$C$9)","v":""},{"$f":"IF(Properties!$G$3=0,\"\",Properties!$G$3)","v":""},{"$f":"IF(Properties!$G$4=0,\"\",Properties!$G$4)","v":"10-03"},{"$f":"IF(Properties!E53=0,\"\",Properties!E53)","v":11},{"$f":"IF(Properties!G53=0,\"\",Properties!G53)","v":""},{"$f":"IF(Menu!$G$17=0,\"\",Menu!$G$17)","v":92},{"$f":"IF(Properties!H53=0,\"\",Properties!H53)","v":""},{"$f":"IF(Properties!$R$4=0,\"\",Properties!$R$4)","v":3},{"$f":"IF(Properties!I53=0,\"\",Properties!I53)","v":""},{"$f":"Properties!Z53","v":"NA"},{"$f":"Properties!AA53","v":"NA"},{"$f":"IF(Properties!J53=0,\"\",Properties!J53)","v":""},{"$f":"Properties!AB53","v":"NA"},{"$f":"Properties!AC53","v":"NA"},{"$f":"Properties!K53","v":0},{"$f":"Properties!AD53","v":"NA"},{"$f":"Properties!AE53","v":"NA"},{"$f":"IF(Properties!$L53=0,\"\",Properties!$L53)","v":""},{"$f":"IF(Properties!$L54=0,\"\",Properties!$L54)","v":""},{"$f":"IF(Properties!$L55=0,\"\",Properties!$L55)","v":""},{"$f":"IF(Properties!$L56=0,\"\",Properties!$L56)","v":""},{"$f":"IF(Properties!AF53=0,\"\",Properties!AF53)","v":"NA"},{"$f":"Properties!AG53","v":"NA"},{"$f":"Properties!AH53","v":"NA"},{"$f":"Properties!AI53","v":"NA"},{"$f":"IF(Properties!X53=0,\"\",Properties!X53)","v":""},{"$f":"IF(Properties!N53=0,\"\",Properties!N53)","v":""},{"$f":"Properties!AJ53","v":"NA"},{"$f":"Properties!AK53","v":"NA"},{"$f":"IF(Properties!O53=0,\"\",Properties!O53)","v":""},{"$f":"Properties!AL53","v":"NA"},{"$f":"Properties!AM53","v":"NA"},{"$f":"IF(Properties!P53=0,\"\",Properties!P53)","v":""},{"$f":"Properties!AN53","v":"NA"},{"$f":"Properties!AO53","v":"NA"},{"$f":"IF(Properties!$Q53=0,\"\",Properties!$Q53)","v":""},{"$f":"IF(Properties!$Q54=0,\"\",Properties!$Q54)","v":""},{"$f":"IF(Properties!$Q55=0,\"\",Properties!$Q55)","v":""},{"$f":"IF(Properties!$Q56=0,\"\",Properties!$Q56)","v":""},{"$f":"IF(Properties!AP53=0,\"\",Properties!AP53)","v":"NA"},{"$f":"Properties!AQ53","v":"NA"},{"$f":"Properties!AR53","v":"NA"},{"$f":"Properties!AS53","v":"NA"},{"$f":"IF(Properties!Y53=0,\"\",Properties!Y53)","v":""},{"$f":"IF(Properties!S53=0,\"\",Properties!S53)","v":""},{"$f":"Properties!AT53","v":"NA"},{"$f":"Properties!AU53","v":"NA"},{"$f":"IF(Properties!T53=0,\"\",Properties!T53)","v":""},{"$f":"Properties!AV53","v":"NA"},{"$f":"Properties!AW53","v":"NA"},{"$f":"IF(Properties!U53=0,\"\",Properties!U53)","v":""},{"$f":"Properties!AX53","v":"NA"},{"$f":"Properties!AY53","v":"NA"},{"$f":"IF(Properties!$V53=0,\"\",Properties!$V53)","v":""},{"$f":"IF(Properties!$V54=0,\"\",Properties!$V54)","v":""},{"$f":"IF(Properties!$V55=0,\"\",Properties!$V55)","v":""},{"$f":"IF(Properties!$V56=0,\"\",Properties!$V56)","v":""},{"$f":"IF(Properties!W53=0,\"\",Properties!W53)","v":""},{"$f":"Properties!BA53","v":"NA"},{"$f":"Properties!BB53","v":"NA"},{"$f":"Properties!BC53","v":"NA"}]
[null,{"$f":"IF(Menu!$C$5=0,\"\",Menu!$C$5)","v":""},{"$f":"IF(Menu!$C$6=0,\"\",Menu!$C$6)","v":""},{"$f":"IF(Menu!$C$7=0,\"\",Menu!$C$7)","v":""},{"$f":"IF(Menu!$C$8=0,\"\",Menu!$C$8)","v":""},{"$f":"IF(Menu!$C$9=0,\"\",Menu!$C$9)","v":""},{"$f":"IF(Menu!$C$10=0,\"\",Menu!$C$10)","v":""},{"$f":"IF(Menu!$F$7=0,\"\",Menu!$F$7)","v":"Std QA"},{"$f":"IF(Menu!$F$5=0,\"\",Menu!$F$5)","v":"2E03"},{"$f":"IF(Menu!$F$8=0,\"\",Menu!$F$8)","v":"Ignition"},{"$f":"IF(Properties!D57=0,\"\",Properties!D57)","v":""},{"$f":"IF(Properties!$G$5=0,\"\",Properties!$G$5)","v":"No"},{"$f":"IF(Properties!$C$9=0,\"\",Properties!$C$9)","v":""},{"$f":"IF(Properties!$G$3=0,\"\",Properties!$G$3)","v":""},{"$f":"IF(Properties!$G$4=0,\"\",Properties!$G$4)","v":"10-03"},{"$f":"IF(Properties!E57=0,\"\",Properties!E57)","v":12},{"$f":"IF(Properties!G57=0,\"\",Properties!G57)","v":""},{"$f":"IF(Menu!$G$17=0,\"\",Menu!$G$17)","v":92},{"$f":"IF(Properties!H57=0,\"\",Properties!H57)","v":""},{"$f":"IF(Properties!$R$4=0,\"\",Properties!$R$4)","v":3},{"$f":"IF(Properties!I57=0,\"\",Properties!I57)","v":""},{"$f":"Properties!Z57","v":"NA"},{"$f":"Properties!AA57","v":"NA"},{"$f":"IF(Properties!J57=0,\"\",Properties!J57)","v":""},{"$f":"Properties!AB57","v":"NA"},{"$f":"Properties!AC57","v":"NA"},{"$f":"Properties!K57","v":0},{"$f":"Properties!AD57","v":"NA"},{"$f":"Properties!AE57","v":"NA"},{"$f":"IF(Properties!$L57=0,\"\",Properties!$L57)","v":""},{"$f":"IF(Properties!$L58=0,\"\",Properties!$L58)","v":""},{"$f":"IF(Properties!$L59=0,\"\",Properties!$L59)","v":""},{"$f":"IF(Properties!$L60=0,\"\",Properties!$L60)","v":""},{"$f":"IF(Properties!AF57=0,\"\",Properties!AF57)","v":"NA"},{"$f":"Properties!AG57","v":"NA"},{"$f":"Properties!AH57","v":"NA"},{"$f":"Properties!AI57","v":"NA"},{"$f":"IF(Properties!X57=0,\"\",Properties!X57)","v":""},{"$f":"IF(Properties!N57=0,\"\",Properties!N57)","v":""},{"$f":"Properties!AJ57","v":"NA"},{"$f":"Properties!AK57","v":"NA"},{"$f":"IF(Properties!O57=0,\"\",Properties!O57)","v":""},{"$f":"Properties!AL57","v":"NA"},{"$f":"Properties!AM57","v":"NA"},{"$f":"IF(Properties!P57=0,\"\",Properties!P57)","v":""},{"$f":"Properties!AN57","v":"NA"},{"$f":"Properties!AO57","v":"NA"},{"$f":"IF(Properties!$Q57=0,\"\",Properties!$Q57)","v":""},{"$f":"IF(Properties!$Q58=0,\"\",Properties!$Q58)","v":""},{"$f":"IF(Properties!$Q59=0,\"\",Properties!$Q59)","v":""},{"$f":"IF(Properties!$Q60=0,\"\",Properties!$Q60)","v":""},{"$f":"IF(Properties!AP57=0,\"\",Properties!AP57)","v":"NA"},{"$f":"Properties!AQ57","v":"NA"},{"$f":"Properties!AR57","v":"NA"},{"$f":"Properties!AS57","v":"NA"},{"$f":"IF(Properties!Y57=0,\"\",Properties!Y57)","v":""},{"$f":"IF(Properties!S57=0,\"\",Properties!S57)","v":""},{"$f":"Properties!AT57","v":"NA"},{"$f":"Properties!AU57","v":"NA"},{"$f":"IF(Properties!T57=0,\"\",Properties!T57)","v":""},{"$f":"Properties!AV57","v":"NA"},{"$f":"Properties!AW57","v":"NA"},{"$f":"IF(Properties!U57=0,\"\",Properties!U57)","v":""},{"$f":"Properties!AX57","v":"NA"},{"$f":"Properties!AY57","v":"NA"},{"$f":"IF(Properties!$V57=0,\"\",Properties!$V57)","v":""},{"$f":"IF(Properties!$V58=0,\"\",Properties!$V58)","v":""},{"$f":"IF(Properties!$V59=0,\"\",Properties!$V59)","v":""},{"$f":"IF(Properties!$V60=0,\"\",Properties!$V60)","v":""},{"$f":"IF(Properties!W57=0,\"\",Properties!W57)","v":""},{"$f":"Properties!BA57","v":"NA"},{"$f":"Properties!BB57","v":"NA"},{"$f":"Properties!BC57","v":"NA"}]
[null,{"$f":"IF(Menu!$C$5=0,\"\",Menu!$C$5)","v":""},{"$f":"IF(Menu!$C$6=0,\"\",Menu!$C$6)","v":""},{"$f":"IF(Menu!$C$7=0,\"\",Menu!$C$7)","v":""},{"$f":"IF(Menu!$C$8=0,\"\",Menu!$C$8)","v":""},{"$f":"IF(Menu!$C$9=0,\"\",Menu!$C$9)","v":""},{"$f":"IF(Menu!$C$10=0,\"\",Menu!$C$10)","v":""},{"$f":"IF(Menu!$F$7=0,\"\",Menu!$F$7)","v":"Std QA"},{"$f":"IF(Menu!$F$5=0,\"\",Menu!$F$5)","v":"2E03"},{"$f":"IF(Menu!$F$8=0,\"\",Menu!$F$8)","v":"Ignition"},{"$f":"IF(Properties!D61=0,\"\",Properties!D61)","v":""},{"$f":"IF(Properties!$G$5=0,\"\",Properties!$G$5)","v":"No"},{"$f":"IF(Properties!$C$9=0,\"\",Properties!$C$9)","v":""},{"$f":"IF(Properties!$G$3=0,\"\",Properties!$G$3)","v":""},{"$f":"IF(Properties!$G$4=0,\"\",Properties!$G$4)","v":"10-03"},{"$f":"IF(Properties!E61=0,\"\",Properties!E61)","v":13},{"$f":"IF(Properties!G61=0,\"\",Properties!G61)","v":""},{"$f":"IF(Menu!$G$17=0,\"\",Menu!$G$17)","v":92},{"$f":"IF(Properties!H61=0,\"\",Properties!H61)","v":""},{"$f":"IF(Properties!$R$4=0,\"\",Properties!$R$4)","v":3},{"$f":"IF(Properties!I61=0,\"\",Properties!I61)","v":""},{"$f":"Properties!Z61","v":"NA"},{"$f":"Properties!AA61","v":"NA"},{"$f":"IF(Properties!J61=0,\"\",Properties!J61)","v":""},{"$f":"Properties!AB61","v":"NA"},{"$f":"Properties!AC61","v":"NA"},{"$f":"Properties!K61","v":0},{"$f":"Properties!AD61","v":"NA"},{"$f":"Properties!AE61","v":"NA"},{"$f":"IF(Properties!$L61=0,\"\",Properties!$L61)","v":""},{"$f":"IF(Properties!$L62=0,\"\",Properties!$L62)","v":""},{"$f":"IF(Properties!$L63=0,\"\",Properties!$L63)","v":""},{"$f":"IF(Properties!$L64=0,\"\",Properties!$L64)","v":""},{"$f":"IF(Properties!AF61=0,\"\",Properties!AF61)","v":"NA"},{"$f":"Properties!AG61","v":"NA"},{"$f":"Properties!AH61","v":"NA"},{"$f":"Properties!AI61","v":"NA"},{"$f":"IF(Properties!X61=0,\"\",Properties!X61)","v":""},{"$f":"IF(Properties!N61=0,\"\",Properties!N61)","v":""},{"$f":"Properties!AJ61","v":"NA"},{"$f":"Properties!AK61","v":"NA"},{"$f":"IF(Properties!O61=0,\"\",Properties!O61)","v":""},{"$f":"Properties!AL61","v":"NA"},{"$f":"Properties!AM61","v":"NA"},{"$f":"IF(Properties!P61=0,\"\",Properties!P61)","v":""},{"$f":"Properties!AN61","v":"NA"},{"$f":"Properties!AO61","v":"NA"},{"$f":"IF(Properties!$Q61=0,\"\",Properties!$Q61)","v":""},{"$f":"IF(Properties!$Q62=0,\"\",Properties!$Q62)","v":""},{"$f":"IF(Properties!$Q63=0,\"\",Properties!$Q63)","v":""},{"$f":"IF(Properties!$Q64=0,\"\",Properties!$Q64)","v":""},{"$f":"IF(Properties!AP61=0,\"\",Properties!AP61)","v":"NA"},{"$f":"Properties!AQ61","v":"NA"},{"$f":"Properties!AR61","v":"NA"},{"$f":"Properties!AS61","v":"NA"},{"$f":"IF(Properties!Y61=0,\"\",Properties!Y61)","v":""},{"$f":"IF(Properties!S61=0,\"\",Properties!S61)","v":""},{"$f":"Properties!AT61","v":"NA"},{"$f":"Properties!AU61","v":"NA"},{"$f":"IF(Properties!T61=0,\"\",Properties!T61)","v":""},{"$f":"Properties!AV61","v":"NA"},{"$f":"Properties!AW61","v":"NA"},{"$f":"IF(Properties!U61=0,\"\",Properties!U61)","v":""},{"$f":"Properties!AX61","v":"NA"},{"$f":"Properties!AY61","v":"NA"},{"$f":"IF(Properties!$V61=0,\"\",Properties!$V61)","v":""},{"$f":"IF(Properties!$V62=0,\"\",Properties!$V62)","v":""},{"$f":"IF(Properties!$V63=0,\"\",Properties!$V63)","v":""},{"$f":"IF(Properties!$V64=0,\"\",Properties!$V64)","v":""},{"$f":"IF(Properties!W61=0,\"\",Properties!W61)","v":""},{"$f":"Properties!BA61","v":"NA"},{"$f":"Properties!BB61","v":"NA"},{"$f":"Properties!BC61","v":"NA"}]
[null,{"$f":"IF(Menu!$C$5=0,\"\",Menu!$C$5)","v":""},{"$f":"IF(Menu!$C$6=0,\"\",Menu!$C$6)","v":""},{"$f":"IF(Menu!$C$7=0,\"\",Menu!$C$7)","v":""},{"$f":"IF(Menu!$C$8=0,\"\",Menu!$C$8)","v":""},{"$f":"IF(Menu!$C$9=0,\"\",Menu!$C$9)","v":""},{"$f":"IF(Menu!$C$10=0,\"\",Menu!$C$10)","v":""},{"$f":"IF(Menu!$F$7=0,\"\",Menu!$F$7)","v":"Std QA"},{"$f":"IF(Menu!$F$5=0,\"\",Menu!$F$5)","v":"2E03"},{"$f":"IF(Menu!$F$8=0,\"\",Menu!$F$8)","v":"Ignition"},{"$f":"IF(Properties!D65=0,\"\",Properties!D65)","v":""},{"$f":"IF(Properties!$G$5=0,\"\",Properties!$G$5)","v":"No"},{"$f":"IF(Properties!$C$9=0,\"\",Properties!$C$9)","v":""},{"$f":"IF(Properties!$G$3=0,\"\",Properties!$G$3)","v":""},{"$f":"IF(Properties!$G$4=0,\"\",Properties!$G$4)","v":"10-03"},{"$f":"IF(Properties!E65=0,\"\",Properties!E65)","v":14},{"$f":"IF(Properties!G65=0,\"\",Properties!G65)","v":""},{"$f":"IF(Menu!$G$17=0,\"\",Menu!$G$17)","v":92},{"$f":"IF(Properties!H65=0,\"\",Properties!H65)","v":""},{"$f":"IF(Properties!$R$4=0,\"\",Properties!$R$4)","v":3},{"$f":"IF(Properties!I65=0,\"\",Properties!I65)","v":""},{"$f":"Properties!Z65","v":"NA"},{"$f":"Properties!AA65","v":"NA"},{"$f":"IF(Properties!J65=0,\"\",Properties!J65)","v":""},{"$f":"Properties!AB65","v":"NA"},{"$f":"Properties!AC65","v":"NA"},{"$f":"Properties!K65","v":0},{"$f":"Properties!AD65","v":"NA"},{"$f":"Properties!AE65","v":"NA"},{"$f":"IF(Properties!$L65=0,\"\",Properties!$L65)","v":""},{"$f":"IF(Properties!$L66=0,\"\",Properties!$L66)","v":""},{"$f":"IF(Properties!$L67=0,\"\",Properties!$L67)","v":""},{"$f":"IF(Properties!$L68=0,\"\",Properties!$L68)","v":""},{"$f":"IF(Properties!AF65=0,\"\",Properties!AF65)","v":"NA"},{"$f":"Properties!AG65","v":"NA"},{"$f":"Properties!AH65","v":"NA"},{"$f":"Properties!AI65","v":"NA"},{"$f":"IF(Properties!X65=0,\"\",Properties!X65)","v":""},{"$f":"IF(Properties!N65=0,\"\",Properties!N65)","v":""},{"$f":"Properties!AJ65","v":"NA"},{"$f":"Properties!AK65","v":"NA"},{"$f":"IF(Properties!O65=0,\"\",Properties!O65)","v":""},{"$f":"Properties!AL65","v":"NA"},{"$f":"Properties!AM65","v":"NA"},{"$f":"IF(Properties!P65=0,\"\",Properties!P65)","v":""},{"$f":"Properties!AN65","v":"NA"},{"$f":"Properties!AO65","v":"NA"},{"$f":"IF(Properties!$Q65=0,\"\",Properties!$Q65)","v":""},{"$f":"IF(Properties!$Q66=0,\"\",Properties!$Q66)","v":""},{"$f":"IF(Properties!$Q67=0,\"\",Properties!$Q67)","v":""},{"$f":"IF(Properties!$Q68=0,\"\",Properties!$Q68)","v":""},{"$f":"IF(Properties!AP65=0,\"\",Properties!AP65)","v":"NA"},{"$f":"Properties!AQ65","v":"NA"},{"$f":"Properties!AR65","v":"NA"},{"$f":"Properties!AS65","v":"NA"},{"$f":"IF(Properties!Y65=0,\"\",Properties!Y65)","v":""},{"$f":"IF(Properties!S65=0,\"\",Properties!S65)","v":""},{"$f":"Properties!AT65","v":"NA"},{"$f":"Properties!AU65","v":"NA"},{"$f":"IF(Properties!T65=0,\"\",Properties!T65)","v":""},{"$f":"Properties!AV65","v":"NA"},{"$f":"Properties!AW65","v":"NA"},{"$f":"IF(Properties!U65=0,\"\",Properties!U65)","v":""},{"$f":"Properties!AX65","v":"NA"},{"$f":"Properties!AY65","v":"NA"},{"$f":"IF(Properties!$V65=0,\"\",Properties!$V65)","v":""},{"$f":"IF(Properties!$V66=0,\"\",Properties!$V66)","v":""},{"$f":"IF(Properties!$V67=0,\"\",Properties!$V67)","v":""},{"$f":"IF(Properties!$V68=0,\"\",Properties!$V68)","v":""},{"$f":"IF(Properties!W65=0,\"\",Properties!W65)","v":""},{"$f":"Properties!BA65","v":"NA"},{"$f":"Properties!BB65","v":"NA"},{"$f":"Properties!BC65","v":"NA"}]
[null,{"$f":"IF(Menu!$C$5=0,\"\",Menu!$C$5)","v":""},{"$f":"IF(Menu!$C$6=0,\"\",Menu!$C$6)","v":""},{"$f":"IF(Menu!$C$7=0,\"\",Menu!$C$7)","v":""},{"$f":"IF(Menu!$C$8=0,\"\",Menu!$C$8)","v":""},{"$f":"IF(Menu!$C$9=0,\"\",Menu!$C$9)","v":""},{"$f":"IF(Menu!$C$10=0,\"\",Menu!$C$10)","v":""},{"$f":"IF(Menu!$F$7=0,\"\",Menu!$F$7)","v":"Std QA"},{"$f":"IF(Menu!$F$5=0,\"\",Menu!$F$5)","v":"2E03"},{"$f":"IF(Menu!$F$8=0,\"\",Menu!$F$8)","v":"Ignition"},{"$f":"IF(Properties!D69=0,\"\",Properties!D69)","v":""},{"$f":"IF(Properties!$G$5=0,\"\",Properties!$G$5)","v":"No"},{"$f":"IF(Properties!$C$9=0,\"\",Properties!$C$9)","v":""},{"$f":"IF(Properties!$G$3=0,\"\",Properties!$G$3)","v":""},{"$f":"IF(Properties!$G$4=0,\"\",Properties!$G$4)","v":"10-03"},{"$f":"IF(Properties!E69=0,\"\",Properties!E69)","v":15},{"$f":"IF(Properties!G69=0,\"\",Properties!G69)","v":""},{"$f":"IF(Menu!$G$17=0,\"\",Menu!$G$17)","v":92},{"$f":"IF(Properties!H69=0,\"\",Properties!H69)","v":""},{"$f":"IF(Properties!$R$4=0,\"\",Properties!$R$4)","v":3},{"$f":"IF(Properties!I69=0,\"\",Properties!I69)","v":""},{"$f":"Properties!Z69","v":"NA"},{"$f":"Properties!AA69","v":"NA"},{"$f":"IF(Properties!J69=0,\"\",Properties!J69)","v":""},{"$f":"Properties!AB69","v":"NA"},{"$f":"Properties!AC69","v":"NA"},{"$f":"Properties!K69","v":0},{"$f":"Properties!AD69","v":"NA"},{"$f":"Properties!AE69","v":"NA"},{"$f":"IF(Properties!$L69=0,\"\",Properties!$L69)","v":""},{"$f":"IF(Properties!$L70=0,\"\",Properties!$L70)","v":""},{"$f":"IF(Properties!$L71=0,\"\",Properties!$L71)","v":""},{"$f":"IF(Properties!$L72=0,\"\",Properties!$L72)","v":""},{"$f":"IF(Properties!AF69=0,\"\",Properties!AF69)","v":"NA"},{"$f":"Properties!AG69","v":"NA"},{"$f":"Properties!AH69","v":"NA"},{"$f":"Properties!AI69","v":"NA"},{"$f":"IF(Properties!X69=0,\"\",Properties!X69)","v":""},{"$f":"IF(Properties!N69=0,\"\",Properties!N69)","v":""},{"$f":"Properties!AJ69","v":"NA"},{"$f":"Properties!AK69","v":"NA"},{"$f":"IF(Properties!O69=0,\"\",Properties!O69)","v":""},{"$f":"Properties!AL69","v":"NA"},{"$f":"Properties!AM69","v":"NA"},{"$f":"IF(Properties!P69=0,\"\",Properties!P69)","v":""},{"$f":"Properties!AN69","v":"NA"},{"$f":"Properties!AO69","v":"NA"},{"$f":"IF(Properties!$Q69=0,\"\",Properties!$Q69)","v":""},{"$f":"IF(Properties!$Q70=0,\"\",Properties!$Q70)","v":""},{"$f":"IF(Properties!$Q71=0,\"\",Properties!$Q71)","v":""},{"$f":"IF(Properties!$Q72=0,\"\",Properties!$Q72)","v":""},{"$f":"IF(Properties!AP69=0,\"\",Properties!AP69)","v":"NA"},{"$f":"Properties!AQ69","v":"NA"},{"$f":"Properties!AR69","v":"NA"},{"$f":"Properties!AS69","v":"NA"},{"$f":"IF(Properties!Y69=0,\"\",Properties!Y69)","v":""},{"$f":"IF(Properties!S69=0,\"\",Properties!S69)","v":""},{"$f":"Properties!AT69","v":"NA"},{"$f":"Properties!AU69","v":"NA"},{"$f":"IF(Properties!T69=0,\"\",Properties!T69)","v":""},{"$f":"Properties!AV69","v":"NA"},{"$f":"Properties!AW69","v":"NA"},{"$f":"IF(Properties!U69=0,\"\",Properties!U69)","v":""},{"$f":"Properties!AX69","v":"NA"},{"$f":"Properties!AY69","v":"NA"},{"$f":"IF(Properties!$V69=0,\"\",Properties!$V69)","v":""},{"$f":"IF(Properties!$V70=0,\"\",Properties!$V70)","v":""},{"$f":"IF(Properties!$V71=0,\"\",Properties!$V71)","v":""},{"$f":"IF(Properties!$V72=0,\"\",Properties!$V72)","v":""},{"$f":"IF(Properties!W69=0,\"\",Properties!W69)","v":""},{"$f":"Properties!BA69","v":"NA"},{"$f":"Properties!BB69","v":"NA"},{"$f":"Properties!BC69","v":"NA"}]
[null,{"$f":"IF(Menu!$C$5=0,\"\",Menu!$C$5)","v":""},{"$f":"IF(Menu!$C$6=0,\"\",Menu!$C$6)","v":""},{"$f":"IF(Menu!$C$7=0,\"\",Menu!$C$7)","v":""},{"$f":"IF(Menu!$C$8=0,\"\",Menu!$C$8)","v":""},{"$f":"IF(Menu!$C$9=0,\"\",Menu!$C$9)","v":""},{"$f":"IF(Menu!$C$10=0,\"\",Menu!$C$10)","v":""},{"$f":"IF(Menu!$F$7=0,\"\",Menu!$F$7)","v":"Std QA"},{"$f":"IF(Menu!$F$5=0,\"\",Menu!$F$5)","v":"2E03"},{"$f":"IF(Menu!$F$8=0,\"\",Menu!$F$8)","v":"Ignition"},{"$f":"IF(Properties!D73=0,\"\",Properties!D73)","v":""},{"$f":"IF(Properties!$G$5=0,\"\",Properties!$G$5)","v":"No"},{"$f":"IF(Properties!$C$9=0,\"\",Properties!$C$9)","v":""},{"$f":"IF(Properties!$G$3=0,\"\",Properties!$G$3)","v":""},{"$f":"IF(Properties!$G$4=0,\"\",Properties!$G$4)","v":"10-03"},{"$f":"IF(Properties!E73=0,\"\",Properties!E73)","v":16},{"$f":"IF(Properties!G73=0,\"\",Properties!G73)","v":""},{"$f":"IF(Menu!$G$17=0,\"\",Menu!$G$17)","v":92},{"$f":"IF(Properties!H73=0,\"\",Properties!H73)","v":""},{"$f":"IF(Properties!$R$4=0,\"\",Properties!$R$4)","v":3},{"$f":"IF(Properties!I73=0,\"\",Properties!I73)","v":""},{"$f":"Properties!Z73","v":"NA"},{"$f":"Properties!AA73","v":"NA"},{"$f":"IF(Properties!J73=0,\"\",Properties!J73)","v":""},{"$f":"Properties!AB73","v":"NA"},{"$f":"Properties!AC73","v":"NA"},{"$f":"Properties!K73","v":0},{"$f":"Properties!AD73","v":"NA"},{"$f":"Properties!AE73","v":"NA"},{"$f":"IF(Properties!$L73=0,\"\",Properties!$L73)","v":""},{"$f":"IF(Properties!$L74=0,\"\",Properties!$L74)","v":""},{"$f":"IF(Properties!$L75=0,\"\",Properties!$L75)","v":""},{"$f":"IF(Properties!$L76=0,\"\",Properties!$L76)","v":""},{"$f":"IF(Properties!AF73=0,\"\",Properties!AF73)","v":"NA"},{"$f":"Properties!AG73","v":"NA"},{"$f":"Properties!AH73","v":"NA"},{"$f":"Properties!AI73","v":"NA"},{"$f":"IF(Properties!X73=0,\"\",Properties!X73)","v":""},{"$f":"IF(Properties!N73=0,\"\",Properties!N73)","v":""},{"$f":"Properties!AJ73","v":"NA"},{"$f":"Properties!AK73","v":"NA"},{"$f":"IF(Properties!O73=0,\"\",Properties!O73)","v":""},{"$f":"Properties!AL73","v":"NA"},{"$f":"Properties!AM73","v":"NA"},{"$f":"IF(Properties!P73=0,\"\",Properties!P73)","v":""},{"$f":"Properties!AN73","v":"NA"},{"$f":"Properties!AO73","v":"NA"},{"$f":"IF(Properties!$Q73=0,\"\",Properties!$Q73)","v":""},{"$f":"IF(Properties!$Q74=0,\"\",Properties!$Q74)","v":""},{"$f":"IF(Properties!$Q75=0,\"\",Properties!$Q75)","v":""},{"$f":"IF(Properties!$Q76=0,\"\",Properties!$Q76)","v":""},{"$f":"IF(Properties!AP73=0,\"\",Properties!AP73)","v":"NA"},{"$f":"Properties!AQ73","v":"NA"},{"$f":"Properties!AR73","v":"NA"},{"$f":"Properties!AS73","v":"NA"},{"$f":"IF(Properties!Y73=0,\"\",Properties!Y73)","v":""},{"$f":"IF(Properties!S73=0,\"\",Properties!S73)","v":""},{"$f":"Properties!AT73","v":"NA"},{"$f":"Properties!AU73","v":"NA"},{"$f":"IF(Properties!T73=0,\"\",Properties!T73)","v":""},{"$f":"Properties!AV73","v":"NA"},{"$f":"Properties!AW73","v":"NA"},{"$f":"IF(Properties!U73=0,\"\",Properties!U73)","v":""},{"$f":"Properties!AX73","v":"NA"},{"$f":"Properties!AY73","v":"NA"},{"$f":"IF(Properties!$V73=0,\"\",Properties!$V73)","v":""},{"$f":"IF(Properties!$V74=0,\"\",Properties!$V74)","v":""},{"$f":"IF(Properties!$V75=0,\"\",Properties!$V75)","v":""},{"$f":"IF(Properties!$V76=0,\"\",Properties!$V76)","v":""},{"$f":"IF(Properties!W73=0,\"\",Properties!W73)","v":""},{"$f":"Properties!BA73","v":"NA"},{"$f":"Properties!BB73","v":"NA"},{"$f":"Properties!BC73","v":"NA"}]
[null,{"$f":"IF(Menu!$C$5=0,\"\",Menu!$C$5)","v":""},{"$f":"IF(Menu!$C$6=0,\"\",Menu!$C$6)","v":""},{"$f":"IF(Menu!$C$7=0,\"\",Menu!$C$7)","v":""},{"$f":"IF(Menu!$C$8=0,\"\",Menu!$C$8)","v":""},{"$f":"IF(Menu!$C$9=0,\"\",Menu!$C$9)","v":""},{"$f":"IF(Menu!$C$10=0,\"\",Menu!$C$10)","v":""},{"$f":"IF(Menu!$F$7=0,\"\",Menu!$F$7)","v":"Std QA"},{"$f":"IF(Menu!$F$5=0,\"\",Menu!$F$5)","v":"2E03"},{"$f":"IF(Menu!$F$8=0,\"\",Menu!$F$8)","v":"Ignition"},{"$f":"IF(Properties!D77=0,\"\",Properties!D77)","v":""},{"$f":"IF(Properties!$G$5=0,\"\",Properties!$G$5)","v":"No"},{"$f":"IF(Properties!$C$9=0,\"\",Properties!$C$9)","v":""},{"$f":"IF(Properties!$G$3=0,\"\",Properties!$G$3)","v":""},{"$f":"IF(Properties!$G$4=0,\"\",Properties!$G$4)","v":"10-03"},{"$f":"IF(Properties!E77=0,\"\",Properties!E77)","v":17},{"$f":"IF(Properties!G77=0,\"\",Properties!G77)","v":""},{"$f":"IF(Menu!$G$17=0,\"\",Menu!$G$17)","v":92},{"$f":"IF(Properties!H77=0,\"\",Properties!H77)","v":""},{"$f":"IF(Properties!$R$4=0,\"\",Properties!$R$4)","v":3},{"$f":"IF(Properties!I77=0,\"\",Properties!I77)","v":""},{"$f":"Properties!Z77","v":"NA"},{"$f":"Properties!AA77","v":"NA"},{"$f":"IF(Properties!J77=0,\"\",Properties!J77)","v":""},{"$f":"Properties!AB77","v":"NA"},{"$f":"Properties!AC77","v":"NA"},{"$f":"Properties!K77","v":0},{"$f":"Properties!AD77","v":"NA"},{"$f":"Properties!AE77","v":"NA"},{"$f":"IF(Properties!$L77=0,\"\",Properties!$L77)","v":""},{"$f":"IF(Properties!$L78=0,\"\",Properties!$L78)","v":""},{"$f":"IF(Properties!$L79=0,\"\",Properties!$L79)","v":""},{"$f":"IF(Properties!$L80=0,\"\",Properties!$L80)","v":""},{"$f":"IF(Properties!AF77=0,\"\",Properties!AF77)","v":"NA"},{"$f":"Properties!AG77","v":"NA"},{"$f":"Properties!AH77","v":"NA"},{"$f":"Properties!AI77","v":"NA"},{"$f":"IF(Properties!X77=0,\"\",Properties!X77)","v":""},{"$f":"IF(Properties!N77=0,\"\",Properties!N77)","v":""},{"$f":"Properties!AJ77","v":"NA"},{"$f":"Properties!AK77","v":"NA"},{"$f":"IF(Properties!O77=0,\"\",Properties!O77)","v":""},{"$f":"Properties!AL77","v":"NA"},{"$f":"Properties!AM77","v":"NA"},{"$f":"IF(Properties!P77=0,\"\",Properties!P77)","v":""},{"$f":"Properties!AN77","v":"NA"},{"$f":"Properties!AO77","v":"NA"},{"$f":"IF(Properties!$Q77=0,\"\",Properties!$Q77)","v":""},{"$f":"IF(Properties!$Q78=0,\"\",Properties!$Q78)","v":""},{"$f":"IF(Properties!$Q79=0,\"\",Properties!$Q79)","v":""},{"$f":"IF(Properties!$Q80=0,\"\",Properties!$Q80)","v":""},{"$f":"IF(Properties!AP77=0,\"\",Properties!AP77)","v":"NA"},{"$f":"Properties!AQ77","v":"NA"},{"$f":"Properties!AR77","v":"NA"},{"$f":"Properties!AS77","v":"NA"},{"$f":"IF(Properties!Y77=0,\"\",Properties!Y77)","v":""},{"$f":"IF(Properties!S77=0,\"\",Properties!S77)","v":""},{"$f":"Properties!AT77","v":"NA"},{"$f":"Properties!AU77","v":"NA"},{"$f":"IF(Properties!T77=0,\"\",Properties!T77)","v":""},{"$f":"Properties!AV77","v":"NA"},{"$f":"Properties!AW77","v":"NA"},{"$f":"IF(Properties!U77=0,\"\",Properties!U77)","v":""},{"$f":"Properties!AX77","v":"NA"},{"$f":"Properties!AY77","v":"NA"},{"$f":"IF(Properties!$V77=0,\"\",Properties!$V77)","v":""},{"$f":"IF(Properties!$V78=0,\"\",Properties!$V78)","v":""},{"$f":"IF(Properties!$V79=0,\"\",Properties!$V79)","v":""},{"$f":"IF(Properties!$V80=0,\"\",Properties!$V80)","v":""},{"$f":"IF(Properties!W77=0,\"\",Properties!W77)","v":""},{"$f":"Properties!BA77","v":"NA"},{"$f":"Properties!BB77","v":"NA"},{"$f":"Properties!BC77","v":"NA"}]
[null,{"$f":"IF(Menu!$C$5=0,\"\",Menu!$C$5)","v":""},{"$f":"IF(Menu!$C$6=0,\"\",Menu!$C$6)","v":""},{"$f":"IF(Menu!$C$7=0,\"\",Menu!$C$7)","v":""},{"$f":"IF(Menu!$C$8=0,\"\",Menu!$C$8)","v":""},{"$f":"IF(Menu!$C$9=0,\"\",Menu!$C$9)","v":""},{"$f":"IF(Menu!$C$10=0,\"\",Menu!$C$10)","v":""},{"$f":"IF(Menu!$F$7=0,\"\",Menu!$F$7)","v":"Std QA"},{"$f":"IF(Menu!$F$5=0,\"\",Menu!$F$5)","v":"2E03"},{"$f":"IF(Menu!$F$8=0,\"\",Menu!$F$8)","v":"Ignition"},{"$f":"IF(Properties!D81=0,\"\",Properties!D81)","v":""},{"$f":"IF(Properties!$G$5=0,\"\",Properties!$G$5)","v":"No"},{"$f":"IF(Properties!$C$9=0,\"\",Properties!$C$9)","v":""},{"$f":"IF(Properties!$G$3=0,\"\",Properties!$G$3)","v":""},{"$f":"IF(Properties!$G$4=0,\"\",Properties!$G$4)","v":"10-03"},{"$f":"IF(Properties!E81=0,\"\",Properties!E81)","v":18},{"$f":"IF(Properties!G81=0,\"\",Properties!G81)","v":""},{"$f":"IF(Menu!$G$17=0,\"\",Menu!$G$17)","v":92},{"$f":"IF(Properties!H81=0,\"\",Properties!H81)","v":""},{"$f":"IF(Properties!$R$4=0,\"\",Properties!$R$4)","v":3},{"$f":"IF(Properties!I81=0,\"\",Properties!I81)","v":""},{"$f":"Properties!Z81","v":"NA"},{"$f":"Properties!AA81","v":"NA"},{"$f":"IF(Properties!J81=0,\"\",Properties!J81)","v":""},{"$f":"Properties!AB81","v":"NA"},{"$f":"Properties!AC81","v":"NA"},{"$f":"Properties!K81","v":0},{"$f":"Properties!AD81","v":"NA"},{"$f":"Properties!AE81","v":"NA"},{"$f":"IF(Properties!$L81=0,\"\",Properties!$L81)","v":""},{"$f":"IF(Properties!$L82=0,\"\",Properties!$L82)","v":""},{"$f":"IF(Properties!$L83=0,\"\",Properties!$L83)","v":""},{"$f":"IF(Properties!$L84=0,\"\",Properties!$L84)","v":""},{"$f":"IF(Properties!AF81=0,\"\",Properties!AF81)","v":"NA"},{"$f":"Properties!AG81","v":"NA"},{"$f":"Properties!AH81","v":"NA"},{"$f":"Properties!AI81","v":"NA"},{"$f":"IF(Properties!X81=0,\"\",Properties!X81)","v":""},{"$f":"IF(Properties!N81=0,\"\",Properties!N81)","v":""},{"$f":"Properties!AJ81","v":"NA"},{"$f":"Properties!AK81","v":"NA"},{"$f":"IF(Properties!O81=0,\"\",Properties!O81)","v":""},{"$f":"Properties!AL81","v":"NA"},{"$f":"Properties!AM81","v":"NA"},{"$f":"IF(Properties!P81=0,\"\",Properties!P81)","v":""},{"$f":"Properties!AN81","v":"NA"},{"$f":"Properties!AO81","v":"NA"},{"$f":"IF(Properties!$Q81=0,\"\",Properties!$Q81)","v":""},{"$f":"IF(Properties!$Q82=0,\"\",Properties!$Q82)","v":""},{"$f":"IF(Properties!$Q83=0,\"\",Properties!$Q83)","v":""},{"$f":"IF(Properties!$Q84=0,\"\",Properties!$Q84)","v":""},{"$f":"IF(Properties!AP81=0,\"\",Properties!AP81)","v":"NA"},{"$f":"Properties!AQ81","v":"NA"},{"$f":"Properties!AR81","v":"NA"},{"$f":"Properties!AS81","v":"NA"},{"$f":"IF(Properties!Y81=0,\"\",Properties!Y81)","v":""},{"$f":"IF(Properties!S81=0,\"\",Properties!S81)","v":""},{"$f":"Properties!AT81","v":"NA"},{"$f":"Properties!AU81","v":"NA"},{"$f":"IF(Properties!T81=0,\"\",Properties!T81)","v":""},{"$f":"Properties!AV81","v":"NA"},{"$f":"Properties!AW81","v":"NA"},{"$f":"IF(Properties!U81=0,\"\",Properties!U81)","v":""},{"$f":"Properties!AX81","v":"NA"},{"$f":"Properties!AY81","v":"NA"},{"$f":"IF(Properties!$V81=0,\"\",Properties!$V81)","v":""},{"$f":"IF(Properties!$V82=0,\"\",Properties!$V82)","v":""},{"$f":"IF(Properties!$V83=0,\"\",Properties!$V83)","v":""},{"$f":"IF(Properties!$V84=0,\"\",Properties!$V84)","v":""},{"$f":"IF(Properties!W81=0,\"\",Properties!W81)","v":""},{"$f":"Properties!BA81","v":"NA"},{"$f":"Properties!BB81","v":"NA"},{"$f":"Properties!BC81","v":"NA"}]
[null,{"$f":"IF(Menu!$C$5=0,\"\",Menu!$C$5)","v":""},{"$f":"IF(Menu!$C$6=0,\"\",Menu!$C$6)","v":""},{"$f":"IF(Menu!$C$7=0,\"\",Menu!$C$7)","v":""},{"$f":"IF(Menu!$C$8=0,\"\",Menu!$C$8)","v":""},{"$f":"IF(Menu!$C$9=0,\"\",Menu!$C$9)","v":""},{"$f":"IF(Menu!$C$10=0,\"\",Menu!$C$10)","v":""},{"$f":"IF(Menu!$F$7=0,\"\",Menu!$F$7)","v":"Std QA"},{"$f":"IF(Menu!$F$5=0,\"\",Menu!$F$5)","v":"2E03"},{"$f":"IF(Menu!$F$8=0,\"\",Menu!$F$8)","v":"Ignition"},{"$f":"IF(Properties!D85=0,\"\",Properties!D85)","v":""},{"$f":"IF(Properties!$G$5=0,\"\",Properties!$G$5)","v":"No"},{"$f":"IF(Properties!$C$9=0,\"\",Properties!$C$9)","v":""},{"$f":"IF(Properties!$G$3=0,\"\",Properties!$G$3)","v":""},{"$f":"IF(Properties!$G$4=0,\"\",Properties!$G$4)","v":"10-03"},{"$f":"IF(Properties!E85=0,\"\",Properties!E85)","v":19},{"$f":"IF(Properties!G85=0,\"\",Properties!G85)","v":""},{"$f":"IF(Menu!$G$17=0,\"\",Menu!$G$17)","v":92},{"$f":"IF(Properties!H85=0,\"\",Properties!H85)","v":""},{"$f":"IF(Properties!$R$4=0,\"\",Properties!$R$4)","v":3},{"$f":"IF(Properties!I85=0,\"\",Properties!I85)","v":""},{"$f":"Properties!Z85","v":"NA"},{"$f":"Properties!AA85","v":"NA"},{"$f":"IF(Properties!J85=0,\"\",Properties!J85)","v":""},{"$f":"Properties!AB85","v":"NA"},{"$f":"Properties!AC85","v":"NA"},{"$f":"Properties!K85","v":0},{"$f":"Properties!AD85","v":"NA"},{"$f":"Properties!AE85","v":"NA"},{"$f":"IF(Properties!$L85=0,\"\",Properties!$L85)","v":""},{"$f":"IF(Properties!$L86=0,\"\",Properties!$L86)","v":""},{"$f":"IF(Properties!$L87=0,\"\",Properties!$L87)","v":""},{"$f":"IF(Properties!$L88=0,\"\",Properties!$L88)","v":""},{"$f":"IF(Properties!AF85=0,\"\",Properties!AF85)","v":"NA"},{"$f":"Properties!AG85","v":"NA"},{"$f":"Properties!AH85","v":"NA"},{"$f":"Properties!AI85","v":"NA"},{"$f":"IF(Properties!X85=0,\"\",Properties!X85)","v":""},{"$f":"IF(Properties!N85=0,\"\",Properties!N85)","v":""},{"$f":"Properties!AJ85","v":"NA"},{"$f":"Properties!AK85","v":"NA"},{"$f":"IF(Properties!O85=0,\"\",Properties!O85)","v":""},{"$f":"Properties!AL85","v":"NA"},{"$f":"Properties!AM85","v":"NA"},{"$f":"IF(Properties!P85=0,\"\",Properties!P85)","v":""},{"$f":"Properties!AN85","v":"NA"},{"$f":"Properties!AO85","v":"NA"},{"$f":"IF(Properties!$Q85=0,\"\",Properties!$Q85)","v":""},{"$f":"IF(Properties!$Q86=0,\"\",Properties!$Q86)","v":""},{"$f":"IF(Properties!$Q87=0,\"\",Properties!$Q87)","v":""},{"$f":"IF(Properties!$Q88=0,\"\",Properties!$Q88)","v":""},{"$f":"IF(Properties!AP85=0,\"\",Properties!AP85)","v":"NA"},{"$f":"Properties!AQ85","v":"NA"},{"$f":"Properties!AR85","v":"NA"},{"$f":"Properties!AS85","v":"NA"},{"$f":"IF(Properties!Y85=0,\"\",Properties!Y85)","v":""},{"$f":"IF(Properties!S85=0,\"\",Properties!S85)","v":""},{"$f":"Properties!AT85","v":"NA"},{"$f":"Properties!AU85","v":"NA"},{"$f":"IF(Properties!T85=0,\"\",Properties!T85)","v":""},{"$f":"Properties!AV85","v":"NA"},{"$f":"Properties!AW85","v":"NA"},{"$f":"IF(Properties!U85=0,\"\",Properties!U85)","v":""},{"$f":"Properties!AX85","v":"NA"},{"$f":"Properties!AY85","v":"NA"},{"$f":"IF(Properties!$V85=0,\"\",Properties!$V85)","v":""},{"$f":"IF(Properties!$V86=0,\"\",Properties!$V86)","v":""},{"$f":"IF(Properties!$V87=0,\"\",Properties!$V87)","v":""},{"$f":"IF(Properties!$V88=0,\"\",Properties!$V88)","v":""},{"$f":"IF(Properties!W85=0,\"\",Properties!W85)","v":""},{"$f":"Properties!BA85","v":"NA"},{"$f":"Properties!BB85","v":"NA"},{"$f":"Properties!BC85","v":"NA"}]
[null,{"$f":"IF(Menu!$C$5=0,\"\",Menu!$C$5)","v":""},{"$f":"IF(Menu!$C$6=0,\"\",Menu!$C$6)","v":""},{"$f":"IF(Menu!$C$7=0,\"\",Menu!$C$7)","v":""},{"$f":"IF(Menu!$C$8=0,\"\",Menu!$C$8)","v":""},{"$f":"IF(Menu!$C$9=0,\"\",Menu!$C$9)","v":""},{"$f":"IF(Menu!$C$10=0,\"\",Menu!$C$10)","v":""},{"$f":"IF(Menu!$F$7=0,\"\",Menu!$F$7)","v":"Std QA"},{"$f":"IF(Menu!$F$5=0,\"\",Menu!$F$5)","v":"2E03"},{"$f":"IF(Menu!$F$8=0,\"\",Menu!$F$8)","v":"Ignition"},{"$f":"IF(Properties!D89=0,\"\",Properties!D89)","v":""},{"$f":"IF(Properties!$G$5=0,\"\",Properties!$G$5)","v":"No"},{"$f":"IF(Properties!$C$9=0,\"\",Properties!$C$9)","v":""},{"$f":"IF(Properties!$G$3=0,\"\",Properties!$G$3)","v":""},{"$f":"IF(Properties!$G$4=0,\"\",Properties!$G$4)","v":"10-03"},{"$f":"IF(Properties!E89=0,\"\",Properties!E89)","v":20},{"$f":"IF(Properties!G89=0,\"\",Properties!G89)","v":""},{"$f":"IF(Menu!$G$17=0,\"\",Menu!$G$17)","v":92},{"$f":"IF(Properties!H89=0,\"\",Properties!H89)","v":""},{"$f":"IF(Properties!$R$4=0,\"\",Properties!$R$4)","v":3},{"$f":"IF(Properties!I89=0,\"\",Properties!I89)","v":""},{"$f":"Properties!Z89","v":"NA"},{"$f":"Properties!AA89","v":"NA"},{"$f":"IF(Properties!J89=0,\"\",Properties!J89)","v":""},{"$f":"Properties!AB89","v":"NA"},{"$f":"Properties!AC89","v":"NA"},{"$f":"Properties!K89","v":0},{"$f":"Properties!AD89","v":"NA"},{"$f":"Properties!AE89","v":"NA"},{"$f":"IF(Properties!$L89=0,\"\",Properties!$L89)","v":""},{"$f":"IF(Properties!$L90=0,\"\",Properties!$L90)","v":""},{"$f":"IF(Properties!$L91=0,\"\",Properties!$L91)","v":""},{"$f":"IF(Properties!$L92=0,\"\",Properties!$L92)","v":""},{"$f":"IF(Properties!AF89=0,\"\",Properties!AF89)","v":"NA"},{"$f":"Properties!AG89","v":"NA"},{"$f":"Properties!AH89","v":"NA"},{"$f":"Properties!AI89","v":"NA"},{"$f":"IF(Properties!X89=0,\"\",Properties!X89)","v":""},{"$f":"IF(Properties!N89=0,\"\",Properties!N89)","v":""},{"$f":"Properties!AJ89","v":"NA"},{"$f":"Properties!AK89","v":"NA"},{"$f":"IF(Properties!O89=0,\"\",Properties!O89)","v":""},{"$f":"Properties!AL89","v":"NA"},{"$f":"Properties!AM89","v":"NA"},{"$f":"IF(Properties!P89=0,\"\",Properties!P89)","v":""},{"$f":"Properties!AN89","v":"NA"},{"$f":"Properties!AO89","v":"NA"},{"$f":"IF(Properties!$Q89=0,\"\",Properties!$Q89)","v":""},{"$f":"IF(Properties!$Q90=0,\"\",Properties!$Q90)","v":""},{"$f":"IF(Properties!$Q91=0,\"\",Properties!$Q91)","v":""},{"$f":"IF(Properties!$Q92=0,\"\",Properties!$Q92)","v":""},{"$f":"IF(Properties!AP89=0,\"\",Properties!AP89)","v":"NA"},{"$f":"Properties!AQ89","v":"NA"},{"$f":"Properties!AR89","v":"NA"},{"$f":"Properties!AS89","v":"NA"},{"$f":"IF(Properties!Y89=0,\"\",Properties!Y89)","v":""},{"$f":"IF(Properties!S89=0,\"\",Properties!S89)","v":""},{"$f":"Properties!AT89","v":"NA"},{"$f":"Properties!AU89","v":"NA"},{"$f":"IF(Properties!T89=0,\"\",Properties!T89)","v":""},{"$f":"Properties!AV89","v":"NA"},{"$f":"Properties!AW89","v":"NA"},{"$f":"IF(Properties!U89=0,\"\",Properties!U89)","v":""},{"$f":"Properties!AX89","v":"NA"},{"$f":"Properties!AY89","v":"NA"},{"$f":"IF(Properties!$V89=0,\"\",Properties!$V89)","v":""},{"$f":"IF(Properties!$V90=0,\"\",Properties!$V90)","v":""},{"$f":"IF(Properties!$V91=0,\"\",Properties!$V91)","v":""},{"$f":"IF(Properties!$V92=0,\"\",Properties!$V92)","v":""},{"$f":"IF(Properties!W89=0,\"\",Properties!W89)","v":""},{"$f":"Properties!BA89","v":"NA"},{"$f":"Properties!BB89","v":"NA"},{"$f":"Properties!BC89","v":"NA"}]
[null,{"$f":"IF(Menu!$C$5=0,\"\",Menu!$C$5)","v":""},{"$f":"IF(Menu!$C$6=0,\"\",Menu!$C$6)","v":""},{"$f":"IF(Menu!$C$7=0,\"\",Menu!$C$7)","v":""},{"$f":"IF(Menu!$C$8=0,\"\",Menu!$C$8)","v":""},{"$f":"IF(Menu!$C$9=0,\"\",Menu!$C$9)","v":""},{"$f":"IF(Menu!$C$10=0,\"\",Menu!$C$10)","v":""},{"$f":"IF(Menu!$F$7=0,\"\",Menu!$F$7)","v":"Std QA"},{"$f":"IF(Menu!$F$5=0,\"\",Menu!$F$5)","v":"2E03"},{"$f":"IF(Menu!$F$8=0,\"\",Menu!$F$8)","v":"Ignition"},{"$f":"IF(Properties!D93=0,\"\",Properties!D93)","v":""},{"$f":"IF(Properties!$G$5=0,\"\",Properties!$G$5)","v":"No"},{"$f":"IF(Properties!$C$9=0,\"\",Properties!$C$9)","v":""},{"$f":"IF(Properties!$G$3=0,\"\",Properties!$G$3)","v":""},{"$f":"IF(Properties!$G$4=0,\"\",Properties!$G$4)","v":"10-03"},{"$f":"IF(Properties!E93=0,\"\",Properties!E93)","v":21},{"$f":"IF(Properties!G93=0,\"\",Properties!G93)","v":""},{"$f":"IF(Menu!$G$17=0,\"\",Menu!$G$17)","v":92},{"$f":"IF(Properties!H93=0,\"\",Properties!H93)","v":""},{"$f":"IF(Properties!$R$4=0,\"\",Properties!$R$4)","v":3},{"$f":"IF(Properties!I93=0,\"\",Properties!I93)","v":""},{"$f":"Properties!Z93","v":"NA"},{"$f":"Properties!AA93","v":"NA"},{"$f":"IF(Properties!J93=0,\"\",Properties!J93)","v":""},{"$f":"Properties!AB93","v":"NA"},{"$f":"Properties!AC93","v":"NA"},{"$f":"Properties!K93","v":0},{"$f":"Properties!AD93","v":"NA"},{"$f":"Properties!AE93","v":"NA"},{"$f":"IF(Properties!$L93=0,\"\",Properties!$L93)","v":""},{"$f":"IF(Properties!$L94=0,\"\",Properties!$L94)","v":""},{"$f":"IF(Properties!$L95=0,\"\",Properties!$L95)","v":""},{"$f":"IF(Properties!$L96=0,\"\",Properties!$L96)","v":""},{"$f":"IF(Properties!AF93=0,\"\",Properties!AF93)","v":"NA"},{"$f":"Properties!AG93","v":"NA"},{"$f":"Properties!AH93","v":"NA"},{"$f":"Properties!AI93","v":"NA"},{"$f":"IF(Properties!X93=0,\"\",Properties!X93)","v":""},{"$f":"IF(Properties!N93=0,\"\",Properties!N93)","v":""},{"$f":"Properties!AJ93","v":"NA"},{"$f":"Properties!AK93","v":"NA"},{"$f":"IF(Properties!O93=0,\"\",Properties!O93)","v":""},{"$f":"Properties!AL93","v":"NA"},{"$f":"Properties!AM93","v":"NA"},{"$f":"IF(Properties!P93=0,\"\",Properties!P93)","v":""},{"$f":"Properties!AN93","v":"NA"},{"$f":"Properties!AO93","v":"NA"},{"$f":"IF(Properties!$Q93=0,\"\",Properties!$Q93)","v":""},{"$f":"IF(Properties!$Q94=0,\"\",Properties!$Q94)","v":""},{"$f":"IF(Properties!$Q95=0,\"\",Properties!$Q95)","v":""},{"$f":"IF(Properties!$Q96=0,\"\",Properties!$Q96)","v":""},{"$f":"IF(Properties!AP93=0,\"\",Properties!AP93)","v":"NA"},{"$f":"Properties!AQ93","v":"NA"},{"$f":"Properties!AR93","v":"NA"},{"$f":"Properties!AS93","v":"NA"},{"$f":"IF(Properties!Y93=0,\"\",Properties!Y93)","v":""},{"$f":"IF(Properties!S93=0,\"\",Properties!S93)","v":""},{"$f":"Properties!AT93","v":"NA"},{"$f":"Properties!AU93","v":"NA"},{"$f":"IF(Properties!T93=0,\"\",Properties!T93)","v":""},{"$f":"Properties!AV93","v":"NA"},{"$f":"Properties!AW93","v":"NA"},{"$f":"IF(Properties!U93=0,\"\",Properties!U93)","v":""},{"$f":"Properties!AX93","v":"NA"},{"$f":"Properties!AY93","v":"NA"},{"$f":"IF(Properties!$V93=0,\"\",Properties!$V93)","v":""},{"$f":"IF(Properties!$V94=0,\"\",Properties!$V94)","v":""},{"$f":"IF(Properties!$V95=0,\"\",Properties!$V95)","v":""},{"$f":"IF(Properties!$V96=0,\"\",Properties!$V96)","v":""},{"$f":"IF(Properties!W93=0,\"\",Properties!W93)","v":""},{"$f":"Properties!BA93","v":"NA"},{"$f":"Properties!BB93","v":"NA"},{"$f":"Properties!BC93","v":"NA"}]
[null,{"$f":"IF(Menu!$C$5=0,\"\",Menu!$C$5)","v":""},{"$f":"IF(Menu!$C$6=0,\"\",Menu!$C$6)","v":""},{"$f":"IF(Menu!$C$7=0,\"\",Menu!$C$7)","v":""},{"$f":"IF(Menu!$C$8=0,\"\",Menu!$C$8)","v":""},{"$f":"IF(Menu!$C$9=0,\"\",Menu!$C$9)","v":""},{"$f":"IF(Menu!$C$10=0,\"\",Menu!$C$10)","v":""},{"$f":"IF(Menu!$F$7=0,\"\",Menu!$F$7)","v":"Std QA"},{"$f":"IF(Menu!$F$5=0,\"\",Menu!$F$5)","v":"2E03"},{"$f":"IF(Menu!$F$8=0,\"\",Menu!$F$8)","v":"Ignition"},{"$f":"IF(Properties!D97=0,\"\",Properties!D97)","v":""},{"$f":"IF(Properties!$G$5=0,\"\",Properties!$G$5)","v":"No"},{"$f":"IF(Properties!$C$9=0,\"\",Properties!$C$9)","v":""},{"$f":"IF(Properties!$G$3=0,\"\",Properties!$G$3)","v":""},{"$f":"IF(Properties!$G$4=0,\"\",Properties!$G$4)","v":"10-03"},{"$f":"IF(Properties!E97=0,\"\",Properties!E97)","v":22},{"$f":"IF(Properties!G97=0,\"\",Properties!G97)","v":""},{"$f":"IF(Menu!$G$17=0,\"\",Menu!$G$17)","v":92},{"$f":"IF(Properties!H97=0,\"\",Properties!H97)","v":""},{"$f":"IF(Properties!$R$4=0,\"\",Properties!$R$4)","v":3},{"$f":"IF(Properties!I97=0,\"\",Properties!I97)","v":""},{"$f":"Properties!Z97","v":"NA"},{"$f":"Properties!AA97","v":"NA"},{"$f":"IF(Properties!J97=0,\"\",Properties!J97)","v":""},{"$f":"Properties!AB97","v":"NA"},{"$f":"Properties!AC97","v":"NA"},{"$f":"Properties!K97","v":0},{"$f":"Properties!AD97","v":"NA"},{"$f":"Properties!AE97","v":"NA"},{"$f":"IF(Properties!$L97=0,\"\",Properties!$L97)","v":""},{"$f":"IF(Properties!$L98=0,\"\",Properties!$L98)","v":""},{"$f":"IF(Properties!$L99=0,\"\",Properties!$L99)","v":""},{"$f":"IF(Properties!$L100=0,\"\",Properties!$L100)","v":""},{"$f":"IF(Properties!AF97=0,\"\",Properties!AF97)","v":"NA"},{"$f":"Properties!AG97","v":"NA"},{"$f":"Properties!AH97","v":"NA"},{"$f":"Properties!AI97","v":"NA"},{"$f":"IF(Properties!X97=0,\"\",Properties!X97)","v":""},{"$f":"IF(Properties!N97=0,\"\",Properties!N97)","v":""},{"$f":"Properties!AJ97","v":"NA"},{"$f":"Properties!AK97","v":"NA"},{"$f":"IF(Properties!O97=0,\"\",Properties!O97)","v":""},{"$f":"Properties!AL97","v":"NA"},{"$f":"Properties!AM97","v":"NA"},{"$f":"IF(Properties!P97=0,\"\",Properties!P97)","v":""},{"$f":"Properties!AN97","v":"NA"},{"$f":"Properties!AO97","v":"NA"},{"$f":"IF(Properties!$Q97=0,\"\",Properties!$Q97)","v":""},{"$f":"IF(Properties!$Q98=0,\"\",Properties!$Q98)","v":""},{"$f":"IF(Properties!$Q99=0,\"\",Properties!$Q99)","v":""},{"$f":"IF(Properties!$Q100=0,\"\",Properties!$Q100)","v":""},{"$f":"IF(Properties!AP97=0,\"\",Properties!AP97)","v":"NA"},{"$f":"Properties!AQ97","v":"NA"},{"$f":"Properties!AR97","v":"NA"},{"$f":"Properties!AS97","v":"NA"},{"$f":"IF(Properties!Y97=0,\"\",Properties!Y97)","v":""},{"$f":"IF(Properties!S97=0,\"\",Properties!S97)","v":""},{"$f":"Properties!AT97","v":"NA"},{"$f":"Properties!AU97","v":"NA"},{"$f":"IF(Properties!T97=0,\"\",Properties!T97)","v":""},{"$f":"Properties!AV97","v":"NA"},{"$f":"Properties!AW97","v":"NA"},{"$f":"IF(Properties!U97=0,\"\",Properties!U97)","v":""},{"$f":"Properties!AX97","v":"NA"},{"$f":"Properties!AY97","v":"NA"},{"$f":"IF(Properties!$V97=0,\"\",Properties!$V97)","v":""},{"$f":"IF(Properties!$V98=0,\"\",Properties!$V98)","v":""},{"$f":"IF(Properties!$V99=0,\"\",Properties!$V99)","v":""},{"$f":"IF(Properties!$V100=0,\"\",Properties!$V100)","v":""},{"$f":"IF(Properties!W97=0,\"\",Properties!W97)","v":""},{"$f":"Properties!BA97","v":"NA"},{"$f":"Properties!BB97","v":"NA"},{"$f":"Properties!BC97","v":"NA"}]
[null,{"$f":"IF(Menu!$C$5=0,\"\",Menu!$C$5)","v":""},{"$f":"IF(Menu!$C$6=0,\"\",Menu!$C$6)","v":""},{"$f":"IF(Menu!$C$7=0,\"\",Menu!$C$7)","v":""},{"$f":"IF(Menu!$C$8=0,\"\",Menu!$C$8)","v":""},{"$f":"IF(Menu!$C$9=0,\"\",Menu!$C$9)","v":""},{"$f":"IF(Menu!$C$10=0,\"\",Menu!$C$10)","v":""},{"$f":"IF(Menu!$F$7=0,\"\",Menu!$F$7)","v":"Std QA"},{"$f":"IF(Menu!$F$5=0,\"\",Menu!$F$5)","v":"2E03"},{"$f":"IF(Menu!$F$8=0,\"\",Menu!$F$8)","v":"Ignition"},{"$f":"IF(Properties!D101=0,\"\",Properties!D101)","v":""},{"$f":"IF(Properties!$G$5=0,\"\",Properties!$G$5)","v":"No"},{"$f":"IF(Properties!$C$9=0,\"\",Properties!$C$9)","v":""},{"$f":"IF(Properties!$G$3=0,\"\",Properties!$G$3)","v":""},{"$f":"IF(Properties!$G$4=0,\"\",Properties!$G$4)","v":"10-03"},{"$f":"IF(Properties!E101=0,\"\",Properties!E101)","v":23},{"$f":"IF(Properties!G101=0,\"\",Properties!G101)","v":""},{"$f":"IF(Menu!$G$17=0,\"\",Menu!$G$17)","v":92},{"$f":"IF(Properties!H101=0,\"\",Properties!H101)","v":""},{"$f":"IF(Properties!$R$4=0,\"\",Properties!$R$4)","v":3},{"$f":"IF(Properties!I101=0,\"\",Properties!I101)","v":""},{"$f":"Properties!Z101","v":"NA"},{"$f":"Properties!AA101","v":"NA"},{"$f":"IF(Properties!J101=0,\"\",Properties!J101)","v":""},{"$f":"Properties!AB101","v":"NA"},{"$f":"Properties!AC101","v":"NA"},{"$f":"Properties!K101","v":0},{"$f":"Properties!AD101","v":"NA"},{"$f":"Properties!AE101","v":"NA"},{"$f":"IF(Properties!$L101=0,\"\",Properties!$L101)","v":""},{"$f":"IF(Properties!$L102=0,\"\",Properties!$L102)","v":""},{"$f":"IF(Properties!$L103=0,\"\",Properties!$L103)","v":""},{"$f":"IF(Properties!$L104=0,\"\",Properties!$L104)","v":""},{"$f":"IF(Properties!AF101=0,\"\",Properties!AF101)","v":"NA"},{"$f":"Properties!AG101","v":"NA"},{"$f":"Properties!AH101","v":"NA"},{"$f":"Properties!AI101","v":"NA"},{"$f":"IF(Properties!X101=0,\"\",Properties!X101)","v":""},{"$f":"IF(Properties!N101=0,\"\",Properties!N101)","v":""},{"$f":"Properties!AJ101","v":"NA"},{"$f":"Properties!AK101","v":"NA"},{"$f":"IF(Properties!O101=0,\"\",Properties!O101)","v":""},{"$f":"Properties!AL101","v":"NA"},{"$f":"Properties!AM101","v":"NA"},{"$f":"IF(Properties!P101=0,\"\",Properties!P101)","v":""},{"$f":"Properties!AN101","v":"NA"},{"$f":"Properties!AO101","v":"NA"},{"$f":"IF(Properties!$Q101=0,\"\",Properties!$Q101)","v":""},{"$f":"IF(Properties!$Q102=0,\"\",Properties!$Q102)","v":""},{"$f":"IF(Properties!$Q103=0,\"\",Properties!$Q103)","v":""},{"$f":"IF(Properties!$Q104=0,\"\",Properties!$Q104)","v":""},{"$f":"IF(Properties!AP101=0,\"\",Properties!AP101)","v":"NA"},{"$f":"Properties!AQ101","v":"NA"},{"$f":"Properties!AR101","v":"NA"},{"$f":"Properties!AS101","v":"NA"},{"$f":"IF(Properties!Y101=0,\"\",Properties!Y101)","v":""},{"$f":"IF(Properties!S101=0,\"\",Properties!S101)","v":""},{"$f":"Properties!AT101","v":"NA"},{"$f":"Properties!AU101","v":"NA"},{"$f":"IF(Properties!T101=0,\"\",Properties!T101)","v":""},{"$f":"Properties!AV101","v":"NA"},{"$f":"Properties!AW101","v":"NA"},{"$f":"IF(Properties!U101=0,\"\",Properties!U101)","v":""},{"$f":"Properties!AX101","v":"NA"},{"$f":"Properties!AY101","v":"NA"},{"$f":"IF(Properties!$V101=0,\"\",Properties!$V101)","v":""},{"$f":"IF(Properties!$V102=0,\"\",Properties!$V102)","v":""},{"$f":"IF(Properties!$V103=0,\"\",Properties!$V103)","v":""},{"$f":"IF(Properties!$V104=0,\"\",Properties!$V104)","v":""},{"$f":"IF(Properties!W101=0,\"\",Properties!W101)","v":""},{"$f":"Properties!BA101","v":"NA"},{"$f":"Properties!BB101","v":"NA"},{"$f":"Properties!BC101","v":"NA"}]
[null,{"$f":"IF(Menu!$C$5=0,\"\",Menu!$C$5)","v":""},{"$f":"IF(Menu!$C$6=0,\"\",Menu!$C$6)","v":""},{"$f":"IF(Menu!$C$7=0,\"\",Menu!$C$7)","v":""},{"$f":"IF(Menu!$C$8=0,\"\",Menu!$C$8)","v":""},{"$f":"IF(Menu!$C$9=0,\"\",Menu!$C$9)","v":""},{"$f":"IF(Menu!$C$10=0,\"\",Menu!$C$10)","v":""},{"$f":"IF(Menu!$F$7=0,\"\",Menu!$F$7)","v":"Std QA"},{"$f":"IF(Menu!$F$5=0,\"\",Menu!$F$5)","v":"2E03"},{"$f":"IF(Menu!$F$8=0,\"\",Menu!$F$8)","v":"Ignition"},{"$f":"IF(Properties!D105=0,\"\",Properties!D105)","v":""},{"$f":"IF(Properties!$G$5=0,\"\",Properties!$G$5)","v":"No"},{"$f":"IF(Properties!$C$9=0,\"\",Properties!$C$9)","v":""},{"$f":"IF(Properties!$G$3=0,\"\",Properties!$G$3)","v":""},{"$f":"IF(Properties!$G$4=0,\"\",Properties!$G$4)","v":"10-03"},{"$f":"IF(Properties!E105=0,\"\",Properties!E105)","v":24},{"$f":"IF(Properties!G105=0,\"\",Properties!G105)","v":""},{"$f":"IF(Menu!$G$17=0,\"\",Menu!$G$17)","v":92},{"$f":"IF(Properties!H105=0,\"\",Properties!H105)","v":""},{"$f":"IF(Properties!$R$4=0,\"\",Properties!$R$4)","v":3},{"$f":"IF(Properties!I105=0,\"\",Properties!I105)","v":""},{"$f":"Properties!Z105","v":"NA"},{"$f":"Properties!AA105","v":"NA"},{"$f":"IF(Properties!J105=0,\"\",Properties!J105)","v":""},{"$f":"Properties!AB105","v":"NA"},{"$f":"Properties!AC105","v":"NA"},{"$f":"Properties!K105","v":0},{"$f":"Properties!AD105","v":"NA"},{"$f":"Properties!AE105","v":"NA"},{"$f":"IF(Properties!$L105=0,\"\",Properties!$L105)","v":""},{"$f":"IF(Properties!$L106=0,\"\",Properties!$L106)","v":""},{"$f":"IF(Properties!$L107=0,\"\",Properties!$L107)","v":""},{"$f":"IF(Properties!$L108=0,\"\",Properties!$L108)","v":""},{"$f":"IF(Properties!AF105=0,\"\",Properties!AF105)","v":"NA"},{"$f":"Properties!AG105","v":"NA"},{"$f":"Properties!AH105","v":"NA"},{"$f":"Properties!AI105","v":"NA"},{"$f":"IF(Properties!X105=0,\"\",Properties!X105)","v":""},{"$f":"IF(Properties!N105=0,\"\",Properties!N105)","v":""},{"$f":"Properties!AJ105","v":"NA"},{"$f":"Properties!AK105","v":"NA"},{"$f":"IF(Properties!O105=0,\"\",Properties!O105)","v":""},{"$f":"Properties!AL105","v":"NA"},{"$f":"Properties!AM105","v":"NA"},{"$f":"IF(Properties!P105=0,\"\",Properties!P105)","v":""},{"$f":"Properties!AN105","v":"NA"},{"$f":"Properties!AO105","v":"NA"},{"$f":"IF(Properties!$Q105=0,\"\",Properties!$Q105)","v":""},{"$f":"IF(Properties!$Q106=0,\"\",Properties!$Q106)","v":""},{"$f":"IF(Properties!$Q107=0,\"\",Properties!$Q107)","v":""},{"$f":"IF(Properties!$Q108=0,\"\",Properties!$Q108)","v":""},{"$f":"IF(Properties!AP105=0,\"\",Properties!AP105)","v":"NA"},{"$f":"Properties!AQ105","v":"NA"},{"$f":"Properties!AR105","v":"NA"},{"$f":"Properties!AS105","v":"NA"},{"$f":"IF(Properties!Y105=0,\"\",Properties!Y105)","v":""},{"$f":"IF(Properties!S105=0,\"\",Properties!S105)","v":""},{"$f":"Properties!AT105","v":"NA"},{"$f":"Properties!AU105","v":"NA"},{"$f":"IF(Properties!T105=0,\"\",Properties!T105)","v":""},{"$f":"Properties!AV105","v":"NA"},{"$f":"Properties!AW105","v":"NA"},{"$f":"IF(Properties!U105=0,\"\",Properties!U105)","v":""},{"$f":"Properties!AX105","v":"NA"},{"$f":"Properties!AY105","v":"NA"},{"$f":"IF(Properties!$V105=0,\"\",Properties!$V105)","v":""},{"$f":"IF(Properties!$V106=0,\"\",Properties!$V106)","v":""},{"$f":"IF(Properties!$V107=0,\"\",Properties!$V107)","v":""},{"$f":"IF(Properties!$V108=0,\"\",Properties!$V108)","v":""},{"$f":"IF(Properties!W105=0,\"\",Properties!W105)","v":""},{"$f":"Properties!BA105","v":"NA"},{"$f":"Properties!BB105","v":"NA"},{"$f":"Properties!BC105","v":"NA"}]
[null,{"$f":"IF(Menu!$C$5=0,\"\",Menu!$C$5)","v":""},{"$f":"IF(Menu!$C$6=0,\"\",Menu!$C$6)","v":""},{"$f":"IF(Menu!$C$7=0,\"\",Menu!$C$7)","v":""},{"$f":"IF(Menu!$C$8=0,\"\",Menu!$C$8)","v":""},{"$f":"IF(Menu!$C$9=0,\"\",Menu!$C$9)","v":""},{"$f":"IF(Menu!$C$10=0,\"\",Menu!$C$10)","v":""},{"$f":"IF(Menu!$F$7=0,\"\",Menu!$F$7)","v":"Std QA"},{"$f":"IF(Menu!$F$5=0,\"\",Menu!$F$5)","v":"2E03"},{"$f":"IF(Menu!$F$8=0,\"\",Menu!$F$8)","v":"Ignition"},{"$f":"IF(Properties!D109=0,\"\",Properties!D109)","v":""},{"$f":"IF(Properties!$G$5=0,\"\",Properties!$G$5)","v":"No"},{"$f":"IF(Properties!$C$9=0,\"\",Properties!$C$9)","v":""},{"$f":"IF(Properties!$G$3=0,\"\",Properties!$G$3)","v":""},{"$f":"IF(Properties!$G$4=0,\"\",Properties!$G$4)","v":"10-03"},{"$f":"IF(Properties!E109=0,\"\",Properties!E109)","v":25},{"$f":"IF(Properties!G109=0,\"\",Properties!G109)","v":""},{"$f":"IF(Menu!$G$17=0,\"\",Menu!$G$17)","v":92},{"$f":"IF(Properties!H109=0,\"\",Properties!H109)","v":""},{"$f":"IF(Properties!$R$4=0,\"\",Properties!$R$4)","v":3},{"$f":"IF(Properties!I109=0,\"\",Properties!I109)","v":""},{"$f":"Properties!Z109","v":"NA"},{"$f":"Properties!AA109","v":"NA"},{"$f":"IF(Properties!J109=0,\"\",Properties!J109)","v":""},{"$f":"Properties!AB109","v":"NA"},{"$f":"Properties!AC109","v":"NA"},{"$f":"Properties!K109","v":0},{"$f":"Properties!AD109","v":"NA"},{"$f":"Properties!AE109","v":"NA"},{"$f":"IF(Properties!$L109=0,\"\",Properties!$L109)","v":""},{"$f":"IF(Properties!$L110=0,\"\",Properties!$L110)","v":""},{"$f":"IF(Properties!$L111=0,\"\",Properties!$L111)","v":""},{"$f":"IF(Properties!$L112=0,\"\",Properties!$L112)","v":""},{"$f":"IF(Properties!AF109=0,\"\",Properties!AF109)","v":"NA"},{"$f":"Properties!AG109","v":"NA"},{"$f":"Properties!AH109","v":"NA"},{"$f":"Properties!AI109","v":"NA"},{"$f":"IF(Properties!X109=0,\"\",Properties!X109)","v":""},{"$f":"IF(Properties!N109=0,\"\",Properties!N109)","v":""},{"$f":"Properties!AJ109","v":"NA"},{"$f":"Properties!AK109","v":"NA"},{"$f":"IF(Properties!O109=0,\"\",Properties!O109)","v":""},{"$f":"Properties!AL109","v":"NA"},{"$f":"Properties!AM109","v":"NA"},{"$f":"IF(Properties!P109=0,\"\",Properties!P109)","v":""},{"$f":"Properties!AN109","v":"NA"},{"$f":"Properties!AO109","v":"NA"},{"$f":"IF(Properties!$Q109=0,\"\",Properties!$Q109)","v":""},{"$f":"IF(Properties!$Q110=0,\"\",Properties!$Q110)","v":""},{"$f":"IF(Properties!$Q111=0,\"\",Properties!$Q111)","v":""},{"$f":"IF(Properties!$Q112=0,\"\",Properties!$Q112)","v":""},{"$f":"IF(Properties!AP109=0,\"\",Properties!AP109)","v":"NA"},{"$f":"Properties!AQ109","v":"NA"},{"$f":"Properties!AR109","v":"NA"},{"$f":"Properties!AS109","v":"NA"},{"$f":"IF(Properties!Y109=0,\"\",Properties!Y109)","v":""},{"$f":"IF(Properties!S109=0,\"\",Properties!S109)","v":""},{"$f":"Properties!AT109","v":"NA"},{"$f":"Properties!AU109","v":"NA"},{"$f":"IF(Properties!T109=0,\"\",Properties!T109)","v":""},{"$f":"Properties!AV109","v":"NA"},{"$f":"Properties!AW109","v":"NA"},{"$f":"IF(Properties!U109=0,\"\",Properties!U109)","v":""},{"$f":"Properties!AX109","v":"NA"},{"$f":"Properties!AY109","v":"NA"},{"$f":"IF(Properties!$V109=0,\"\",Properties!$V109)","v":""},{"$f":"IF(Properties!$V110=0,\"\",Properties!$V110)","v":""},{"$f":"IF(Properties!$V111=0,\"\",Properties!$V111)","v":""},{"$f":"IF(Properties!$V112=0,\"\",Properties!$V112)","v":""},{"$f":"IF(Properties!W109=0,\"\",Properties!W109)","v":""},{"$f":"Properties!BA109","v":"NA"},{"$f":"Properties!BB109","v":"NA"},{"$f":"Properties!BC109","v":"NA"}]
[null,{"$f":"IF(Menu!$C$5=0,\"\",Menu!$C$5)","v":""},{"$f":"IF(Menu!$C$6=0,\"\",Menu!$C$6)","v":""},{"$f":"IF(Menu!$C$7=0,\"\",Menu!$C$7)","v":""},{"$f":"IF(Menu!$C$8=0,\"\",Menu!$C$8)","v":""},{"$f":"IF(Menu!$C$9=0,\"\",Menu!$C$9)","v":""},{"$f":"IF(Menu!$C$10=0,\"\",Menu!$C$10)","v":""},{"$f":"IF(Menu!$F$7=0,\"\",Menu!$F$7)","v":"Std QA"},{"$f":"IF(Menu!$F$5=0,\"\",Menu!$F$5)","v":"2E03"},{"$f":"IF(Menu!$F$8=0,\"\",Menu!$F$8)","v":"Ignition"},{"$f":"IF(Properties!D113=0,\"\",Properties!D113)","v":""},{"$f":"IF(Properties!$G$5=0,\"\",Properties!$G$5)","v":"No"},{"$f":"IF(Properties!$C$9=0,\"\",Properties!$C$9)","v":""},{"$f":"IF(Properties!$G$3=0,\"\",Properties!$G$3)","v":""},{"$f":"IF(Properties!$G$4=0,\"\",Properties!$G$4)","v":"10-03"},{"$f":"IF(Properties!E113=0,\"\",Properties!E113)","v":26},{"$f":"IF(Properties!G113=0,\"\",Properties!G113)","v":""},{"$f":"IF(Menu!$G$17=0,\"\",Menu!$G$17)","v":92},{"$f":"IF(Properties!H113=0,\"\",Properties!H113)","v":""},{"$f":"IF(Properties!$R$4=0,\"\",Properties!$R$4)","v":3},{"$f":"IF(Properties!I113=0,\"\",Properties!I113)","v":""},{"$f":"Properties!Z113","v":"NA"},{"$f":"Properties!AA113","v":"NA"},{"$f":"IF(Properties!J113=0,\"\",Properties!J113)","v":""},{"$f":"Properties!AB113","v":"NA"},{"$f":"Properties!AC113","v":"NA"},{"$f":"Properties!K113","v":0},{"$f":"Properties!AD113","v":"NA"},{"$f":"Properties!AE113","v":"NA"},{"$f":"IF(Properties!$L113=0,\"\",Properties!$L113)","v":""},{"$f":"IF(Properties!$L114=0,\"\",Properties!$L114)","v":""},{"$f":"IF(Properties!$L115=0,\"\",Properties!$L115)","v":""},{"$f":"IF(Properties!$L116=0,\"\",Properties!$L116)","v":""},{"$f":"IF(Properties!AF113=0,\"\",Properties!AF113)","v":"NA"},{"$f":"Properties!AG113","v":"NA"},{"$f":"Properties!AH113","v":"NA"},{"$f":"Properties!AI113","v":"NA"},{"$f":"IF(Properties!X113=0,\"\",Properties!X113)","v":""},{"$f":"IF(Properties!N113=0,\"\",Properties!N113)","v":""},{"$f":"Properties!AJ113","v":"NA"},{"$f":"Properties!AK113","v":"NA"},{"$f":"IF(Properties!O113=0,\"\",Properties!O113)","v":""},{"$f":"Properties!AL113","v":"NA"},{"$f":"Properties!AM113","v":"NA"},{"$f":"IF(Properties!P113=0,\"\",Properties!P113)","v":""},{"$f":"Properties!AN113","v":"NA"},{"$f":"Properties!AO113","v":"NA"},{"$f":"IF(Properties!$Q113=0,\"\",Properties!$Q113)","v":""},{"$f":"IF(Properties!$Q114=0,\"\",Properties!$Q114)","v":""},{"$f":"IF(Properties!$Q115=0,\"\",Properties!$Q115)","v":""},{"$f":"IF(Properties!$Q116=0,\"\",Properties!$Q116)","v":""},{"$f":"IF(Properties!AP113=0,\"\",Properties!AP113)","v":"NA"},{"$f":"Properties!AQ113","v":"NA"},{"$f":"Properties!AR113","v":"NA"},{"$f":"Properties!AS113","v":"NA"},{"$f":"IF(Properties!Y113=0,\"\",Properties!Y113)","v":""},{"$f":"IF(Properties!S113=0,\"\",Properties!S113)","v":""},{"$f":"Properties!AT113","v":"NA"},{"$f":"Properties!AU113","v":"NA"},{"$f":"IF(Properties!T113=0,\"\",Properties!T113)","v":""},{"$f":"Properties!AV113","v":"NA"},{"$f":"Properties!AW113","v":"NA"},{"$f":"IF(Properties!U113=0,\"\",Properties!U113)","v":""},{"$f":"Properties!AX113","v":"NA"},{"$f":"Properties!AY113","v":"NA"},{"$f":"IF(Properties!$V113=0,\"\",Properties!$V113)","v":""},{"$f":"IF(Properties!$V114=0,\"\",Properties!$V114)","v":""},{"$f":"IF(Properties!$V115=0,\"\",Properties!$V115)","v":""},{"$f":"IF(Properties!$V116=0,\"\",Properties!$V116)","v":""},{"$f":"IF(Properties!W113=0,\"\",Properties!W113)","v":""},{"$f":"Properties!BA113","v":"NA"},{"$f":"Properties!BB113","v":"NA"},{"$f":"Properties!BC113","v":"NA"}]
[null,{"$f":"IF(Menu!$C$5=0,\"\",Menu!$C$5)","v":""},{"$f":"IF(Menu!$C$6=0,\"\",Menu!$C$6)","v":""},{"$f":"IF(Menu!$C$7=0,\"\",Menu!$C$7)","v":""},{"$f":"IF(Menu!$C$8=0,\"\",Menu!$C$8)","v":""},{"$f":"IF(Menu!$C$9=0,\"\",Menu!$C$9)","v":""},{"$f":"IF(Menu!$C$10=0,\"\",Menu!$C$10)","v":""},{"$f":"IF(Menu!$F$7=0,\"\",Menu!$F$7)","v":"Std QA"},{"$f":"IF(Menu!$F$5=0,\"\",Menu!$F$5)","v":"2E03"},{"$f":"IF(Menu!$F$8=0,\"\",Menu!$F$8)","v":"Ignition"},{"$f":"IF(Properties!D117=0,\"\",Properties!D117)","v":""},{"$f":"IF(Properties!$G$5=0,\"\",Properties!$G$5)","v":"No"},{"$f":"IF(Properties!$C$9=0,\"\",Properties!$C$9)","v":""},{"$f":"IF(Properties!$G$3=0,\"\",Properties!$G$3)","v":""},{"$f":"IF(Properties!$G$4=0,\"\",Properties!$G$4)","v":"10-03"},{"$f":"IF(Properties!E117=0,\"\",Properties!E117)","v":27},{"$f":"IF(Properties!G117=0,\"\",Properties!G117)","v":""},{"$f":"IF(Menu!$G$17=0,\"\",Menu!$G$17)","v":92},{"$f":"IF(Properties!H117=0,\"\",Properties!H117)","v":""},{"$f":"IF(Properties!$R$4=0,\"\",Properties!$R$4)","v":3},{"$f":"IF(Properties!I117=0,\"\",Properties!I117)","v":""},{"$f":"Properties!Z117","v":"NA"},{"$f":"Properties!AA117","v":"NA"},{"$f":"IF(Properties!J117=0,\"\",Properties!J117)","v":""},{"$f":"Properties!AB117","v":"NA"},{"$f":"Properties!AC117","v":"NA"},{"$f":"Properties!K117","v":0},{"$f":"Properties!AD117","v":"NA"},{"$f":"Properties!AE117","v":"NA"},{"$f":"IF(Properties!$L117=0,\"\",Properties!$L117)","v":""},{"$f":"IF(Properties!$L118=0,\"\",Properties!$L118)","v":""},{"$f":"IF(Properties!$L119=0,\"\",Properties!$L119)","v":""},{"$f":"IF(Properties!$L120=0,\"\",Properties!$L120)","v":""},{"$f":"IF(Properties!AF117=0,\"\",Properties!AF117)","v":"NA"},{"$f":"Properties!AG117","v":"NA"},{"$f":"Properties!AH117","v":"NA"},{"$f":"Properties!AI117","v":"NA"},{"$f":"IF(Properties!X117=0,\"\",Properties!X117)","v":""},{"$f":"IF(Properties!N117=0,\"\",Properties!N117)","v":""},{"$f":"Properties!AJ117","v":"NA"},{"$f":"Properties!AK117","v":"NA"},{"$f":"IF(Properties!O117=0,\"\",Properties!O117)","v":""},{"$f":"Properties!AL117","v":"NA"},{"$f":"Properties!AM117","v":"NA"},{"$f":"IF(Properties!P117=0,\"\",Properties!P117)","v":""},{"$f":"Properties!AN117","v":"NA"},{"$f":"Properties!AO117","v":"NA"},{"$f":"IF(Properties!$Q117=0,\"\",Properties!$Q117)","v":""},{"$f":"IF(Properties!$Q118=0,\"\",Properties!$Q118)","v":""},{"$f":"IF(Properties!$Q119=0,\"\",Properties!$Q119)","v":""},{"$f":"IF(Properties!$Q120=0,\"\",Properties!$Q120)","v":""},{"$f":"IF(Properties!AP117=0,\"\",Properties!AP117)","v":"NA"},{"$f":"Properties!AQ117","v":"NA"},{"$f":"Properties!AR117","v":"NA"},{"$f":"Properties!AS117","v":"NA"},{"$f":"IF(Properties!Y117=0,\"\",Properties!Y117)","v":""},{"$f":"IF(Properties!S117=0,\"\",Properties!S117)","v":""},{"$f":"Properties!AT117","v":"NA"},{"$f":"Properties!AU117","v":"NA"},{"$f":"IF(Properties!T117=0,\"\",Properties!T117)","v":""},{"$f":"Properties!AV117","v":"NA"},{"$f":"Properties!AW117","v":"NA"},{"$f":"IF(Properties!U117=0,\"\",Properties!U117)","v":""},{"$f":"Properties!AX117","v":"NA"},{"$f":"Properties!AY117","v":"NA"},{"$f":"IF(Properties!$V117=0,\"\",Properties!$V117)","v":""},{"$f":"IF(Properties!$V118=0,\"\",Properties!$V118)","v":""},{"$f":"IF(Properties!$V119=0,\"\",Properties!$V119)","v":""},{"$f":"IF(Properties!$V120=0,\"\",Properties!$V120)","v":""},{"$f":"IF(Properties!W117=0,\"\",Properties!W117)","v":""},{"$f":"Properties!BA117","v":"NA"},{"$f":"Properties!BB117","v":"NA"},{"$f":"Properties!BC117","v":"NA"}]
[null,{"$f":"IF(Menu!$C$5=0,\"\",Menu!$C$5)","v":""},{"$f":"IF(Menu!$C$6=0,\"\",Menu!$C$6)","v":""},{"$f":"IF(Menu!$C$7=0,\"\",Menu!$C$7)","v":""},{"$f":"IF(Menu!$C$8=0,\"\",Menu!$C$8)","v":""},{"$f":"IF(Menu!$C$9=0,\"\",Menu!$C$9)","v":""},{"$f":"IF(Menu!$C$10=0,\"\",Menu!$C$10)","v":""},{"$f":"IF(Menu!$F$7=0,\"\",Menu!$F$7)","v":"Std QA"},{"$f":"IF(Menu!$F$5=0,\"\",Menu!$F$5)","v":"2E03"},{"$f":"IF(Menu!$F$8=0,\"\",Menu!$F$8)","v":"Ignition"},{"$f":"IF(Properties!D121=0,\"\",Properties!D121)","v":""},{"$f":"IF(Properties!$G$5=0,\"\",Properties!$G$5)","v":"No"},{"$f":"IF(Properties!$C$9=0,\"\",Properties!$C$9)","v":""},{"$f":"IF(Properties!$G$3=0,\"\",Properties!$G$3)","v":""},{"$f":"IF(Properties!$G$4=0,\"\",Properties!$G$4)","v":"10-03"},{"$f":"IF(Properties!E121=0,\"\",Properties!E121)","v":28},{"$f":"IF(Properties!G121=0,\"\",Properties!G121)","v":""},{"$f":"IF(Menu!$G$17=0,\"\",Menu!$G$17)","v":92},{"$f":"IF(Properties!H121=0,\"\",Properties!H121)","v":""},{"$f":"IF(Properties!$R$4=0,\"\",Properties!$R$4)","v":3},{"$f":"IF(Properties!I121=0,\"\",Properties!I121)","v":""},{"$f":"Properties!Z121","v":"NA"},{"$f":"Properties!AA121","v":"NA"},{"$f":"IF(Properties!J121=0,\"\",Properties!J121)","v":""},{"$f":"Properties!AB121","v":"NA"},{"$f":"Properties!AC121","v":"NA"},{"$f":"Properties!K121","v":0},{"$f":"Properties!AD121","v":"NA"},{"$f":"Properties!AE121","v":"NA"},{"$f":"IF(Properties!$L121=0,\"\",Properties!$L121)","v":""},{"$f":"IF(Properties!$L122=0,\"\",Properties!$L122)","v":""},{"$f":"IF(Properties!$L123=0,\"\",Properties!$L123)","v":""},{"$f":"IF(Properties!$L124=0,\"\",Properties!$L124)","v":""},{"$f":"IF(Properties!AF121=0,\"\",Properties!AF121)","v":"NA"},{"$f":"Properties!AG121","v":"NA"},{"$f":"Properties!AH121","v":"NA"},{"$f":"Properties!AI121","v":"NA"},{"$f":"IF(Properties!X121=0,\"\",Properties!X121)","v":""},{"$f":"IF(Properties!N121=0,\"\",Properties!N121)","v":""},{"$f":"Properties!AJ121","v":"NA"},{"$f":"Properties!AK121","v":"NA"},{"$f":"IF(Properties!O121=0,\"\",Properties!O121)","v":""},{"$f":"Properties!AL121","v":"NA"},{"$f":"Properties!AM121","v":"NA"},{"$f":"IF(Properties!P121=0,\"\",Properties!P121)","v":""},{"$f":"Properties!AN121","v":"NA"},{"$f":"Properties!AO121","v":"NA"},{"$f":"IF(Properties!$Q121=0,\"\",Properties!$Q121)","v":""},{"$f":"IF(Properties!$Q122=0,\"\",Properties!$Q122)","v":""},{"$f":"IF(Properties!$Q123=0,\"\",Properties!$Q123)","v":""},{"$f":"IF(Properties!$Q124=0,\"\",Properties!$Q124)","v":""},{"$f":"IF(Properties!AP121=0,\"\",Properties!AP121)","v":"NA"},{"$f":"Properties!AQ121","v":"NA"},{"$f":"Properties!AR121","v":"NA"},{"$f":"Properties!AS121","v":"NA"},{"$f":"IF(Properties!Y121=0,\"\",Properties!Y121)","v":""},{"$f":"IF(Properties!S121=0,\"\",Properties!S121)","v":""},{"$f":"Properties!AT121","v":"NA"},{"$f":"Properties!AU121","v":"NA"},{"$f":"IF(Properties!T121=0,\"\",Properties!T121)","v":""},{"$f":"Properties!AV121","v":"NA"},{"$f":"Properties!AW121","v":"NA"},{"$f":"IF(Properties!U121=0,\"\",Properties!U121)","v":""},{"$f":"Properties!AX121","v":"NA"},{"$f":"Properties!AY121","v":"NA"},{"$f":"IF(Properties!$V121=0,\"\",Properties!$V121)","v":""},{"$f":"IF(Properties!$V122=0,\"\",Properties!$V122)","v":""},{"$f":"IF(Properties!$V123=0,\"\",Properties!$V123)","v":""},{"$f":"IF(Properties!$V124=0,\"\",Properties!$V124)","v":""},{"$f":"IF(Properties!W121=0,\"\",Properties!W121)","v":""},{"$f":"Properties!BA121","v":"NA"},{"$f":"Properties!BB121","v":"NA"},{"$f":"Properties!BC121","v":"NA"}]
[null,{"$f":"IF(Menu!$C$5=0,\"\",Menu!$C$5)","v":""},{"$f":"IF(Menu!$C$6=0,\"\",Menu!$C$6)","v":""},{"$f":"IF(Menu!$C$7=0,\"\",Menu!$C$7)","v":""},{"$f":"IF(Menu!$C$8=0,\"\",Menu!$C$8)","v":""},{"$f":"IF(Menu!$C$9=0,\"\",Menu!$C$9)","v":""},{"$f":"IF(Menu!$C$10=0,\"\",Menu!$C$10)","v":""},{"$f":"IF(Menu!$F$7=0,\"\",Menu!$F$7)","v":"Std QA"},{"$f":"IF(Menu!$F$5=0,\"\",Menu!$F$5)","v":"2E03"},{"$f":"IF(Menu!$F$8=0,\"\",Menu!$F$8)","v":"Ignition"},{"$f":"IF(Properties!D125=0,\"\",Properties!D125)","v":""},{"$f":"IF(Properties!$G$5=0,\"\",Properties!$G$5)","v":"No"},{"$f":"IF(Properties!$C$9=0,\"\",Properties!$C$9)","v":""},{"$f":"IF(Properties!$G$3=0,\"\",Properties!$G$3)","v":""},{"$f":"IF(Properties!$G$4=0,\"\",Properties!$G$4)","v":"10-03"},{"$f":"IF(Properties!E125=0,\"\",Properties!E125)","v":29},{"$f":"IF(Properties!G125=0,\"\",Properties!G125)","v":""},{"$f":"IF(Menu!$G$17=0,\"\",Menu!$G$17)","v":92},{"$f":"IF(Properties!H125=0,\"\",Properties!H125)","v":""},{"$f":"IF(Properties!$R$4=0,\"\",Properties!$R$4)","v":3},{"$f":"IF(Properties!I125=0,\"\",Properties!I125)","v":""},{"$f":"Properties!Z125","v":"NA"},{"$f":"Properties!AA125","v":"NA"},{"$f":"IF(Properties!J125=0,\"\",Properties!J125)","v":""},{"$f":"Properties!AB125","v":"NA"},{"$f":"Properties!AC125","v":"NA"},{"$f":"Properties!K125","v":0},{"$f":"Properties!AD125","v":"NA"},{"$f":"Properties!AE125","v":"NA"},{"$f":"IF(Properties!$L125=0,\"\",Properties!$L125)","v":""},{"$f":"IF(Properties!$L126=0,\"\",Properties!$L126)","v":""},{"$f":"IF(Properties!$L127=0,\"\",Properties!$L127)","v":""},{"$f":"IF(Properties!$L128=0,\"\",Properties!$L128)","v":""},{"$f":"IF(Properties!AF125=0,\"\",Properties!AF125)","v":"NA"},{"$f":"Properties!AG125","v":"NA"},{"$f":"Properties!AH125","v":"NA"},{"$f":"Properties!AI125","v":"NA"},{"$f":"IF(Properties!X125=0,\"\",Properties!X125)","v":""},{"$f":"IF(Properties!N125=0,\"\",Properties!N125)","v":""},{"$f":"Properties!AJ125","v":"NA"},{"$f":"Properties!AK125","v":"NA"},{"$f":"IF(Properties!O125=0,\"\",Properties!O125)","v":""},{"$f":"Properties!AL125","v":"NA"},{"$f":"Properties!AM125","v":"NA"},{"$f":"IF(Properties!P125=0,\"\",Properties!P125)","v":""},{"$f":"Properties!AN125","v":"NA"},{"$f":"Properties!AO125","v":"NA"},{"$f":"IF(Properties!$Q125=0,\"\",Properties!$Q125)","v":""},{"$f":"IF(Properties!$Q126=0,\"\",Properties!$Q126)","v":""},{"$f":"IF(Properties!$Q127=0,\"\",Properties!$Q127)","v":""},{"$f":"IF(Properties!$Q128=0,\"\",Properties!$Q128)","v":""},{"$f":"IF(Properties!AP125=0,\"\",Properties!AP125)","v":"NA"},{"$f":"Properties!AQ125","v":"NA"},{"$f":"Properties!AR125","v":"NA"},{"$f":"Properties!AS125","v":"NA"},{"$f":"IF(Properties!Y125=0,\"\",Properties!Y125)","v":""},{"$f":"IF(Properties!S125=0,\"\",Properties!S125)","v":""},{"$f":"Properties!AT125","v":"NA"},{"$f":"Properties!AU125","v":"NA"},{"$f":"IF(Properties!T125=0,\"\",Properties!T125)","v":""},{"$f":"Properties!AV125","v":"NA"},{"$f":"Properties!AW125","v":"NA"},{"$f":"IF(Properties!U125=0,\"\",Properties!U125)","v":""},{"$f":"Properties!AX125","v":"NA"},{"$f":"Properties!AY125","v":"NA"},{"$f":"IF(Properties!$V125=0,\"\",Properties!$V125)","v":""},{"$f":"IF(Properties!$V126=0,\"\",Properties!$V126)","v":""},{"$f":"IF(Properties!$V127=0,\"\",Properties!$V127)","v":""},{"$f":"IF(Properties!$V128=0,\"\",Properties!$V128)","v":""},{"$f":"IF(Properties!W125=0,\"\",Properties!W125)","v":""},{"$f":"Properties!BA125","v":"NA"},{"$f":"Properties!BB125","v":"NA"},{"$f":"Properties!BC125","v":"NA"}]
[null,{"$f":"IF(Menu!$C$5=0,\"\",Menu!$C$5)","v":""},{"$f":"IF(Menu!$C$6=0,\"\",Menu!$C$6)","v":""},{"$f":"IF(Menu!$C$7=0,\"\",Menu!$C$7)","v":""},{"$f":"IF(Menu!$C$8=0,\"\",Menu!$C$8)","v":""},{"$f":"IF(Menu!$C$9=0,\"\",Menu!$C$9)","v":""},{"$f":"IF(Menu!$C$10=0,\"\",Menu!$C$10)","v":""},{"$f":"IF(Menu!$F$7=0,\"\",Menu!$F$7)","v":"Std QA"},{"$f":"IF(Menu!$F$5=0,\"\",Menu!$F$5)","v":"2E03"},{"$f":"IF(Menu!$F$8=0,\"\",Menu!$F$8)","v":"Ignition"},{"$f":"IF(Properties!D129=0,\"\",Properties!D129)","v":""},{"$f":"IF(Properties!$G$5=0,\"\",Properties!$G$5)","v":"No"},{"$f":"IF(Properties!$C$9=0,\"\",Properties!$C$9)","v":""},{"$f":"IF(Properties!$G$3=0,\"\",Properties!$G$3)","v":""},{"$f":"IF(Properties!$G$4=0,\"\",Properties!$G$4)","v":"10-03"},{"$f":"IF(Properties!E129=0,\"\",Properties!E129)","v":30},{"$f":"IF(Properties!G129=0,\"\",Properties!G129)","v":""},{"$f":"IF(Menu!$G$17=0,\"\",Menu!$G$17)","v":92},{"$f":"IF(Properties!H129=0,\"\",Properties!H129)","v":""},{"$f":"IF(Properties!$R$4=0,\"\",Properties!$R$4)","v":3},{"$f":"IF(Properties!I129=0,\"\",Properties!I129)","v":""},{"$f":"Properties!Z129","v":"NA"},{"$f":"Properties!AA129","v":"NA"},{"$f":"IF(Properties!J129=0,\"\",Properties!J129)","v":""},{"$f":"Properties!AB129","v":"NA"},{"$f":"Properties!AC129","v":"NA"},{"$f":"Properties!K129","v":0},{"$f":"Properties!AD129","v":"NA"},{"$f":"Properties!AE129","v":"NA"},{"$f":"IF(Properties!$L129=0,\"\",Properties!$L129)","v":""},{"$f":"IF(Properties!$L130=0,\"\",Properties!$L130)","v":""},{"$f":"IF(Properties!$L131=0,\"\",Properties!$L131)","v":""},{"$f":"IF(Properties!$L132=0,\"\",Properties!$L132)","v":""},{"$f":"IF(Properties!AF129=0,\"\",Properties!AF129)","v":"NA"},{"$f":"Properties!AG129","v":"NA"},{"$f":"Properties!AH129","v":"NA"},{"$f":"Properties!AI129","v":"NA"},{"$f":"IF(Properties!X129=0,\"\",Properties!X129)","v":""},{"$f":"IF(Properties!N129=0,\"\",Properties!N129)","v":""},{"$f":"Properties!AJ129","v":"NA"},{"$f":"Properties!AK129","v":"NA"},{"$f":"IF(Properties!O129=0,\"\",Properties!O129)","v":""},{"$f":"Properties!AL129","v":"NA"},{"$f":"Properties!AM129","v":"NA"},{"$f":"IF(Properties!P129=0,\"\",Properties!P129)","v":""},{"$f":"Properties!AN129","v":"NA"},{"$f":"Properties!AO129","v":"NA"},{"$f":"IF(Properties!$Q129=0,\"\",Properties!$Q129)","v":""},{"$f":"IF(Properties!$Q130=0,\"\",Properties!$Q130)","v":""},{"$f":"IF(Properties!$Q131=0,\"\",Properties!$Q131)","v":""},{"$f":"IF(Properties!$Q132=0,\"\",Properties!$Q132)","v":""},{"$f":"IF(Properties!AP129=0,\"\",Properties!AP129)","v":"NA"},{"$f":"Properties!AQ129","v":"NA"},{"$f":"Properties!AR129","v":"NA"},{"$f":"Properties!AS129","v":"NA"},{"$f":"IF(Properties!Y129=0,\"\",Properties!Y129)","v":""},{"$f":"IF(Properties!S129=0,\"\",Properties!S129)","v":""},{"$f":"Properties!AT129","v":"NA"},{"$f":"Properties!AU129","v":"NA"},{"$f":"IF(Properties!T129=0,\"\",Properties!T129)","v":""},{"$f":"Properties!AV129","v":"NA"},{"$f":"Properties!AW129","v":"NA"},{"$f":"IF(Properties!U129=0,\"\",Properties!U129)","v":""},{"$f":"Properties!AX129","v":"NA"},{"$f":"Properties!AY129","v":"NA"},{"$f":"IF(Properties!$V129=0,\"\",Properties!$V129)","v":""},{"$f":"IF(Properties!$V130=0,\"\",Properties!$V130)","v":""},{"$f":"IF(Properties!$V131=0,\"\",Properties!$V131)","v":""},{"$f":"IF(Properties!$V132=0,\"\",Properties!$V132)","v":""},{"$f":"IF(Properties!W129=0,\"\",Properties!W129)","v":""},{"$f":"Properties!BA129","v":"NA"},{"$f":"Properties!BB129","v":"NA"},{"$f":"Properties!BC129","v":"NA"}]
[null,{"$f":"IF(Menu!$C$5=0,\"\",Menu!$C$5)","v":""},{"$f":"IF(Menu!$C$6=0,\"\",Menu!$C$6)","v":""},{"$f":"IF(Menu!$C$7=0,\"\",Menu!$C$7)","v":""},{"$f":"IF(Menu!$C$8=0,\"\",Menu!$C$8)","v":""},{"$f":"IF(Menu!$C$9=0,\"\",Menu!$C$9)","v":""},{"$f":"IF(Menu!$C$10=0,\"\",Menu!$C$10)","v":""},{"$f":"IF(Menu!$F$7=0,\"\",Menu!$F$7)","v":"Std QA"},{"$f":"IF(Menu!$F$5=0,\"\",Menu!$F$5)","v":"2E03"},{"$f":"IF(Menu!$F$8=0,\"\",Menu!$F$8)","v":"Ignition"},{"$f":"IF(Properties!D133=0,\"\",Properties!D133)","v":""},{"$f":"IF(Properties!$G$5=0,\"\",Properties!$G$5)","v":"No"},{"$f":"IF(Properties!$C$9=0,\"\",Properties!$C$9)","v":""},{"$f":"IF(Properties!$G$3=0,\"\",Properties!$G$3)","v":""},{"$f":"IF(Properties!$G$4=0,\"\",Properties!$G$4)","v":"10-03"},{"$f":"IF(Properties!E133=0,\"\",Properties!E133)","v":31},{"$f":"IF(Properties!G133=0,\"\",Properties!G133)","v":""},{"$f":"IF(Menu!$G$17=0,\"\",Menu!$G$17)","v":92},{"$f":"IF(Properties!H133=0,\"\",Properties!H133)","v":""},{"$f":"IF(Properties!$R$4=0,\"\",Properties!$R$4)","v":3},{"$f":"IF(Properties!I133=0,\"\",Properties!I133)","v":""},{"$f":"Properties!Z133","v":"NA"},{"$f":"Properties!AA133","v":"NA"},{"$f":"IF(Properties!J133=0,\"\",Properties!J133)","v":""},{"$f":"Properties!AB133","v":"NA"},{"$f":"Properties!AC133","v":"NA"},{"$f":"Properties!K133","v":0},{"$f":"Properties!AD133","v":"NA"},{"$f":"Properties!AE133","v":"NA"},{"$f":"IF(Properties!$L133=0,\"\",Properties!$L133)","v":""},{"$f":"IF(Properties!$L134=0,\"\",Properties!$L134)","v":""},{"$f":"IF(Properties!$L135=0,\"\",Properties!$L135)","v":""},{"$f":"IF(Properties!$L136=0,\"\",Properties!$L136)","v":""},{"$f":"IF(Properties!AF133=0,\"\",Properties!AF133)","v":"NA"},{"$f":"Properties!AG133","v":"NA"},{"$f":"Properties!AH133","v":"NA"},{"$f":"Properties!AI133","v":"NA"},{"$f":"IF(Properties!X133=0,\"\",Properties!X133)","v":""},{"$f":"IF(Properties!N133=0,\"\",Properties!N133)","v":""},{"$f":"Properties!AJ133","v":"NA"},{"$f":"Properties!AK133","v":"NA"},{"$f":"IF(Properties!O133=0,\"\",Properties!O133)","v":""},{"$f":"Properties!AL133","v":"NA"},{"$f":"Properties!AM133","v":"NA"},{"$f":"IF(Properties!P133=0,\"\",Properties!P133)","v":""},{"$f":"Properties!AN133","v":"NA"},{"$f":"Properties!AO133","v":"NA"},{"$f":"IF(Properties!$Q133=0,\"\",Properties!$Q133)","v":""},{"$f":"IF(Properties!$Q134=0,\"\",Properties!$Q134)","v":""},{"$f":"IF(Properties!$Q135=0,\"\",Properties!$Q135)","v":""},{"$f":"IF(Properties!$Q136=0,\"\",Properties!$Q136)","v":""},{"$f":"IF(Properties!AP133=0,\"\",Properties!AP133)","v":"NA"},{"$f":"Properties!AQ133","v":"NA"},{"$f":"Properties!AR133","v":"NA"},{"$f":"Properties!AS133","v":"NA"},{"$f":"IF(Properties!Y133=0,\"\",Properties!Y133)","v":""},{"$f":"IF(Properties!S133=0,\"\",Properties!S133)","v":""},{"$f":"Properties!AT133","v":"NA"},{"$f":"Properties!AU133","v":"NA"},{"$f":"IF(Properties!T133=0,\"\",Properties!T133)","v":""},{"$f":"Properties!AV133","v":"NA"},{"$f":"Properties!AW133","v":"NA"},{"$f":"IF(Properties!U133=0,\"\",Properties!U133)","v":""},{"$f":"Properties!AX133","v":"NA"},{"$f":"Properties!AY133","v":"NA"},{"$f":"IF(Properties!$V133=0,\"\",Properties!$V133)","v":""},{"$f":"IF(Properties!$V134=0,\"\",Properties!$V134)","v":""},{"$f":"IF(Properties!$V135=0,\"\",Properties!$V135)","v":""},{"$f":"IF(Properties!$V136=0,\"\",Properties!$V136)","v":""},{"$f":"IF(Properties!W133=0,\"\",Properties!W133)","v":""},{"$f":"Properties!BA133","v":"NA"},{"$f":"Properties!BB133","v":"NA"},{"$f":"Properties!BC133","v":"NA"}]
[null,{"$f":"IF(Menu!$C$5=0,\"\",Menu!$C$5)","v":""},{"$f":"IF(Menu!$C$6=0,\"\",Menu!$C$6)","v":""},{"$f":"IF(Menu!$C$7=0,\"\",Menu!$C$7)","v":""},{"$f":"IF(Menu!$C$8=0,\"\",Menu!$C$8)","v":""},{"$f":"IF(Menu!$C$9=0,\"\",Menu!$C$9)","v":""},{"$f":"IF(Menu!$C$10=0,\"\",Menu!$C$10)","v":""},{"$f":"IF(Menu!$F$7=0,\"\",Menu!$F$7)","v":"Std QA"},{"$f":"IF(Menu!$F$5=0,\"\",Menu!$F$5)","v":"2E03"},{"$f":"IF(Menu!$F$8=0,\"\",Menu!$F$8)","v":"Ignition"},{"$f":"IF(Properties!D137=0,\"\",Properties!D137)","v":""},{"$f":"IF(Properties!$G$5=0,\"\",Properties!$G$5)","v":"No"},{"$f":"IF(Properties!$C$9=0,\"\",Properties!$C$9)","v":""},{"$f":"IF(Properties!$G$3=0,\"\",Properties!$G$3)","v":""},{"$f":"IF(Properties!$G$4=0,\"\",Properties!$G$4)","v":"10-03"},{"$f":"IF(Properties!E137=0,\"\",Properties!E137)","v":32},{"$f":"IF(Properties!G137=0,\"\",Properties!G137)","v":""},{"$f":"IF(Menu!$G$17=0,\"\",Menu!$G$17)","v":92},{"$f":"IF(Properties!H137=0,\"\",Properties!H137)","v":""},{"$f":"IF(Properties!$R$4=0,\"\",Properties!$R$4)","v":3},{"$f":"IF(Properties!I137=0,\"\",Properties!I137)","v":""},{"$f":"Properties!Z137","v":"NA"},{"$f":"Properties!AA137","v":"NA"},{"$f":"IF(Properties!J137=0,\"\",Properties!J137)","v":""},{"$f":"Properties!AB137","v":"NA"},{"$f":"Properties!AC137","v":"NA"},{"$f":"Properties!K137","v":0},{"$f":"Properties!AD137","v":"NA"},{"$f":"Properties!AE137","v":"NA"},{"$f":"IF(Properties!$L137=0,\"\",Properties!$L137)","v":""},{"$f":"IF(Properties!$L138=0,\"\",Properties!$L138)","v":""},{"$f":"IF(Properties!$L139=0,\"\",Properties!$L139)","v":""},{"$f":"IF(Properties!$L140=0,\"\",Properties!$L140)","v":""},{"$f":"IF(Properties!AF137=0,\"\",Properties!AF137)","v":"NA"},{"$f":"Properties!AG137","v":"NA"},{"$f":"Properties!AH137","v":"NA"},{"$f":"Properties!AI137","v":"NA"},{"$f":"IF(Properties!X137=0,\"\",Properties!X137)","v":""},{"$f":"IF(Properties!N137=0,\"\",Properties!N137)","v":""},{"$f":"Properties!AJ137","v":"NA"},{"$f":"Properties!AK137","v":"NA"},{"$f":"IF(Properties!O137=0,\"\",Properties!O137)","v":""},{"$f":"Properties!AL137","v":"NA"},{"$f":"Properties!AM137","v":"NA"},{"$f":"IF(Properties!P137=0,\"\",Properties!P137)","v":""},{"$f":"Properties!AN137","v":"NA"},{"$f":"Properties!AO137","v":"NA"},{"$f":"IF(Properties!$Q137=0,\"\",Properties!$Q137)","v":""},{"$f":"IF(Properties!$Q138=0,\"\",Properties!$Q138)","v":""},{"$f":"IF(Properties!$Q139=0,\"\",Properties!$Q139)","v":""},{"$f":"IF(Properties!$Q140=0,\"\",Properties!$Q140)","v":""},{"$f":"IF(Properties!AP137=0,\"\",Properties!AP137)","v":"NA"},{"$f":"Properties!AQ137","v":"NA"},{"$f":"Properties!AR137","v":"NA"},{"$f":"Properties!AS137","v":"NA"},{"$f":"IF(Properties!Y137=0,\"\",Properties!Y137)","v":""},{"$f":"IF(Properties!S137=0,\"\",Properties!S137)","v":""},{"$f":"Properties!AT137","v":"NA"},{"$f":"Properties!AU137","v":"NA"},{"$f":"IF(Properties!T137=0,\"\",Properties!T137)","v":""},{"$f":"Properties!AV137","v":"NA"},{"$f":"Properties!AW137","v":"NA"},{"$f":"IF(Properties!U137=0,\"\",Properties!U137)","v":""},{"$f":"Properties!AX137","v":"NA"},{"$f":"Properties!AY137","v":"NA"},{"$f":"IF(Properties!$V137=0,\"\",Properties!$V137)","v":""},{"$f":"IF(Properties!$V138=0,\"\",Properties!$V138)","v":""},{"$f":"IF(Properties!$V139=0,\"\",Properties!$V139)","v":""},{"$f":"IF(Properties!$V140=0,\"\",Properties!$V140)","v":""},{"$f":"IF(Properties!W137=0,\"\",Properties!W137)","v":""},{"$f":"Properties!BA137","v":"NA"},{"$f":"Properties!BB137","v":"NA"},{"$f":"Properties!BC137","v":"NA"}]
[null,{"$f":"IF(Menu!$C$5=0,\"\",Menu!$C$5)","v":""},{"$f":"IF(Menu!$C$6=0,\"\",Menu!$C$6)","v":""},{"$f":"IF(Menu!$C$7=0,\"\",Menu!$C$7)","v":""},{"$f":"IF(Menu!$C$8=0,\"\",Menu!$C$8)","v":""},{"$f":"IF(Menu!$C$9=0,\"\",Menu!$C$9)","v":""},{"$f":"IF(Menu!$C$10=0,\"\",Menu!$C$10)","v":""},{"$f":"IF(Menu!$F$7=0,\"\",Menu!$F$7)","v":"Std QA"},{"$f":"IF(Menu!$F$5=0,\"\",Menu!$F$5)","v":"2E03"},{"$f":"IF(Menu!$F$8=0,\"\",Menu!$F$8)","v":"Ignition"},{"$f":"IF(Properties!D141=0,\"\",Properties!D141)","v":""},{"$f":"IF(Properties!$G$5=0,\"\",Properties!$G$5)","v":"No"},{"$f":"IF(Properties!$C$9=0,\"\",Properties!$C$9)","v":""},{"$f":"IF(Properties!$G$3=0,\"\",Properties!$G$3)","v":""},{"$f":"IF(Properties!$G$4=0,\"\",Properties!$G$4)","v":"10-03"},{"$f":"IF(Properties!E141=0,\"\",Properties!E141)","v":33},{"$f":"IF(Properties!G141=0,\"\",Properties!G141)","v":""},{"$f":"IF(Menu!$G$17=0,\"\",Menu!$G$17)","v":92},{"$f":"IF(Properties!H141=0,\"\",Properties!H141)","v":""},{"$f":"IF(Properties!$R$4=0,\"\",Properties!$R$4)","v":3},{"$f":"IF(Properties!I141=0,\"\",Properties!I141)","v":""},{"$f":"Properties!Z141","v":"NA"},{"$f":"Properties!AA141","v":"NA"},{"$f":"IF(Properties!J141=0,\"\",Properties!J141)","v":""},{"$f":"Properties!AB141","v":"NA"},{"$f":"Properties!AC141","v":"NA"},{"$f":"Properties!K141","v":0},{"$f":"Properties!AD141","v":"NA"},{"$f":"Properties!AE141","v":"NA"},{"$f":"IF(Properties!$L141=0,\"\",Properties!$L141)","v":""},{"$f":"IF(Properties!$L142=0,\"\",Properties!$L142)","v":""},{"$f":"IF(Properties!$L143=0,\"\",Properties!$L143)","v":""},{"$f":"IF(Properties!$L144=0,\"\",Properties!$L144)","v":""},{"$f":"IF(Properties!AF141=0,\"\",Properties!AF141)","v":"NA"},{"$f":"Properties!AG141","v":"NA"},{"$f":"Properties!AH141","v":"NA"},{"$f":"Properties!AI141","v":"NA"},{"$f":"IF(Properties!X141=0,\"\",Properties!X141)","v":""},{"$f":"IF(Properties!N141=0,\"\",Properties!N141)","v":""},{"$f":"Properties!AJ141","v":"NA"},{"$f":"Properties!AK141","v":"NA"},{"$f":"IF(Properties!O141=0,\"\",Properties!O141)","v":""},{"$f":"Properties!AL141","v":"NA"},{"$f":"Properties!AM141","v":"NA"},{"$f":"IF(Properties!P141=0,\"\",Properties!P141)","v":""},{"$f":"Properties!AN141","v":"NA"},{"$f":"Properties!AO141","v":"NA"},{"$f":"IF(Properties!$Q141=0,\"\",Properties!$Q141)","v":""},{"$f":"IF(Properties!$Q142=0,\"\",Properties!$Q142)","v":""},{"$f":"IF(Properties!$Q143=0,\"\",Properties!$Q143)","v":""},{"$f":"IF(Properties!$Q144=0,\"\",Properties!$Q144)","v":""},{"$f":"IF(Properties!AP141=0,\"\",Properties!AP141)","v":"NA"},{"$f":"Properties!AQ141","v":"NA"},{"$f":"Properties!AR141","v":"NA"},{"$f":"Properties!AS141","v":"NA"},{"$f":"IF(Properties!Y141=0,\"\",Properties!Y141)","v":""},{"$f":"IF(Properties!S141=0,\"\",Properties!S141)","v":""},{"$f":"Properties!AT141","v":"NA"},{"$f":"Properties!AU141","v":"NA"},{"$f":"IF(Properties!T141=0,\"\",Properties!T141)","v":""},{"$f":"Properties!AV141","v":"NA"},{"$f":"Properties!AW141","v":"NA"},{"$f":"IF(Properties!U141=0,\"\",Properties!U141)","v":""},{"$f":"Properties!AX141","v":"NA"},{"$f":"Properties!AY141","v":"NA"},{"$f":"IF(Properties!$V141=0,\"\",Properties!$V141)","v":""},{"$f":"IF(Properties!$V142=0,\"\",Properties!$V142)","v":""},{"$f":"IF(Properties!$V143=0,\"\",Properties!$V143)","v":""},{"$f":"IF(Properties!$V144=0,\"\",Properties!$V144)","v":""},{"$f":"IF(Properties!W141=0,\"\",Properties!W141)","v":""},{"$f":"Properties!BA141","v":"NA"},{"$f":"Properties!BB141","v":"NA"},{"$f":"Properties!BC141","v":"NA"}]
[null,{"$f":"IF(Menu!$C$5=0,\"\",Menu!$C$5)","v":""},{"$f":"IF(Menu!$C$6=0,\"\",Menu!$C$6)","v":""},{"$f":"IF(Menu!$C$7=0,\"\",Menu!$C$7)","v":""},{"$f":"IF(Menu!$C$8=0,\"\",Menu!$C$8)","v":""},{"$f":"IF(Menu!$C$9=0,\"\",Menu!$C$9)","v":""},{"$f":"IF(Menu!$C$10=0,\"\",Menu!$C$10)","v":""},{"$f":"IF(Menu!$F$7=0,\"\",Menu!$F$7)","v":"Std QA"},{"$f":"IF(Menu!$F$5=0,\"\",Menu!$F$5)","v":"2E03"},{"$f":"IF(Menu!$F$8=0,\"\",Menu!$F$8)","v":"Ignition"},{"$f":"IF(Properties!D145=0,\"\",Properties!D145)","v":""},{"$f":"IF(Properties!$G$5=0,\"\",Properties!$G$5)","v":"No"},{"$f":"IF(Properties!$C$9=0,\"\",Properties!$C$9)","v":""},{"$f":"IF(Properties!$G$3=0,\"\",Properties!$G$3)","v":""},{"$f":"IF(Properties!$G$4=0,\"\",Properties!$G$4)","v":"10-03"},{"$f":"IF(Properties!E145=0,\"\",Properties!E145)","v":34},{"$f":"IF(Properties!G145=0,\"\",Properties!G145)","v":""},{"$f":"IF(Menu!$G$17=0,\"\",Menu!$G$17)","v":92},{"$f":"IF(Properties!H145=0,\"\",Properties!H145)","v":""},{"$f":"IF(Properties!$R$4=0,\"\",Properties!$R$4)","v":3},{"$f":"IF(Properties!I145=0,\"\",Properties!I145)","v":""},{"$f":"Properties!Z145","v":"NA"},{"$f":"Properties!AA145","v":"NA"},{"$f":"IF(Properties!J145=0,\"\",Properties!J145)","v":""},{"$f":"Properties!AB145","v":"NA"},{"$f":"Properties!AC145","v":"NA"},{"$f":"Properties!K145","v":0},{"$f":"Properties!AD145","v":"NA"},{"$f":"Properties!AE145","v":"NA"},{"$f":"IF(Properties!$L145=0,\"\",Properties!$L145)","v":""},{"$f":"IF(Properties!$L146=0,\"\",Properties!$L146)","v":""},{"$f":"IF(Properties!$L147=0,\"\",Properties!$L147)","v":""},{"$f":"IF(Properties!$L148=0,\"\",Properties!$L148)","v":""},{"$f":"IF(Properties!AF145=0,\"\",Properties!AF145)","v":"NA"},{"$f":"Properties!AG145","v":"NA"},{"$f":"Properties!AH145","v":"NA"},{"$f":"Properties!AI145","v":"NA"},{"$f":"IF(Properties!X145=0,\"\",Properties!X145)","v":""},{"$f":"IF(Properties!N145=0,\"\",Properties!N145)","v":""},{"$f":"Properties!AJ145","v":"NA"},{"$f":"Properties!AK145","v":"NA"},{"$f":"IF(Properties!O145=0,\"\",Properties!O145)","v":""},{"$f":"Properties!AL145","v":"NA"},{"$f":"Properties!AM145","v":"NA"},{"$f":"IF(Properties!P145=0,\"\",Properties!P145)","v":""},{"$f":"Properties!AN145","v":"NA"},{"$f":"Properties!AO145","v":"NA"},{"$f":"IF(Properties!$Q145=0,\"\",Properties!$Q145)","v":""},{"$f":"IF(Properties!$Q146=0,\"\",Properties!$Q146)","v":""},{"$f":"IF(Properties!$Q147=0,\"\",Properties!$Q147)","v":""},{"$f":"IF(Properties!$Q148=0,\"\",Properties!$Q148)","v":""},{"$f":"IF(Properties!AP145=0,\"\",Properties!AP145)","v":"NA"},{"$f":"Properties!AQ145","v":"NA"},{"$f":"Properties!AR145","v":"NA"},{"$f":"Properties!AS145","v":"NA"},{"$f":"IF(Properties!Y145=0,\"\",Properties!Y145)","v":""},{"$f":"IF(Properties!S145=0,\"\",Properties!S145)","v":""},{"$f":"Properties!AT145","v":"NA"},{"$f":"Properties!AU145","v":"NA"},{"$f":"IF(Properties!T145=0,\"\",Properties!T145)","v":""},{"$f":"Properties!AV145","v":"NA"},{"$f":"Properties!AW145","v":"NA"},{"$f":"IF(Properties!U145=0,\"\",Properties!U145)","v":""},{"$f":"Properties!AX145","v":"NA"},{"$f":"Properties!AY145","v":"NA"},{"$f":"IF(Properties!$V145=0,\"\",Properties!$V145)","v":""},{"$f":"IF(Properties!$V146=0,\"\",Properties!$V146)","v":""},{"$f":"IF(Properties!$V147=0,\"\",Properties!$V147)","v":""},{"$f":"IF(Properties!$V148=0,\"\",Properties!$V148)","v":""},{"$f":"IF(Properties!W145=0,\"\",Properties!W145)","v":""},{"$f":"Properties!BA145","v":"NA"},{"$f":"Properties!BB145","v":"NA"},{"$f":"Properties!BC145","v":"NA"}]
[null,{"$f":"IF(Menu!$C$5=0,\"\",Menu!$C$5)","v":""},{"$f":"IF(Menu!$C$6=0,\"\",Menu!$C$6)","v":""},{"$f":"IF(Menu!$C$7=0,\"\",Menu!$C$7)","v":""},{"$f":"IF(Menu!$C$8=0,\"\",Menu!$C$8)","v":""},{"$f":"IF(Menu!$C$9=0,\"\",Menu!$C$9)","v":""},{"$f":"IF(Menu!$C$10=0,\"\",Menu!$C$10)","v":""},{"$f":"IF(Menu!$F$7=0,\"\",Menu!$F$7)","v":"Std QA"},{"$f":"IF(Menu!$F$5=0,\"\",Menu!$F$5)","v":"2E03"},{"$f":"IF(Menu!$F$8=0,\"\",Menu!$F$8)","v":"Ignition"},{"$f":"IF(Properties!D149=0,\"\",Properties!D149)","v":""},{"$f":"IF(Properties!$G$5=0,\"\",Properties!$G$5)","v":"No"},{"$f":"IF(Properties!$C$9=0,\"\",Properties!$C$9)","v":""},{"$f":"IF(Properties!$G$3=0,\"\",Properties!$G$3)","v":""},{"$f":"IF(Properties!$G$4=0,\"\",Properties!$G$4)","v":"10-03"},{"$f":"IF(Properties!E149=0,\"\",Properties!E149)","v":35},{"$f":"IF(Properties!G149=0,\"\",Properties!G149)","v":""},{"$f":"IF(Menu!$G$17=0,\"\",Menu!$G$17)","v":92},{"$f":"IF(Properties!H149=0,\"\",Properties!H149)","v":""},{"$f":"IF(Properties!$R$4=0,\"\",Properties!$R$4)","v":3},{"$f":"IF(Properties!I149=0,\"\",Properties!I149)","v":""},{"$f":"Properties!Z149","v":"NA"},{"$f":"Properties!AA149","v":"NA"},{"$f":"IF(Properties!J149=0,\"\",Properties!J149)","v":""},{"$f":"Properties!AB149","v":"NA"},{"$f":"Properties!AC149","v":"NA"},{"$f":"Properties!K149","v":0},{"$f":"Properties!AD149","v":"NA"},{"$f":"Properties!AE149","v":"NA"},{"$f":"IF(Properties!$L149=0,\"\",Properties!$L149)","v":""},{"$f":"IF(Properties!$L150=0,\"\",Properties!$L150)","v":""},{"$f":"IF(Properties!$L151=0,\"\",Properties!$L151)","v":""},{"$f":"IF(Properties!$L152=0,\"\",Properties!$L152)","v":""},{"$f":"IF(Properties!AF149=0,\"\",Properties!AF149)","v":"NA"},{"$f":"Properties!AG149","v":"NA"},{"$f":"Properties!AH149","v":"NA"},{"$f":"Properties!AI149","v":"NA"},{"$f":"IF(Properties!X149=0,\"\",Properties!X149)","v":""},{"$f":"IF(Properties!N149=0,\"\",Properties!N149)","v":""},{"$f":"Properties!AJ149","v":"NA"},{"$f":"Properties!AK149","v":"NA"},{"$f":"IF(Properties!O149=0,\"\",Properties!O149)","v":""},{"$f":"Properties!AL149","v":"NA"},{"$f":"Properties!AM149","v":"NA"},{"$f":"IF(Properties!P149=0,\"\",Properties!P149)","v":""},{"$f":"Properties!AN149","v":"NA"},{"$f":"Properties!AO149","v":"NA"},{"$f":"IF(Properties!$Q149=0,\"\",Properties!$Q149)","v":""},{"$f":"IF(Properties!$Q150=0,\"\",Properties!$Q150)","v":""},{"$f":"IF(Properties!$Q151=0,\"\",Properties!$Q151)","v":""},{"$f":"IF(Properties!$Q152=0,\"\",Properties!$Q152)","v":""},{"$f":"IF(Properties!AP149=0,\"\",Properties!AP149)","v":"NA"},{"$f":"Properties!AQ149","v":"NA"},{"$f":"Properties!AR149","v":"NA"},{"$f":"Properties!AS149","v":"NA"},{"$f":"IF(Properties!Y149=0,\"\",Properties!Y149)","v":""},{"$f":"IF(Properties!S149=0,\"\",Properties!S149)","v":""},{"$f":"Properties!AT149","v":"NA"},{"$f":"Properties!AU149","v":"NA"},{"$f":"IF(Properties!T149=0,\"\",Properties!T149)","v":""},{"$f":"Properties!AV149","v":"NA"},{"$f":"Properties!AW149","v":"NA"},{"$f":"IF(Properties!U149=0,\"\",Properties!U149)","v":""},{"$f":"Properties!AX149","v":"NA"},{"$f":"Properties!AY149","v":"NA"},{"$f":"IF(Properties!$V149=0,\"\",Properties!$V149)","v":""},{"$f":"IF(Properties!$V150=0,\"\",Properties!$V150)","v":""},{"$f":"IF(Properties!$V151=0,\"\",Properties!$V151)","v":""},{"$f":"IF(Properties!$V152=0,\"\",Properties!$V152)","v":""},{"$f":"IF(Properties!W149=0,\"\",Properties!W149)","v":""},{"$f":"Properties!BA149","v":"NA"},{"$f":"Properties!BB149","v":"NA"},{"$f":"Properties!BC149","v":"NA"}]
[null,{"$f":"IF(Menu!$C$5=0,\"\",Menu!$C$5)","v":""},{"$f":"IF(Menu!$C$6=0,\"\",Menu!$C$6)","v":""},{"$f":"IF(Menu!$C$7=0,\"\",Menu!$C$7)","v":""},{"$f":"IF(Menu!$C$8=0,\"\",Menu!$C$8)","v":""},{"$f":"IF(Menu!$C$9=0,\"\",Menu!$C$9)","v":""},{"$f":"IF(Menu!$C$10=0,\"\",Menu!$C$10)","v":""},{"$f":"IF(Menu!$F$7=0,\"\",Menu!$F$7)","v":"Std QA"},{"$f":"IF(Menu!$F$5=0,\"\",Menu!$F$5)","v":"2E03"},{"$f":"IF(Menu!$F$8=0,\"\",Menu!$F$8)","v":"Ignition"},{"$f":"IF(Properties!D153=0,\"\",Properties!D153)","v":""},{"$f":"IF(Properties!$G$5=0,\"\",Properties!$G$5)","v":"No"},{"$f":"IF(Properties!$C$9=0,\"\",Properties!$C$9)","v":""},{"$f":"IF(Properties!$G$3=0,\"\",Properties!$G$3)","v":""},{"$f":"IF(Properties!$G$4=0,\"\",Properties!$G$4)","v":"10-03"},{"$f":"IF(Properties!E153=0,\"\",Properties!E153)","v":36},{"$f":"IF(Properties!G153=0,\"\",Properties!G153)","v":""},{"$f":"IF(Menu!$G$17=0,\"\",Menu!$G$17)","v":92},{"$f":"IF(Properties!H153=0,\"\",Properties!H153)","v":""},{"$f":"IF(Properties!$R$4=0,\"\",Properties!$R$4)","v":3},{"$f":"IF(Properties!I153=0,\"\",Properties!I153)","v":""},{"$f":"Properties!Z153","v":"NA"},{"$f":"Properties!AA153","v":"NA"},{"$f":"IF(Properties!J153=0,\"\",Properties!J153)","v":""},{"$f":"Properties!AB153","v":"NA"},{"$f":"Properties!AC153","v":"NA"},{"$f":"Properties!K153","v":0},{"$f":"Properties!AD153","v":"NA"},{"$f":"Properties!AE153","v":"NA"},{"$f":"IF(Properties!$L153=0,\"\",Properties!$L153)","v":""},{"$f":"IF(Properties!$L154=0,\"\",Properties!$L154)","v":""},{"$f":"IF(Properties!$L155=0,\"\",Properties!$L155)","v":""},{"$f":"IF(Properties!$L156=0,\"\",Properties!$L156)","v":""},{"$f":"IF(Properties!AF153=0,\"\",Properties!AF153)","v":"NA"},{"$f":"Properties!AG153","v":"NA"},{"$f":"Properties!AH153","v":"NA"},{"$f":"Properties!AI153","v":"NA"},{"$f":"IF(Properties!X153=0,\"\",Properties!X153)","v":""},{"$f":"IF(Properties!N153=0,\"\",Properties!N153)","v":""},{"$f":"Properties!AJ153","v":"NA"},{"$f":"Properties!AK153","v":"NA"},{"$f":"IF(Properties!O153=0,\"\",Properties!O153)","v":""},{"$f":"Properties!AL153","v":"NA"},{"$f":"Properties!AM153","v":"NA"},{"$f":"IF(Properties!P153=0,\"\",Properties!P153)","v":""},{"$f":"Properties!AN153","v":"NA"},{"$f":"Properties!AO153","v":"NA"},{"$f":"IF(Properties!$Q153=0,\"\",Properties!$Q153)","v":""},{"$f":"IF(Properties!$Q154=0,\"\",Properties!$Q154)","v":""},{"$f":"IF(Properties!$Q155=0,\"\",Properties!$Q155)","v":""},{"$f":"IF(Properties!$Q156=0,\"\",Properties!$Q156)","v":""},{"$f":"IF(Properties!AP153=0,\"\",Properties!AP153)","v":"NA"},{"$f":"Properties!AQ153","v":"NA"},{"$f":"Properties!AR153","v":"NA"},{"$f":"Properties!AS153","v":"NA"},{"$f":"IF(Properties!Y153=0,\"\",Properties!Y153)","v":""},{"$f":"IF(Properties!S153=0,\"\",Properties!S153)","v":""},{"$f":"Properties!AT153","v":"NA"},{"$f":"Properties!AU153","v":"NA"},{"$f":"IF(Properties!T153=0,\"\",Properties!T153)","v":""},{"$f":"Properties!AV153","v":"NA"},{"$f":"Properties!AW153","v":"NA"},{"$f":"IF(Properties!U153=0,\"\",Properties!U153)","v":""},{"$f":"Properties!AX153","v":"NA"},{"$f":"Properties!AY153","v":"NA"},{"$f":"IF(Properties!$V153=0,\"\",Properties!$V153)","v":""},{"$f":"IF(Properties!$V154=0,\"\",Properties!$V154)","v":""},{"$f":"IF(Properties!$V155=0,\"\",Properties!$V155)","v":""},{"$f":"IF(Properties!$V156=0,\"\",Properties!$V156)","v":""},{"$f":"IF(Properties!W153=0,\"\",Properties!W153)","v":""},{"$f":"Properties!BA153","v":"NA"},{"$f":"Properties!BB153","v":"NA"},{"$f":"Properties!BC153","v":"NA"}]
[null,{"$f":"IF(Menu!$C$5=0,\"\",Menu!$C$5)","v":""},{"$f":"IF(Menu!$C$6=0,\"\",Menu!$C$6)","v":""},{"$f":"IF(Menu!$C$7=0,\"\",Menu!$C$7)","v":""},{"$f":"IF(Menu!$C$8=0,\"\",Menu!$C$8)","v":""},{"$f":"IF(Menu!$C$9=0,\"\",Menu!$C$9)","v":""},{"$f":"IF(Menu!$C$10=0,\"\",Menu!$C$10)","v":""},{"$f":"IF(Menu!$F$7=0,\"\",Menu!$F$7)","v":"Std QA"},{"$f":"IF(Menu!$F$5=0,\"\",Menu!$F$5)","v":"2E03"},{"$f":"IF(Menu!$F$8=0,\"\",Menu!$F$8)","v":"Ignition"},{"$f":"IF(Properties!D157=0,\"\",Properties!D157)","v":""},{"$f":"IF(Properties!$G$5=0,\"\",Properties!$G$5)","v":"No"},{"$f":"IF(Properties!$C$9=0,\"\",Properties!$C$9)","v":""},{"$f":"IF(Properties!$G$3=0,\"\",Properties!$G$3)","v":""},{"$f":"IF(Properties!$G$4=0,\"\",Properties!$G$4)","v":"10-03"},{"$f":"IF(Properties!E157=0,\"\",Properties!E157)","v":37},{"$f":"IF(Properties!G157=0,\"\",Properties!G157)","v":""},{"$f":"IF(Menu!$G$17=0,\"\",Menu!$G$17)","v":92},{"$f":"IF(Properties!H157=0,\"\",Properties!H157)","v":""},{"$f":"IF(Properties!$R$4=0,\"\",Properties!$R$4)","v":3},{"$f":"IF(Properties!I157=0,\"\",Properties!I157)","v":""},{"$f":"Properties!Z157","v":"NA"},{"$f":"Properties!AA157","v":"NA"},{"$f":"IF(Properties!J157=0,\"\",Properties!J157)","v":""},{"$f":"Properties!AB157","v":"NA"},{"$f":"Properties!AC157","v":"NA"},{"$f":"Properties!K157","v":0},{"$f":"Properties!AD157","v":"NA"},{"$f":"Properties!AE157","v":"NA"},{"$f":"IF(Properties!$L157=0,\"\",Properties!$L157)","v":""},{"$f":"IF(Properties!$L158=0,\"\",Properties!$L158)","v":""},{"$f":"IF(Properties!$L159=0,\"\",Properties!$L159)","v":""},{"$f":"IF(Properties!$L160=0,\"\",Properties!$L160)","v":""},{"$f":"IF(Properties!AF157=0,\"\",Properties!AF157)","v":"NA"},{"$f":"Properties!AG157","v":"NA"},{"$f":"Properties!AH157","v":"NA"},{"$f":"Properties!AI157","v":"NA"},{"$f":"IF(Properties!X157=0,\"\",Properties!X157)","v":""},{"$f":"IF(Properties!N157=0,\"\",Properties!N157)","v":""},{"$f":"Properties!AJ157","v":"NA"},{"$f":"Properties!AK157","v":"NA"},{"$f":"IF(Properties!O157=0,\"\",Properties!O157)","v":""},{"$f":"Properties!AL157","v":"NA"},{"$f":"Properties!AM157","v":"NA"},{"$f":"IF(Properties!P157=0,\"\",Properties!P157)","v":""},{"$f":"Properties!AN157","v":"NA"},{"$f":"Properties!AO157","v":"NA"},{"$f":"IF(Properties!$Q157=0,\"\",Properties!$Q157)","v":""},{"$f":"IF(Properties!$Q158=0,\"\",Properties!$Q158)","v":""},{"$f":"IF(Properties!$Q159=0,\"\",Properties!$Q159)","v":""},{"$f":"IF(Properties!$Q160=0,\"\",Properties!$Q160)","v":""},{"$f":"IF(Properties!AP157=0,\"\",Properties!AP157)","v":"NA"},{"$f":"Properties!AQ157","v":"NA"},{"$f":"Properties!AR157","v":"NA"},{"$f":"Properties!AS157","v":"NA"},{"$f":"IF(Properties!Y157=0,\"\",Properties!Y157)","v":""},{"$f":"IF(Properties!S157=0,\"\",Properties!S157)","v":""},{"$f":"Properties!AT157","v":"NA"},{"$f":"Properties!AU157","v":"NA"},{"$f":"IF(Properties!T157=0,\"\",Properties!T157)","v":""},{"$f":"Properties!AV157","v":"NA"},{"$f":"Properties!AW157","v":"NA"},{"$f":"IF(Properties!U157=0,\"\",Properties!U157)","v":""},{"$f":"Properties!AX157","v":"NA"},{"$f":"Properties!AY157","v":"NA"},{"$f":"IF(Properties!$V157=0,\"\",Properties!$V157)","v":""},{"$f":"IF(Properties!$V158=0,\"\",Properties!$V158)","v":""},{"$f":"IF(Properties!$V159=0,\"\",Properties!$V159)","v":""},{"$f":"IF(Properties!$V160=0,\"\",Properties!$V160)","v":""},{"$f":"IF(Properties!W157=0,\"\",Properties!W157)","v":""},{"$f":"Properties!BA157","v":"NA"},{"$f":"Properties!BB157","v":"NA"},{"$f":"Properties!BC157","v":"NA"}]
[null,{"$f":"IF(Menu!$C$5=0,\"\",Menu!$C$5)","v":""},{"$f":"IF(Menu!$C$6=0,\"\",Menu!$C$6)","v":""},{"$f":"IF(Menu!$C$7=0,\"\",Menu!$C$7)","v":""},{"$f":"IF(Menu!$C$8=0,\"\",Menu!$C$8)","v":""},{"$f":"IF(Menu!$C$9=0,\"\",Menu!$C$9)","v":""},{"$f":"IF(Menu!$C$10=0,\"\",Menu!$C$10)","v":""},{"$f":"IF(Menu!$F$7=0,\"\",Menu!$F$7)","v":"Std QA"},{"$f":"IF(Menu!$F$5=0,\"\",Menu!$F$5)","v":"2E03"},{"$f":"IF(Menu!$F$8=0,\"\",Menu!$F$8)","v":"Ignition"},{"$f":"IF(Properties!D161=0,\"\",Properties!D161)","v":""},{"$f":"IF(Properties!$G$5=0,\"\",Properties!$G$5)","v":"No"},{"$f":"IF(Properties!$C$9=0,\"\",Properties!$C$9)","v":""},{"$f":"IF(Properties!$G$3=0,\"\",Properties!$G$3)","v":""},{"$f":"IF(Properties!$G$4=0,\"\",Properties!$G$4)","v":"10-03"},{"$f":"IF(Properties!E161=0,\"\",Properties!E161)","v":38},{"$f":"IF(Properties!G161=0,\"\",Properties!G161)","v":""},{"$f":"IF(Menu!$G$17=0,\"\",Menu!$G$17)","v":92},{"$f":"IF(Properties!H161=0,\"\",Properties!H161)","v":""},{"$f":"IF(Properties!$R$4=0,\"\",Properties!$R$4)","v":3},{"$f":"IF(Properties!I161=0,\"\",Properties!I161)","v":""},{"$f":"Properties!Z161","v":"NA"},{"$f":"Properties!AA161","v":"NA"},{"$f":"IF(Properties!J161=0,\"\",Properties!J161)","v":""},{"$f":"Properties!AB161","v":"NA"},{"$f":"Properties!AC161","v":"NA"},{"$f":"Properties!K161","v":0},{"$f":"Properties!AD161","v":"NA"},{"$f":"Properties!AE161","v":"NA"},{"$f":"IF(Properties!$L161=0,\"\",Properties!$L161)","v":""},{"$f":"IF(Properties!$L162=0,\"\",Properties!$L162)","v":""},{"$f":"IF(Properties!$L163=0,\"\",Properties!$L163)","v":""},{"$f":"IF(Properties!$L164=0,\"\",Properties!$L164)","v":""},{"$f":"IF(Properties!AF161=0,\"\",Properties!AF161)","v":"NA"},{"$f":"Properties!AG161","v":"NA"},{"$f":"Properties!AH161","v":"NA"},{"$f":"Properties!AI161","v":"NA"},{"$f":"IF(Properties!X161=0,\"\",Properties!X161)","v":""},{"$f":"IF(Properties!N161=0,\"\",Properties!N161)","v":""},{"$f":"Properties!AJ161","v":"NA"},{"$f":"Properties!AK161","v":"NA"},{"$f":"IF(Properties!O161=0,\"\",Properties!O161)","v":""},{"$f":"Properties!AL161","v":"NA"},{"$f":"Properties!AM161","v":"NA"},{"$f":"IF(Properties!P161=0,\"\",Properties!P161)","v":""},{"$f":"Properties!AN161","v":"NA"},{"$f":"Properties!AO161","v":"NA"},{"$f":"IF(Properties!$Q161=0,\"\",Properties!$Q161)","v":""},{"$f":"IF(Properties!$Q162=0,\"\",Properties!$Q162)","v":""},{"$f":"IF(Properties!$Q163=0,\"\",Properties!$Q163)","v":""},{"$f":"IF(Properties!$Q164=0,\"\",Properties!$Q164)","v":""},{"$f":"IF(Properties!AP161=0,\"\",Properties!AP161)","v":"NA"},{"$f":"Properties!AQ161","v":"NA"},{"$f":"Properties!AR161","v":"NA"},{"$f":"Properties!AS161","v":"NA"},{"$f":"IF(Properties!Y161=0,\"\",Properties!Y161)","v":""},{"$f":"IF(Properties!S161=0,\"\",Properties!S161)","v":""},{"$f":"Properties!AT161","v":"NA"},{"$f":"Properties!AU161","v":"NA"},{"$f":"IF(Properties!T161=0,\"\",Properties!T161)","v":""},{"$f":"Properties!AV161","v":"NA"},{"$f":"Properties!AW161","v":"NA"},{"$f":"IF(Properties!U161=0,\"\",Properties!U161)","v":""},{"$f":"Properties!AX161","v":"NA"},{"$f":"Properties!AY161","v":"NA"},{"$f":"IF(Properties!$V161=0,\"\",Properties!$V161)","v":""},{"$f":"IF(Properties!$V162=0,\"\",Properties!$V162)","v":""},{"$f":"IF(Properties!$V163=0,\"\",Properties!$V163)","v":""},{"$f":"IF(Properties!$V164=0,\"\",Properties!$V164)","v":""},{"$f":"IF(Properties!W161=0,\"\",Properties!W161)","v":""},{"$f":"Properties!BA161","v":"NA"},{"$f":"Properties!BB161","v":"NA"},{"$f":"Properties!BC161","v":"NA"}]
[null,{"$f":"IF(Menu!$C$5=0,\"\",Menu!$C$5)","v":""},{"$f":"IF(Menu!$C$6=0,\"\",Menu!$C$6)","v":""},{"$f":"IF(Menu!$C$7=0,\"\",Menu!$C$7)","v":""},{"$f":"IF(Menu!$C$8=0,\"\",Menu!$C$8)","v":""},{"$f":"IF(Menu!$C$9=0,\"\",Menu!$C$9)","v":""},{"$f":"IF(Menu!$C$10=0,\"\",Menu!$C$10)","v":""},{"$f":"IF(Menu!$F$7=0,\"\",Menu!$F$7)","v":"Std QA"},{"$f":"IF(Menu!$F$5=0,\"\",Menu!$F$5)","v":"2E03"},{"$f":"IF(Menu!$F$8=0,\"\",Menu!$F$8)","v":"Ignition"},{"$f":"IF(Properties!D165=0,\"\",Properties!D165)","v":""},{"$f":"IF(Properties!$G$5=0,\"\",Properties!$G$5)","v":"No"},{"$f":"IF(Properties!$C$9=0,\"\",Properties!$C$9)","v":""},{"$f":"IF(Properties!$G$3=0,\"\",Properties!$G$3)","v":""},{"$f":"IF(Properties!$G$4=0,\"\",Properties!$G$4)","v":"10-03"},{"$f":"IF(Properties!E165=0,\"\",Properties!E165)","v":39},{"$f":"IF(Properties!G165=0,\"\",Properties!G165)","v":""},{"$f":"IF(Menu!$G$17=0,\"\",Menu!$G$17)","v":92},{"$f":"IF(Properties!H165=0,\"\",Properties!H165)","v":""},{"$f":"IF(Properties!$R$4=0,\"\",Properties!$R$4)","v":3},{"$f":"IF(Properties!I165=0,\"\",Properties!I165)","v":""},{"$f":"Properties!Z165","v":"NA"},{"$f":"Properties!AA165","v":"NA"},{"$f":"IF(Properties!J165=0,\"\",Properties!J165)","v":""},{"$f":"Properties!AB165","v":"NA"},{"$f":"Properties!AC165","v":"NA"},{"$f":"Properties!K165","v":0},{"$f":"Properties!AD165","v":"NA"},{"$f":"Properties!AE165","v":"NA"},{"$f":"IF(Properties!$L165=0,\"\",Properties!$L165)","v":""},{"$f":"IF(Properties!$L166=0,\"\",Properties!$L166)","v":""},{"$f":"IF(Properties!$L167=0,\"\",Properties!$L167)","v":""},{"$f":"IF(Properties!$L168=0,\"\",Properties!$L168)","v":""},{"$f":"IF(Properties!AF165=0,\"\",Properties!AF165)","v":"NA"},{"$f":"Properties!AG165","v":"NA"},{"$f":"Properties!AH165","v":"NA"},{"$f":"Properties!AI165","v":"NA"},{"$f":"IF(Properties!X165=0,\"\",Properties!X165)","v":""},{"$f":"IF(Properties!N165=0,\"\",Properties!N165)","v":""},{"$f":"Properties!AJ165","v":"NA"},{"$f":"Properties!AK165","v":"NA"},{"$f":"IF(Properties!O165=0,\"\",Properties!O165)","v":""},{"$f":"Properties!AL165","v":"NA"},{"$f":"Properties!AM165","v":"NA"},{"$f":"IF(Properties!P165=0,\"\",Properties!P165)","v":""},{"$f":"Properties!AN165","v":"NA"},{"$f":"Properties!AO165","v":"NA"},{"$f":"IF(Properties!$Q165=0,\"\",Properties!$Q165)","v":""},{"$f":"IF(Properties!$Q166=0,\"\",Properties!$Q166)","v":""},{"$f":"IF(Properties!$Q167=0,\"\",Properties!$Q167)","v":""},{"$f":"IF(Properties!$Q168=0,\"\",Properties!$Q168)","v":""},{"$f":"IF(Properties!AP165=0,\"\",Properties!AP165)","v":"NA"},{"$f":"Properties!AQ165","v":"NA"},{"$f":"Properties!AR165","v":"NA"},{"$f":"Properties!AS165","v":"NA"},{"$f":"IF(Properties!Y165=0,\"\",Properties!Y165)","v":""},{"$f":"IF(Properties!S165=0,\"\",Properties!S165)","v":""},{"$f":"Properties!AT165","v":"NA"},{"$f":"Properties!AU165","v":"NA"},{"$f":"IF(Properties!T165=0,\"\",Properties!T165)","v":""},{"$f":"Properties!AV165","v":"NA"},{"$f":"Properties!AW165","v":"NA"},{"$f":"IF(Properties!U165=0,\"\",Properties!U165)","v":""},{"$f":"Properties!AX165","v":"NA"},{"$f":"Properties!AY165","v":"NA"},{"$f":"IF(Properties!$V165=0,\"\",Properties!$V165)","v":""},{"$f":"IF(Properties!$V166=0,\"\",Properties!$V166)","v":""},{"$f":"IF(Properties!$V167=0,\"\",Properties!$V167)","v":""},{"$f":"IF(Properties!$V168=0,\"\",Properties!$V168)","v":""},{"$f":"IF(Properties!W165=0,\"\",Properties!W165)","v":""},{"$f":"Properties!BA165","v":"NA"},{"$f":"Properties!BB165","v":"NA"},{"$f":"Properties!BC165","v":"NA"}]
[null,{"$f":"IF(Menu!$C$5=0,\"\",Menu!$C$5)","v":""},{"$f":"IF(Menu!$C$6=0,\"\",Menu!$C$6)","v":""},{"$f":"IF(Menu!$C$7=0,\"\",Menu!$C$7)","v":""},{"$f":"IF(Menu!$C$8=0,\"\",Menu!$C$8)","v":""},{"$f":"IF(Menu!$C$9=0,\"\",Menu!$C$9)","v":""},{"$f":"IF(Menu!$C$10=0,\"\",Menu!$C$10)","v":""},{"$f":"IF(Menu!$F$7=0,\"\",Menu!$F$7)","v":"Std QA"},{"$f":"IF(Menu!$F$5=0,\"\",Menu!$F$5)","v":"2E03"},{"$f":"IF(Menu!$F$8=0,\"\",Menu!$F$8)","v":"Ignition"},{"$f":"IF(Properties!D169=0,\"\",Properties!D169)","v":""},{"$f":"IF(Properties!$G$5=0,\"\",Properties!$G$5)","v":"No"},{"$f":"IF(Properties!$C$9=0,\"\",Properties!$C$9)","v":""},{"$f":"IF(Properties!$G$3=0,\"\",Properties!$G$3)","v":""},{"$f":"IF(Properties!$G$4=0,\"\",Properties!$G$4)","v":"10-03"},{"$f":"IF(Properties!E169=0,\"\",Properties!E169)","v":40},{"$f":"IF(Properties!G169=0,\"\",Properties!G169)","v":""},{"$f":"IF(Menu!$G$17=0,\"\",Menu!$G$17)","v":92},{"$f":"IF(Properties!H169=0,\"\",Properties!H169)","v":""},{"$f":"IF(Properties!$R$4=0,\"\",Properties!$R$4)","v":3},{"$f":"IF(Properties!I169=0,\"\",Properties!I169)","v":""},{"$f":"Properties!Z169","v":"NA"},{"$f":"Properties!AA169","v":"NA"},{"$f":"IF(Properties!J169=0,\"\",Properties!J169)","v":""},{"$f":"Properties!AB169","v":"NA"},{"$f":"Properties!AC169","v":"NA"},{"$f":"Properties!K169","v":0},{"$f":"Properties!AD169","v":"NA"},{"$f":"Properties!AE169","v":"NA"},{"$f":"IF(Properties!$L169=0,\"\",Properties!$L169)","v":""},{"$f":"IF(Properties!$L170=0,\"\",Properties!$L170)","v":""},{"$f":"IF(Properties!$L171=0,\"\",Properties!$L171)","v":""},{"$f":"IF(Properties!$L172=0,\"\",Properties!$L172)","v":""},{"$f":"IF(Properties!AF169=0,\"\",Properties!AF169)","v":"NA"},{"$f":"Properties!AG169","v":"NA"},{"$f":"Properties!AH169","v":"NA"},{"$f":"Properties!AI169","v":"NA"},{"$f":"IF(Properties!X169=0,\"\",Properties!X169)","v":""},{"$f":"IF(Properties!N169=0,\"\",Properties!N169)","v":""},{"$f":"Properties!AJ169","v":"NA"},{"$f":"Properties!AK169","v":"NA"},{"$f":"IF(Properties!O169=0,\"\",Properties!O169)","v":""},{"$f":"Properties!AL169","v":"NA"},{"$f":"Properties!AM169","v":"NA"},{"$f":"IF(Properties!P169=0,\"\",Properties!P169)","v":""},{"$f":"Properties!AN169","v":"NA"},{"$f":"Properties!AO169","v":"NA"},{"$f":"IF(Properties!$Q169=0,\"\",Properties!$Q169)","v":""},{"$f":"IF(Properties!$Q170=0,\"\",Properties!$Q170)","v":""},{"$f":"IF(Properties!$Q171=0,\"\",Properties!$Q171)","v":""},{"$f":"IF(Properties!$Q172=0,\"\",Properties!$Q172)","v":""},{"$f":"IF(Properties!AP169=0,\"\",Properties!AP169)","v":"NA"},{"$f":"Properties!AQ169","v":"NA"},{"$f":"Properties!AR169","v":"NA"},{"$f":"Properties!AS169","v":"NA"},{"$f":"IF(Properties!Y169=0,\"\",Properties!Y169)","v":""},{"$f":"IF(Properties!S169=0,\"\",Properties!S169)","v":""},{"$f":"Properties!AT169","v":"NA"},{"$f":"Properties!AU169","v":"NA"},{"$f":"IF(Properties!T169=0,\"\",Properties!T169)","v":""},{"$f":"Properties!AV169","v":"NA"},{"$f":"Properties!AW169","v":"NA"},{"$f":"IF(Properties!U169=0,\"\",Properties!U169)","v":""},{"$f":"Properties!AX169","v":"NA"},{"$f":"Properties!AY169","v":"NA"},{"$f":"IF(Properties!$V169=0,\"\",Properties!$V169)","v":""},{"$f":"IF(Properties!$V170=0,\"\",Properties!$V170)","v":""},{"$f":"IF(Properties!$V171=0,\"\",Properties!$V171)","v":""},{"$f":"IF(Properties!$V172=0,\"\",Properties!$V172)","v":""},{"$f":"IF(Properties!W169=0,\"\",Properties!W169)","v":""},{"$f":"Properties!BA169","v":"NA"},{"$f":"Properties!BB169","v":"NA"},{"$f":"Properties!BC169","v":"NA"}]
[null,{"$f":"IF(Menu!$C$5=0,\"\",Menu!$C$5)","v":""},{"$f":"IF(Menu!$C$6=0,\"\",Menu!$C$6)","v":""},{"$f":"IF(Menu!$C$7=0,\"\",Menu!$C$7)","v":""},{"$f":"IF(Menu!$C$8=0,\"\",Menu!$C$8)","v":""},{"$f":"IF(Menu!$C$9=0,\"\",Menu!$C$9)","v":""},{"$f":"IF(Menu!$C$10=0,\"\",Menu!$C$10)","v":""},{"$f":"IF(Menu!$F$7=0,\"\",Menu!$F$7)","v":"Std QA"},{"$f":"IF(Menu!$F$5=0,\"\",Menu!$F$5)","v":"2E03"},{"$f":"IF(Menu!$F$8=0,\"\",Menu!$F$8)","v":"Ignition"},{"$f":"IF(Properties!D173=0,\"\",Properties!D173)","v":""},{"$f":"IF(Properties!$G$5=0,\"\",Properties!$G$5)","v":"No"},{"$f":"IF(Properties!$C$9=0,\"\",Properties!$C$9)","v":""},{"$f":"IF(Properties!$G$3=0,\"\",Properties!$G$3)","v":""},{"$f":"IF(Properties!$G$4=0,\"\",Properties!$G$4)","v":"10-03"},{"$f":"IF(Properties!E173=0,\"\",Properties!E173)","v":41},{"$f":"IF(Properties!G173=0,\"\",Properties!G173)","v":""},{"$f":"IF(Menu!$G$17=0,\"\",Menu!$G$17)","v":92},{"$f":"IF(Properties!H173=0,\"\",Properties!H173)","v":""},{"$f":"IF(Properties!$R$4=0,\"\",Properties!$R$4)","v":3},{"$f":"IF(Properties!I173=0,\"\",Properties!I173)","v":""},{"$f":"Properties!Z173","v":"NA"},{"$f":"Properties!AA173","v":"NA"},{"$f":"IF(Properties!J173=0,\"\",Properties!J173)","v":""},{"$f":"Properties!AB173","v":"NA"},{"$f":"Properties!AC173","v":"NA"},{"$f":"Properties!K173","v":0},{"$f":"Properties!AD173","v":"NA"},{"$f":"Properties!AE173","v":"NA"},{"$f":"IF(Properties!$L173=0,\"\",Properties!$L173)","v":""},{"$f":"IF(Properties!$L174=0,\"\",Properties!$L174)","v":""},{"$f":"IF(Properties!$L175=0,\"\",Properties!$L175)","v":""},{"$f":"IF(Properties!$L176=0,\"\",Properties!$L176)","v":""},{"$f":"IF(Properties!AF173=0,\"\",Properties!AF173)","v":"NA"},{"$f":"Properties!AG173","v":"NA"},{"$f":"Properties!AH173","v":"NA"},{"$f":"Properties!AI173","v":"NA"},{"$f":"IF(Properties!X173=0,\"\",Properties!X173)","v":""},{"$f":"IF(Properties!N173=0,\"\",Properties!N173)","v":""},{"$f":"Properties!AJ173","v":"NA"},{"$f":"Properties!AK173","v":"NA"},{"$f":"IF(Properties!O173=0,\"\",Properties!O173)","v":""},{"$f":"Properties!AL173","v":"NA"},{"$f":"Properties!AM173","v":"NA"},{"$f":"IF(Properties!P173=0,\"\",Properties!P173)","v":""},{"$f":"Properties!AN173","v":"NA"},{"$f":"Properties!AO173","v":"NA"},{"$f":"IF(Properties!$Q173=0,\"\",Properties!$Q173)","v":""},{"$f":"IF(Properties!$Q174=0,\"\",Properties!$Q174)","v":""},{"$f":"IF(Properties!$Q175=0,\"\",Properties!$Q175)","v":""},{"$f":"IF(Properties!$Q176=0,\"\",Properties!$Q176)","v":""},{"$f":"IF(Properties!AP173=0,\"\",Properties!AP173)","v":"NA"},{"$f":"Properties!AQ173","v":"NA"},{"$f":"Properties!AR173","v":"NA"},{"$f":"Properties!AS173","v":"NA"},{"$f":"IF(Properties!Y173=0,\"\",Properties!Y173)","v":""},{"$f":"IF(Properties!S173=0,\"\",Properties!S173)","v":""},{"$f":"Properties!AT173","v":"NA"},{"$f":"Properties!AU173","v":"NA"},{"$f":"IF(Properties!T173=0,\"\",Properties!T173)","v":""},{"$f":"Properties!AV173","v":"NA"},{"$f":"Properties!AW173","v":"NA"},{"$f":"IF(Properties!U173=0,\"\",Properties!U173)","v":""},{"$f":"Properties!AX173","v":"NA"},{"$f":"Properties!AY173","v":"NA"},{"$f":"IF(Properties!$V173=0,\"\",Properties!$V173)","v":""},{"$f":"IF(Properties!$V174=0,\"\",Properties!$V174)","v":""},{"$f":"IF(Properties!$V175=0,\"\",Properties!$V175)","v":""},{"$f":"IF(Properties!$V176=0,\"\",Properties!$V176)","v":""},{"$f":"IF(Properties!W173=0,\"\",Properties!W173)","v":""},{"$f":"Properties!BA173","v":"NA"},{"$f":"Properties!BB173","v":"NA"},{"$f":"Properties!BC173","v":"NA"}]
[null,{"$f":"IF(Menu!$C$5=0,\"\",Menu!$C$5)","v":""},{"$f":"IF(Menu!$C$6=0,\"\",Menu!$C$6)","v":""},{"$f":"IF(Menu!$C$7=0,\"\",Menu!$C$7)","v":""},{"$f":"IF(Menu!$C$8=0,\"\",Menu!$C$8)","v":""},{"$f":"IF(Menu!$C$9=0,\"\",Menu!$C$9)","v":""},{"$f":"IF(Menu!$C$10=0,\"\",Menu!$C$10)","v":""},{"$f":"IF(Menu!$F$7=0,\"\",Menu!$F$7)","v":"Std QA"},{"$f":"IF(Menu!$F$5=0,\"\",Menu!$F$5)","v":"2E03"},{"$f":"IF(Menu!$F$8=0,\"\",Menu!$F$8)","v":"Ignition"},{"$f":"IF(Properties!D177=0,\"\",Properties!D177)","v":""},{"$f":"IF(Properties!$G$5=0,\"\",Properties!$G$5)","v":"No"},{"$f":"IF(Properties!$C$9=0,\"\",Properties!$C$9)","v":""},{"$f":"IF(Properties!$G$3=0,\"\",Properties!$G$3)","v":""},{"$f":"IF(Properties!$G$4=0,\"\",Properties!$G$4)","v":"10-03"},{"$f":"IF(Properties!E177=0,\"\",Properties!E177)","v":42},{"$f":"IF(Properties!G177=0,\"\",Properties!G177)","v":""},{"$f":"IF(Menu!$G$17=0,\"\",Menu!$G$17)","v":92},{"$f":"IF(Properties!H177=0,\"\",Properties!H177)","v":""},{"$f":"IF(Properties!$R$4=0,\"\",Properties!$R$4)","v":3},{"$f":"IF(Properties!I177=0,\"\",Properties!I177)","v":""},{"$f":"Properties!Z177","v":"NA"},{"$f":"Properties!AA177","v":"NA"},{"$f":"IF(Properties!J177=0,\"\",Properties!J177)","v":""},{"$f":"Properties!AB177","v":"NA"},{"$f":"Properties!AC177","v":"NA"},{"$f":"Properties!K177","v":0},{"$f":"Properties!AD177","v":"NA"},{"$f":"Properties!AE177","v":"NA"},{"$f":"IF(Properties!$L177=0,\"\",Properties!$L177)","v":""},{"$f":"IF(Properties!$L178=0,\"\",Properties!$L178)","v":""},{"$f":"IF(Properties!$L179=0,\"\",Properties!$L179)","v":""},{"$f":"IF(Properties!$L180=0,\"\",Properties!$L180)","v":""},{"$f":"IF(Properties!AF177=0,\"\",Properties!AF177)","v":"NA"},{"$f":"Properties!AG177","v":"NA"},{"$f":"Properties!AH177","v":"NA"},{"$f":"Properties!AI177","v":"NA"},{"$f":"IF(Properties!X177=0,\"\",Properties!X177)","v":""},{"$f":"IF(Properties!N177=0,\"\",Properties!N177)","v":""},{"$f":"Properties!AJ177","v":"NA"},{"$f":"Properties!AK177","v":"NA"},{"$f":"IF(Properties!O177=0,\"\",Properties!O177)","v":""},{"$f":"Properties!AL177","v":"NA"},{"$f":"Properties!AM177","v":"NA"},{"$f":"IF(Properties!P177=0,\"\",Properties!P177)","v":""},{"$f":"Properties!AN177","v":"NA"},{"$f":"Properties!AO177","v":"NA"},{"$f":"IF(Properties!$Q177=0,\"\",Properties!$Q177)","v":""},{"$f":"IF(Properties!$Q178=0,\"\",Properties!$Q178)","v":""},{"$f":"IF(Properties!$Q179=0,\"\",Properties!$Q179)","v":""},{"$f":"IF(Properties!$Q180=0,\"\",Properties!$Q180)","v":""},{"$f":"IF(Properties!AP177=0,\"\",Properties!AP177)","v":"NA"},{"$f":"Properties!AQ177","v":"NA"},{"$f":"Properties!AR177","v":"NA"},{"$f":"Properties!AS177","v":"NA"},{"$f":"IF(Properties!Y177=0,\"\",Properties!Y177)","v":""},{"$f":"IF(Properties!S177=0,\"\",Properties!S177)","v":""},{"$f":"Properties!AT177","v":"NA"},{"$f":"Properties!AU177","v":"NA"},{"$f":"IF(Properties!T177=0,\"\",Properties!T177)","v":""},{"$f":"Properties!AV177","v":"NA"},{"$f":"Properties!AW177","v":"NA"},{"$f":"IF(Properties!U177=0,\"\",Properties!U177)","v":""},{"$f":"Properties!AX177","v":"NA"},{"$f":"Properties!AY177","v":"NA"},{"$f":"IF(Properties!$V177=0,\"\",Properties!$V177)","v":""},{"$f":"IF(Properties!$V178=0,\"\",Properties!$V178)","v":""},{"$f":"IF(Properties!$V179=0,\"\",Properties!$V179)","v":""},{"$f":"IF(Properties!$V180=0,\"\",Properties!$V180)","v":""},{"$f":"IF(Properties!W177=0,\"\",Properties!W177)","v":""},{"$f":"Properties!BA177","v":"NA"},{"$f":"Properties!BB177","v":"NA"},{"$f":"Properties!BC177","v":"NA"}]
[null,{"$f":"IF(Menu!$C$5=0,\"\",Menu!$C$5)","v":""},{"$f":"IF(Menu!$C$6=0,\"\",Menu!$C$6)","v":""},{"$f":"IF(Menu!$C$7=0,\"\",Menu!$C$7)","v":""},{"$f":"IF(Menu!$C$8=0,\"\",Menu!$C$8)","v":""},{"$f":"IF(Menu!$C$9=0,\"\",Menu!$C$9)","v":""},{"$f":"IF(Menu!$C$10=0,\"\",Menu!$C$10)","v":""},{"$f":"IF(Menu!$F$7=0,\"\",Menu!$F$7)","v":"Std QA"},{"$f":"IF(Menu!$F$5=0,\"\",Menu!$F$5)","v":"2E03"},{"$f":"IF(Menu!$F$8=0,\"\",Menu!$F$8)","v":"Ignition"},{"$f":"IF(Properties!D181=0,\"\",Properties!D181)","v":""},{"$f":"IF(Properties!$G$5=0,\"\",Properties!$G$5)","v":"No"},{"$f":"IF(Properties!$C$9=0,\"\",Properties!$C$9)","v":""},{"$f":"IF(Properties!$G$3=0,\"\",Properties!$G$3)","v":""},{"$f":"IF(Properties!$G$4=0,\"\",Properties!$G$4)","v":"10-03"},{"$f":"IF(Properties!E181=0,\"\",Properties!E181)","v":43},{"$f":"IF(Properties!G181=0,\"\",Properties!G181)","v":""},{"$f":"IF(Menu!$G$17=0,\"\",Menu!$G$17)","v":92},{"$f":"IF(Properties!H181=0,\"\",Properties!H181)","v":""},{"$f":"IF(Properties!$R$4=0,\"\",Properties!$R$4)","v":3},{"$f":"IF(Properties!I181=0,\"\",Properties!I181)","v":""},{"$f":"Properties!Z181","v":"NA"},{"$f":"Properties!AA181","v":"NA"},{"$f":"IF(Properties!J181=0,\"\",Properties!J181)","v":""},{"$f":"Properties!AB181","v":"NA"},{"$f":"Properties!AC181","v":"NA"},{"$f":"Properties!K181","v":0},{"$f":"Properties!AD181","v":"NA"},{"$f":"Properties!AE181","v":"NA"},{"$f":"IF(Properties!$L181=0,\"\",Properties!$L181)","v":""},{"$f":"IF(Properties!$L182=0,\"\",Properties!$L182)","v":""},{"$f":"IF(Properties!$L183=0,\"\",Properties!$L183)","v":""},{"$f":"IF(Properties!$L184=0,\"\",Properties!$L184)","v":""},{"$f":"IF(Properties!AF181=0,\"\",Properties!AF181)","v":"NA"},{"$f":"Properties!AG181","v":"NA"},{"$f":"Properties!AH181","v":"NA"},{"$f":"Properties!AI181","v":"NA"},{"$f":"IF(Properties!X181=0,\"\",Properties!X181)","v":""},{"$f":"IF(Properties!N181=0,\"\",Properties!N181)","v":""},{"$f":"Properties!AJ181","v":"NA"},{"$f":"Properties!AK181","v":"NA"},{"$f":"IF(Properties!O181=0,\"\",Properties!O181)","v":""},{"$f":"Properties!AL181","v":"NA"},{"$f":"Properties!AM181","v":"NA"},{"$f":"IF(Properties!P181=0,\"\",Properties!P181)","v":""},{"$f":"Properties!AN181","v":"NA"},{"$f":"Properties!AO181","v":"NA"},{"$f":"IF(Properties!$Q181=0,\"\",Properties!$Q181)","v":""},{"$f":"IF(Properties!$Q182=0,\"\",Properties!$Q182)","v":""},{"$f":"IF(Properties!$Q183=0,\"\",Properties!$Q183)","v":""},{"$f":"IF(Properties!$Q184=0,\"\",Properties!$Q184)","v":""},{"$f":"IF(Properties!AP181=0,\"\",Properties!AP181)","v":"NA"},{"$f":"Properties!AQ181","v":"NA"},{"$f":"Properties!AR181","v":"NA"},{"$f":"Properties!AS181","v":"NA"},{"$f":"IF(Properties!Y181=0,\"\",Properties!Y181)","v":""},{"$f":"IF(Properties!S181=0,\"\",Properties!S181)","v":""},{"$f":"Properties!AT181","v":"NA"},{"$f":"Properties!AU181","v":"NA"},{"$f":"IF(Properties!T181=0,\"\",Properties!T181)","v":""},{"$f":"Properties!AV181","v":"NA"},{"$f":"Properties!AW181","v":"NA"},{"$f":"IF(Properties!U181=0,\"\",Properties!U181)","v":""},{"$f":"Properties!AX181","v":"NA"},{"$f":"Properties!AY181","v":"NA"},{"$f":"IF(Properties!$V181=0,\"\",Properties!$V181)","v":""},{"$f":"IF(Properties!$V182=0,\"\",Properties!$V182)","v":""},{"$f":"IF(Properties!$V183=0,\"\",Properties!$V183)","v":""},{"$f":"IF(Properties!$V184=0,\"\",Properties!$V184)","v":""},{"$f":"IF(Properties!W181=0,\"\",Properties!W181)","v":""},{"$f":"Properties!BA181","v":"NA"},{"$f":"Properties!BB181","v":"NA"},{"$f":"Properties!BC181","v":"NA"}]
[null,{"$f":"IF(Menu!$C$5=0,\"\",Menu!$C$5)","v":""},{"$f":"IF(Menu!$C$6=0,\"\",Menu!$C$6)","v":""},{"$f":"IF(Menu!$C$7=0,\"\",Menu!$C$7)","v":""},{"$f":"IF(Menu!$C$8=0,\"\",Menu!$C$8)","v":""},{"$f":"IF(Menu!$C$9=0,\"\",Menu!$C$9)","v":""},{"$f":"IF(Menu!$C$10=0,\"\",Menu!$C$10)","v":""},{"$f":"IF(Menu!$F$7=0,\"\",Menu!$F$7)","v":"Std QA"},{"$f":"IF(Menu!$F$5=0,\"\",Menu!$F$5)","v":"2E03"},{"$f":"IF(Menu!$F$8=0,\"\",Menu!$F$8)","v":"Ignition"},{"$f":"IF(Properties!D185=0,\"\",Properties!D185)","v":""},{"$f":"IF(Properties!$G$5=0,\"\",Properties!$G$5)","v":"No"},{"$f":"IF(Properties!$C$9=0,\"\",Properties!$C$9)","v":""},{"$f":"IF(Properties!$G$3=0,\"\",Properties!$G$3)","v":""},{"$f":"IF(Properties!$G$4=0,\"\",Properties!$G$4)","v":"10-03"},{"$f":"IF(Properties!E185=0,\"\",Properties!E185)","v":44},{"$f":"IF(Properties!G185=0,\"\",Properties!G185)","v":""},{"$f":"IF(Menu!$G$17=0,\"\",Menu!$G$17)","v":92},{"$f":"IF(Properties!H185=0,\"\",Properties!H185)","v":""},{"$f":"IF(Properties!$R$4=0,\"\",Properties!$R$4)","v":3},{"$f":"IF(Properties!I185=0,\"\",Properties!I185)","v":""},{"$f":"Properties!Z185","v":"NA"},{"$f":"Properties!AA185","v":"NA"},{"$f":"IF(Properties!J185=0,\"\",Properties!J185)","v":""},{"$f":"Properties!AB185","v":"NA"},{"$f":"Properties!AC185","v":"NA"},{"$f":"Properties!K185","v":0},{"$f":"Properties!AD185","v":"NA"},{"$f":"Properties!AE185","v":"NA"},{"$f":"IF(Properties!$L185=0,\"\",Properties!$L185)","v":""},{"$f":"IF(Properties!$L186=0,\"\",Properties!$L186)","v":""},{"$f":"IF(Properties!$L187=0,\"\",Properties!$L187)","v":""},{"$f":"IF(Properties!$L188=0,\"\",Properties!$L188)","v":""},{"$f":"IF(Properties!AF185=0,\"\",Properties!AF185)","v":"NA"},{"$f":"Properties!AG185","v":"NA"},{"$f":"Properties!AH185","v":"NA"},{"$f":"Properties!AI185","v":"NA"},{"$f":"IF(Properties!X185=0,\"\",Properties!X185)","v":""},{"$f":"IF(Properties!N185=0,\"\",Properties!N185)","v":""},{"$f":"Properties!AJ185","v":"NA"},{"$f":"Properties!AK185","v":"NA"},{"$f":"IF(Properties!O185=0,\"\",Properties!O185)","v":""},{"$f":"Properties!AL185","v":"NA"},{"$f":"Properties!AM185","v":"NA"},{"$f":"IF(Properties!P185=0,\"\",Properties!P185)","v":""},{"$f":"Properties!AN185","v":"NA"},{"$f":"Properties!AO185","v":"NA"},{"$f":"IF(Properties!$Q185=0,\"\",Properties!$Q185)","v":""},{"$f":"IF(Properties!$Q186=0,\"\",Properties!$Q186)","v":""},{"$f":"IF(Properties!$Q187=0,\"\",Properties!$Q187)","v":""},{"$f":"IF(Properties!$Q188=0,\"\",Properties!$Q188)","v":""},{"$f":"IF(Properties!AP185=0,\"\",Properties!AP185)","v":"NA"},{"$f":"Properties!AQ185","v":"NA"},{"$f":"Properties!AR185","v":"NA"},{"$f":"Properties!AS185","v":"NA"},{"$f":"IF(Properties!Y185=0,\"\",Properties!Y185)","v":""},{"$f":"IF(Properties!S185=0,\"\",Properties!S185)","v":""},{"$f":"Properties!AT185","v":"NA"},{"$f":"Properties!AU185","v":"NA"},{"$f":"IF(Properties!T185=0,\"\",Properties!T185)","v":""},{"$f":"Properties!AV185","v":"NA"},{"$f":"Properties!AW185","v":"NA"},{"$f":"IF(Properties!U185=0,\"\",Properties!U185)","v":""},{"$f":"Properties!AX185","v":"NA"},{"$f":"Properties!AY185","v":"NA"},{"$f":"IF(Properties!$V185=0,\"\",Properties!$V185)","v":""},{"$f":"IF(Properties!$V186=0,\"\",Properties!$V186)","v":""},{"$f":"IF(Properties!$V187=0,\"\",Properties!$V187)","v":""},{"$f":"IF(Properties!$V188=0,\"\",Properties!$V188)","v":""},{"$f":"IF(Properties!W185=0,\"\",Properties!W185)","v":""},{"$f":"Properties!BA185","v":"NA"},{"$f":"Properties!BB185","v":"NA"},{"$f":"Properties!BC185","v":"NA"}]
[null,{"$f":"IF(Menu!$C$5=0,\"\",Menu!$C$5)","v":""},{"$f":"IF(Menu!$C$6=0,\"\",Menu!$C$6)","v":""},{"$f":"IF(Menu!$C$7=0,\"\",Menu!$C$7)","v":""},{"$f":"IF(Menu!$C$8=0,\"\",Menu!$C$8)","v":""},{"$f":"IF(Menu!$C$9=0,\"\",Menu!$C$9)","v":""},{"$f":"IF(Menu!$C$10=0,\"\",Menu!$C$10)","v":""},{"$f":"IF(Menu!$F$7=0,\"\",Menu!$F$7)","v":"Std QA"},{"$f":"IF(Menu!$F$5=0,\"\",Menu!$F$5)","v":"2E03"},{"$f":"IF(Menu!$F$8=0,\"\",Menu!$F$8)","v":"Ignition"},{"$f":"IF(Properties!D189=0,\"\",Properties!D189)","v":""},{"$f":"IF(Properties!$G$5=0,\"\",Properties!$G$5)","v":"No"},{"$f":"IF(Properties!$C$9=0,\"\",Properties!$C$9)","v":""},{"$f":"IF(Properties!$G$3=0,\"\",Properties!$G$3)","v":""},{"$f":"IF(Properties!$G$4=0,\"\",Properties!$G$4)","v":"10-03"},{"$f":"IF(Properties!E189=0,\"\",Properties!E189)","v":45},{"$f":"IF(Properties!G189=0,\"\",Properties!G189)","v":""},{"$f":"IF(Menu!$G$17=0,\"\",Menu!$G$17)","v":92},{"$f":"IF(Properties!H189=0,\"\",Properties!H189)","v":""},{"$f":"IF(Properties!$R$4=0,\"\",Properties!$R$4)","v":3},{"$f":"IF(Properties!I189=0,\"\",Properties!I189)","v":""},{"$f":"Properties!Z189","v":"NA"},{"$f":"Properties!AA189","v":"NA"},{"$f":"IF(Properties!J189=0,\"\",Properties!J189)","v":""},{"$f":"Properties!AB189","v":"NA"},{"$f":"Properties!AC189","v":"NA"},{"$f":"Properties!K189","v":0},{"$f":"Properties!AD189","v":"NA"},{"$f":"Properties!AE189","v":"NA"},{"$f":"IF(Properties!$L189=0,\"\",Properties!$L189)","v":""},{"$f":"IF(Properties!$L190=0,\"\",Properties!$L190)","v":""},{"$f":"IF(Properties!$L191=0,\"\",Properties!$L191)","v":""},{"$f":"IF(Properties!$L192=0,\"\",Properties!$L192)","v":""},{"$f":"IF(Properties!AF189=0,\"\",Properties!AF189)","v":"NA"},{"$f":"Properties!AG189","v":"NA"},{"$f":"Properties!AH189","v":"NA"},{"$f":"Properties!AI189","v":"NA"},{"$f":"IF(Properties!X189=0,\"\",Properties!X189)","v":""},{"$f":"IF(Properties!N189=0,\"\",Properties!N189)","v":""},{"$f":"Properties!AJ189","v":"NA"},{"$f":"Properties!AK189","v":"NA"},{"$f":"IF(Properties!O189=0,\"\",Properties!O189)","v":""},{"$f":"Properties!AL189","v":"NA"},{"$f":"Properties!AM189","v":"NA"},{"$f":"IF(Properties!P189=0,\"\",Properties!P189)","v":""},{"$f":"Properties!AN189","v":"NA"},{"$f":"Properties!AO189","v":"NA"},{"$f":"IF(Properties!$Q189=0,\"\",Properties!$Q189)","v":""},{"$f":"IF(Properties!$Q190=0,\"\",Properties!$Q190)","v":""},{"$f":"IF(Properties!$Q191=0,\"\",Properties!$Q191)","v":""},{"$f":"IF(Properties!$Q192=0,\"\",Properties!$Q192)","v":""},{"$f":"IF(Properties!AP189=0,\"\",Properties!AP189)","v":"NA"},{"$f":"Properties!AQ189","v":"NA"},{"$f":"Properties!AR189","v":"NA"},{"$f":"Properties!AS189","v":"NA"},{"$f":"IF(Properties!Y189=0,\"\",Properties!Y189)","v":""},{"$f":"IF(Properties!S189=0,\"\",Properties!S189)","v":""},{"$f":"Properties!AT189","v":"NA"},{"$f":"Properties!AU189","v":"NA"},{"$f":"IF(Properties!T189=0,\"\",Properties!T189)","v":""},{"$f":"Properties!AV189","v":"NA"},{"$f":"Properties!AW189","v":"NA"},{"$f":"IF(Properties!U189=0,\"\",Properties!U189)","v":""},{"$f":"Properties!AX189","v":"NA"},{"$f":"Properties!AY189","v":"NA"},{"$f":"IF(Properties!$V189=0,\"\",Properties!$V189)","v":""},{"$f":"IF(Properties!$V190=0,\"\",Properties!$V190)","v":""},{"$f":"IF(Properties!$V191=0,\"\",Properties!$V191)","v":""},{"$f":"IF(Properties!$V192=0,\"\",Properties!$V192)","v":""},{"$f":"IF(Properties!W189=0,\"\",Properties!W189)","v":""},{"$f":"Properties!BA189","v":"NA"},{"$f":"Properties!BB189","v":"NA"},{"$f":"Properties!BC189","v":"NA"}]
[null,{"$f":"IF(Menu!$C$5=0,\"\",Menu!$C$5)","v":""},{"$f":"IF(Menu!$C$6=0,\"\",Menu!$C$6)","v":""},{"$f":"IF(Menu!$C$7=0,\"\",Menu!$C$7)","v":""},{"$f":"IF(Menu!$C$8=0,\"\",Menu!$C$8)","v":""},{"$f":"IF(Menu!$C$9=0,\"\",Menu!$C$9)","v":""},{"$f":"IF(Menu!$C$10=0,\"\",Menu!$C$10)","v":""},{"$f":"IF(Menu!$F$7=0,\"\",Menu!$F$7)","v":"Std QA"},{"$f":"IF(Menu!$F$5=0,\"\",Menu!$F$5)","v":"2E03"},{"$f":"IF(Menu!$F$8=0,\"\",Menu!$F$8)","v":"Ignition"},{"$f":"IF(Properties!D193=0,\"\",Properties!D193)","v":""},{"$f":"IF(Properties!$G$5=0,\"\",Properties!$G$5)","v":"No"},{"$f":"IF(Properties!$C$9=0,\"\",Properties!$C$9)","v":""},{"$f":"IF(Properties!$G$3=0,\"\",Properties!$G$3)","v":""},{"$f":"IF(Properties!$G$4=0,\"\",Properties!$G$4)","v":"10-03"},{"$f":"IF(Properties!E193=0,\"\",Properties!E193)","v":46},{"$f":"IF(Properties!G193=0,\"\",Properties!G193)","v":""},{"$f":"IF(Menu!$G$17=0,\"\",Menu!$G$17)","v":92},{"$f":"IF(Properties!H193=0,\"\",Properties!H193)","v":""},{"$f":"IF(Properties!$R$4=0,\"\",Properties!$R$4)","v":3},{"$f":"IF(Properties!I193=0,\"\",Properties!I193)","v":""},{"$f":"Properties!Z193","v":"NA"},{"$f":"Properties!AA193","v":"NA"},{"$f":"IF(Properties!J193=0,\"\",Properties!J193)","v":""},{"$f":"Properties!AB193","v":"NA"},{"$f":"Properties!AC193","v":"NA"},{"$f":"Properties!K193","v":0},{"$f":"Properties!AD193","v":"NA"},{"$f":"Properties!AE193","v":"NA"},{"$f":"IF(Properties!$L193=0,\"\",Properties!$L193)","v":""},{"$f":"IF(Properties!$L194=0,\"\",Properties!$L194)","v":""},{"$f":"IF(Properties!$L195=0,\"\",Properties!$L195)","v":""},{"$f":"IF(Properties!$L196=0,\"\",Properties!$L196)","v":""},{"$f":"IF(Properties!AF193=0,\"\",Properties!AF193)","v":"NA"},{"$f":"Properties!AG193","v":"NA"},{"$f":"Properties!AH193","v":"NA"},{"$f":"Properties!AI193","v":"NA"},{"$f":"IF(Properties!X193=0,\"\",Properties!X193)","v":""},{"$f":"IF(Properties!N193=0,\"\",Properties!N193)","v":""},{"$f":"Properties!AJ193","v":"NA"},{"$f":"Properties!AK193","v":"NA"},{"$f":"IF(Properties!O193=0,\"\",Properties!O193)","v":""},{"$f":"Properties!AL193","v":"NA"},{"$f":"Properties!AM193","v":"NA"},{"$f":"IF(Properties!P193=0,\"\",Properties!P193)","v":""},{"$f":"Properties!AN193","v":"NA"},{"$f":"Properties!AO193","v":"NA"},{"$f":"IF(Properties!$Q193=0,\"\",Properties!$Q193)","v":""},{"$f":"IF(Properties!$Q194=0,\"\",Properties!$Q194)","v":""},{"$f":"IF(Properties!$Q195=0,\"\",Properties!$Q195)","v":""},{"$f":"IF(Properties!$Q196=0,\"\",Properties!$Q196)","v":""},{"$f":"IF(Properties!AP193=0,\"\",Properties!AP193)","v":"NA"},{"$f":"Properties!AQ193","v":"NA"},{"$f":"Properties!AR193","v":"NA"},{"$f":"Properties!AS193","v":"NA"},{"$f":"IF(Properties!Y193=0,\"\",Properties!Y193)","v":""},{"$f":"IF(Properties!S193=0,\"\",Properties!S193)","v":""},{"$f":"Properties!AT193","v":"NA"},{"$f":"Properties!AU193","v":"NA"},{"$f":"IF(Properties!T193=0,\"\",Properties!T193)","v":""},{"$f":"Properties!AV193","v":"NA"},{"$f":"Properties!AW193","v":"NA"},{"$f":"IF(Properties!U193=0,\"\",Properties!U193)","v":""},{"$f":"Properties!AX193","v":"NA"},{"$f":"Properties!AY193","v":"NA"},{"$f":"IF(Properties!$V193=0,\"\",Properties!$V193)","v":""},{"$f":"IF(Properties!$V194=0,\"\",Properties!$V194)","v":""},{"$f":"IF(Properties!$V195=0,\"\",Properties!$V195)","v":""},{"$f":"IF(Properties!$V196=0,\"\",Properties!$V196)","v":""},{"$f":"IF(Properties!W193=0,\"\",Properties!W193)","v":""},{"$f":"Properties!BA193","v":"NA"},{"$f":"Properties!BB193","v":"NA"},{"$f":"Properties!BC193","v":"NA"}]
[null,{"$f":"IF(Menu!$C$5=0,\"\",Menu!$C$5)","v":""},{"$f":"IF(Menu!$C$6=0,\"\",Menu!$C$6)","v":""},{"$f":"IF(Menu!$C$7=0,\"\",Menu!$C$7)","v":""},{"$f":"IF(Menu!$C$8=0,\"\",Menu!$C$8)","v":""},{"$f":"IF(Menu!$C$9=0,\"\",Menu!$C$9)","v":""},{"$f":"IF(Menu!$C$10=0,\"\",Menu!$C$10)","v":""},{"$f":"IF(Menu!$F$7=0,\"\",Menu!$F$7)","v":"Std QA"},{"$f":"IF(Menu!$F$5=0,\"\",Menu!$F$5)","v":"2E03"},{"$f":"IF(Menu!$F$8=0,\"\",Menu!$F$8)","v":"Ignition"},{"$f":"IF(Properties!D197=0,\"\",Properties!D197)","v":""},{"$f":"IF(Properties!$G$5=0,\"\",Properties!$G$5)","v":"No"},{"$f":"IF(Properties!$C$9=0,\"\",Properties!$C$9)","v":""},{"$f":"IF(Properties!$G$3=0,\"\",Properties!$G$3)","v":""},{"$f":"IF(Properties!$G$4=0,\"\",Properties!$G$4)","v":"10-03"},{"$f":"IF(Properties!E197=0,\"\",Properties!E197)","v":47},{"$f":"IF(Properties!G197=0,\"\",Properties!G197)","v":""},{"$f":"IF(Menu!$G$17=0,\"\",Menu!$G$17)","v":92},{"$f":"IF(Properties!H197=0,\"\",Properties!H197)","v":""},{"$f":"IF(Properties!$R$4=0,\"\",Properties!$R$4)","v":3},{"$f":"IF(Properties!I197=0,\"\",Properties!I197)","v":""},{"$f":"Properties!Z197","v":"NA"},{"$f":"Properties!AA197","v":"NA"},{"$f":"IF(Properties!J197=0,\"\",Properties!J197)","v":""},{"$f":"Properties!AB197","v":"NA"},{"$f":"Properties!AC197","v":"NA"},{"$f":"Properties!K197","v":0},{"$f":"Properties!AD197","v":"NA"},{"$f":"Properties!AE197","v":"NA"},{"$f":"IF(Properties!$L197=0,\"\",Properties!$L197)","v":""},{"$f":"IF(Properties!$L198=0,\"\",Properties!$L198)","v":""},{"$f":"IF(Properties!$L199=0,\"\",Properties!$L199)","v":""},{"$f":"IF(Properties!$L200=0,\"\",Properties!$L200)","v":""},{"$f":"IF(Properties!AF197=0,\"\",Properties!AF197)","v":"NA"},{"$f":"Properties!AG197","v":"NA"},{"$f":"Properties!AH197","v":"NA"},{"$f":"Properties!AI197","v":"NA"},{"$f":"IF(Properties!X197=0,\"\",Properties!X197)","v":""},{"$f":"IF(Properties!N197=0,\"\",Properties!N197)","v":""},{"$f":"Properties!AJ197","v":"NA"},{"$f":"Properties!AK197","v":"NA"},{"$f":"IF(Properties!O197=0,\"\",Properties!O197)","v":""},{"$f":"Properties!AL197","v":"NA"},{"$f":"Properties!AM197","v":"NA"},{"$f":"IF(Properties!P197=0,\"\",Properties!P197)","v":""},{"$f":"Properties!AN197","v":"NA"},{"$f":"Properties!AO197","v":"NA"},{"$f":"IF(Properties!$Q197=0,\"\",Properties!$Q197)","v":""},{"$f":"IF(Properties!$Q198=0,\"\",Properties!$Q198)","v":""},{"$f":"IF(Properties!$Q199=0,\"\",Properties!$Q199)","v":""},{"$f":"IF(Properties!$Q200=0,\"\",Properties!$Q200)","v":""},{"$f":"IF(Properties!AP197=0,\"\",Properties!AP197)","v":"NA"},{"$f":"Properties!AQ197","v":"NA"},{"$f":"Properties!AR197","v":"NA"},{"$f":"Properties!AS197","v":"NA"},{"$f":"IF(Properties!Y197=0,\"\",Properties!Y197)","v":""},{"$f":"IF(Properties!S197=0,\"\",Properties!S197)","v":""},{"$f":"Properties!AT197","v":"NA"},{"$f":"Properties!AU197","v":"NA"},{"$f":"IF(Properties!T197=0,\"\",Properties!T197)","v":""},{"$f":"Properties!AV197","v":"NA"},{"$f":"Properties!AW197","v":"NA"},{"$f":"IF(Properties!U197=0,\"\",Properties!U197)","v":""},{"$f":"Properties!AX197","v":"NA"},{"$f":"Properties!AY197","v":"NA"},{"$f":"IF(Properties!$V197=0,\"\",Properties!$V197)","v":""},{"$f":"IF(Properties!$V198=0,\"\",Properties!$V198)","v":""},{"$f":"IF(Properties!$V199=0,\"\",Properties!$V199)","v":""},{"$f":"IF(Properties!$V200=0,\"\",Properties!$V200)","v":""},{"$f":"IF(Properties!W197=0,\"\",Properties!W197)","v":""},{"$f":"Properties!BA197","v":"NA"},{"$f":"Properties!BB197","v":"NA"},{"$f":"Properties!BC197","v":"NA"}]
[null,{"$f":"IF(Menu!$C$5=0,\"\",Menu!$C$5)","v":""},{"$f":"IF(Menu!$C$6=0,\"\",Menu!$C$6)","v":""},{"$f":"IF(Menu!$C$7=0,\"\",Menu!$C$7)","v":""},{"$f":"IF(Menu!$C$8=0,\"\",Menu!$C$8)","v":""},{"$f":"IF(Menu!$C$9=0,\"\",Menu!$C$9)","v":""},{"$f":"IF(Menu!$C$10=0,\"\",Menu!$C$10)","v":""},{"$f":"IF(Menu!$F$7=0,\"\",Menu!$F$7)","v":"Std QA"},{"$f":"IF(Menu!$F$5=0,\"\",Menu!$F$5)","v":"2E03"},{"$f":"IF(Menu!$F$8=0,\"\",Menu!$F$8)","v":"Ignition"},{"$f":"IF(Properties!D201=0,\"\",Properties!D201)","v":""},{"$f":"IF(Properties!$G$5=0,\"\",Properties!$G$5)","v":"No"},{"$f":"IF(Properties!$C$9=0,\"\",Properties!$C$9)","v":""},{"$f":"IF(Properties!$G$3=0,\"\",Properties!$G$3)","v":""},{"$f":"IF(Properties!$G$4=0,\"\",Properties!$G$4)","v":"10-03"},{"$f":"IF(Properties!E201=0,\"\",Properties!E201)","v":48},{"$f":"IF(Properties!G201=0,\"\",Properties!G201)","v":""},{"$f":"IF(Menu!$G$17=0,\"\",Menu!$G$17)","v":92},{"$f":"IF(Properties!H201=0,\"\",Properties!H201)","v":""},{"$f":"IF(Properties!$R$4=0,\"\",Properties!$R$4)","v":3},{"$f":"IF(Properties!I201=0,\"\",Properties!I201)","v":""},{"$f":"Properties!Z201","v":"NA"},{"$f":"Properties!AA201","v":"NA"},{"$f":"IF(Properties!J201=0,\"\",Properties!J201)","v":""},{"$f":"Properties!AB201","v":"NA"},{"$f":"Properties!AC201","v":"NA"},{"$f":"Properties!K201","v":0},{"$f":"Properties!AD201","v":"NA"},{"$f":"Properties!AE201","v":"NA"},{"$f":"IF(Properties!$L201=0,\"\",Properties!$L201)","v":""},{"$f":"IF(Properties!$L202=0,\"\",Properties!$L202)","v":""},{"$f":"IF(Properties!$L203=0,\"\",Properties!$L203)","v":""},{"$f":"IF(Properties!$L204=0,\"\",Properties!$L204)","v":""},{"$f":"IF(Properties!AF201=0,\"\",Properties!AF201)","v":"NA"},{"$f":"Properties!AG201","v":"NA"},{"$f":"Properties!AH201","v":"NA"},{"$f":"Properties!AI201","v":"NA"},{"$f":"IF(Properties!X201=0,\"\",Properties!X201)","v":""},{"$f":"IF(Properties!N201=0,\"\",Properties!N201)","v":""},{"$f":"Properties!AJ201","v":"NA"},{"$f":"Properties!AK201","v":"NA"},{"$f":"IF(Properties!O201=0,\"\",Properties!O201)","v":""},{"$f":"Properties!AL201","v":"NA"},{"$f":"Properties!AM201","v":"NA"},{"$f":"IF(Properties!P201=0,\"\",Properties!P201)","v":""},{"$f":"Properties!AN201","v":"NA"},{"$f":"Properties!AO201","v":"NA"},{"$f":"IF(Properties!$Q201=0,\"\",Properties!$Q201)","v":""},{"$f":"IF(Properties!$Q202=0,\"\",Properties!$Q202)","v":""},{"$f":"IF(Properties!$Q203=0,\"\",Properties!$Q203)","v":""},{"$f":"IF(Properties!$Q204=0,\"\",Properties!$Q204)","v":""},{"$f":"IF(Properties!AP201=0,\"\",Properties!AP201)","v":"NA"},{"$f":"Properties!AQ201","v":"NA"},{"$f":"Properties!AR201","v":"NA"},{"$f":"Properties!AS201","v":"NA"},{"$f":"IF(Properties!Y201=0,\"\",Properties!Y201)","v":""},{"$f":"IF(Properties!S201=0,\"\",Properties!S201)","v":""},{"$f":"Properties!AT201","v":"NA"},{"$f":"Properties!AU201","v":"NA"},{"$f":"IF(Properties!T201=0,\"\",Properties!T201)","v":""},{"$f":"Properties!AV201","v":"NA"},{"$f":"Properties!AW201","v":"NA"},{"$f":"IF(Properties!U201=0,\"\",Properties!U201)","v":""},{"$f":"Properties!AX201","v":"NA"},{"$f":"Properties!AY201","v":"NA"},{"$f":"IF(Properties!$V201=0,\"\",Properties!$V201)","v":""},{"$f":"IF(Properties!$V202=0,\"\",Properties!$V202)","v":""},{"$f":"IF(Properties!$V203=0,\"\",Properties!$V203)","v":""},{"$f":"IF(Properties!$V204=0,\"\",Properties!$V204)","v":""},{"$f":"IF(Properties!W201=0,\"\",Properties!W201)","v":""},{"$f":"Properties!BA201","v":"NA"},{"$f":"Properties!BB201","v":"NA"},{"$f":"Properties!BC201","v":"NA"}]
[null,{"$f":"IF(Menu!$C$5=0,\"\",Menu!$C$5)","v":""},{"$f":"IF(Menu!$C$6=0,\"\",Menu!$C$6)","v":""},{"$f":"IF(Menu!$C$7=0,\"\",Menu!$C$7)","v":""},{"$f":"IF(Menu!$C$8=0,\"\",Menu!$C$8)","v":""},{"$f":"IF(Menu!$C$9=0,\"\",Menu!$C$9)","v":""},{"$f":"IF(Menu!$C$10=0,\"\",Menu!$C$10)","v":""},{"$f":"IF(Menu!$F$7=0,\"\",Menu!$F$7)","v":"Std QA"},{"$f":"IF(Menu!$F$5=0,\"\",Menu!$F$5)","v":"2E03"},{"$f":"IF(Menu!$F$8=0,\"\",Menu!$F$8)","v":"Ignition"},{"$f":"IF(Properties!D205=0,\"\",Properties!D205)","v":""},{"$f":"IF(Properties!$G$5=0,\"\",Properties!$G$5)","v":"No"},{"$f":"IF(Properties!$C$9=0,\"\",Properties!$C$9)","v":""},{"$f":"IF(Properties!$G$3=0,\"\",Properties!$G$3)","v":""},{"$f":"IF(Properties!$G$4=0,\"\",Properties!$G$4)","v":"10-03"},{"$f":"IF(Properties!E205=0,\"\",Properties!E205)","v":49},{"$f":"IF(Properties!G205=0,\"\",Properties!G205)","v":""},{"$f":"IF(Menu!$G$17=0,\"\",Menu!$G$17)","v":92},{"$f":"IF(Properties!H205=0,\"\",Properties!H205)","v":""},{"$f":"IF(Properties!$R$4=0,\"\",Properties!$R$4)","v":3},{"$f":"IF(Properties!I205=0,\"\",Properties!I205)","v":""},{"$f":"Properties!Z205","v":"NA"},{"$f":"Properties!AA205","v":"NA"},{"$f":"IF(Properties!J205=0,\"\",Properties!J205)","v":""},{"$f":"Properties!AB205","v":"NA"},{"$f":"Properties!AC205","v":"NA"},{"$f":"Properties!K205","v":0},{"$f":"Properties!AD205","v":"NA"},{"$f":"Properties!AE205","v":"NA"},{"$f":"IF(Properties!$L205=0,\"\",Properties!$L205)","v":""},{"$f":"IF(Properties!$L206=0,\"\",Properties!$L206)","v":""},{"$f":"IF(Properties!$L207=0,\"\",Properties!$L207)","v":""},{"$f":"IF(Properties!$L208=0,\"\",Properties!$L208)","v":""},{"$f":"IF(Properties!AF205=0,\"\",Properties!AF205)","v":"NA"},{"$f":"Properties!AG205","v":"NA"},{"$f":"Properties!AH205","v":"NA"},{"$f":"Properties!AI205","v":"NA"},{"$f":"IF(Properties!X205=0,\"\",Properties!X205)","v":""},{"$f":"IF(Properties!N205=0,\"\",Properties!N205)","v":""},{"$f":"Properties!AJ205","v":"NA"},{"$f":"Properties!AK205","v":"NA"},{"$f":"IF(Properties!O205=0,\"\",Properties!O205)","v":""},{"$f":"Properties!AL205","v":"NA"},{"$f":"Properties!AM205","v":"NA"},{"$f":"IF(Properties!P205=0,\"\",Properties!P205)","v":""},{"$f":"Properties!AN205","v":"NA"},{"$f":"Properties!AO205","v":"NA"},{"$f":"IF(Properties!$Q205=0,\"\",Properties!$Q205)","v":""},{"$f":"IF(Properties!$Q206=0,\"\",Properties!$Q206)","v":""},{"$f":"IF(Properties!$Q207=0,\"\",Properties!$Q207)","v":""},{"$f":"IF(Properties!$Q208=0,\"\",Properties!$Q208)","v":""},{"$f":"IF(Properties!AP205=0,\"\",Properties!AP205)","v":"NA"},{"$f":"Properties!AQ205","v":"NA"},{"$f":"Properties!AR205","v":"NA"},{"$f":"Properties!AS205","v":"NA"},{"$f":"IF(Properties!Y205=0,\"\",Properties!Y205)","v":""},{"$f":"IF(Properties!S205=0,\"\",Properties!S205)","v":""},{"$f":"Properties!AT205","v":"NA"},{"$f":"Properties!AU205","v":"NA"},{"$f":"IF(Properties!T205=0,\"\",Properties!T205)","v":""},{"$f":"Properties!AV205","v":"NA"},{"$f":"Properties!AW205","v":"NA"},{"$f":"IF(Properties!U205=0,\"\",Properties!U205)","v":""},{"$f":"Properties!AX205","v":"NA"},{"$f":"Properties!AY205","v":"NA"},{"$f":"IF(Properties!$V205=0,\"\",Properties!$V205)","v":""},{"$f":"IF(Properties!$V206=0,\"\",Properties!$V206)","v":""},{"$f":"IF(Properties!$V207=0,\"\",Properties!$V207)","v":""},{"$f":"IF(Properties!$V208=0,\"\",Properties!$V208)","v":""},{"$f":"IF(Properties!W205=0,\"\",Properties!W205)","v":""},{"$f":"Properties!BA205","v":"NA"},{"$f":"Properties!BB205","v":"NA"},{"$f":"Properties!BC205","v":"NA"}]
[null,{"$f":"IF(Menu!$C$5=0,\"\",Menu!$C$5)","v":""},{"$f":"IF(Menu!$C$6=0,\"\",Menu!$C$6)","v":""},{"$f":"IF(Menu!$C$7=0,\"\",Menu!$C$7)","v":""},{"$f":"IF(Menu!$C$8=0,\"\",Menu!$C$8)","v":""},{"$f":"IF(Menu!$C$9=0,\"\",Menu!$C$9)","v":""},{"$f":"IF(Menu!$C$10=0,\"\",Menu!$C$10)","v":""},{"$f":"IF(Menu!$F$7=0,\"\",Menu!$F$7)","v":"Std QA"},{"$f":"IF(Menu!$F$5=0,\"\",Menu!$F$5)","v":"2E03"},{"$f":"IF(Menu!$F$8=0,\"\",Menu!$F$8)","v":"Ignition"},{"$f":"IF(Properties!D209=0,\"\",Properties!D209)","v":""},{"$f":"IF(Properties!$G$5=0,\"\",Properties!$G$5)","v":"No"},{"$f":"IF(Properties!$C$9=0,\"\",Properties!$C$9)","v":""},{"$f":"IF(Properties!$G$3=0,\"\",Properties!$G$3)","v":""},{"$f":"IF(Properties!$G$4=0,\"\",Properties!$G$4)","v":"10-03"},{"$f":"IF(Properties!E209=0,\"\",Properties!E209)","v":50},{"$f":"IF(Properties!G209=0,\"\",Properties!G209)","v":""},{"$f":"IF(Menu!$G$17=0,\"\",Menu!$G$17)","v":92},{"$f":"IF(Properties!H209=0,\"\",Properties!H209)","v":""},{"$f":"IF(Properties!$R$4=0,\"\",Properties!$R$4)","v":3},{"$f":"IF(Properties!I209=0,\"\",Properties!I209)","v":""},{"$f":"Properties!Z209","v":"NA"},{"$f":"Properties!AA209","v":"NA"},{"$f":"IF(Properties!J209=0,\"\",Properties!J209)","v":""},{"$f":"Properties!AB209","v":"NA"},{"$f":"Properties!AC209","v":"NA"},{"$f":"Properties!K209","v":0},{"$f":"Properties!AD209","v":"NA"},{"$f":"Properties!AE209","v":"NA"},{"$f":"IF(Properties!$L209=0,\"\",Properties!$L209)","v":""},{"$f":"IF(Properties!$L210=0,\"\",Properties!$L210)","v":""},{"$f":"IF(Properties!$L211=0,\"\",Properties!$L211)","v":""},{"$f":"IF(Properties!$L212=0,\"\",Properties!$L212)","v":""},{"$f":"IF(Properties!AF209=0,\"\",Properties!AF209)","v":"NA"},{"$f":"Properties!AG209","v":"NA"},{"$f":"Properties!AH209","v":"NA"},{"$f":"Properties!AI209","v":"NA"},{"$f":"IF(Properties!X209=0,\"\",Properties!X209)","v":""},{"$f":"IF(Properties!N209=0,\"\",Properties!N209)","v":""},{"$f":"Properties!AJ209","v":"NA"},{"$f":"Properties!AK209","v":"NA"},{"$f":"IF(Properties!O209=0,\"\",Properties!O209)","v":""},{"$f":"Properties!AL209","v":"NA"},{"$f":"Properties!AM209","v":"NA"},{"$f":"IF(Properties!P209=0,\"\",Properties!P209)","v":""},{"$f":"Properties!AN209","v":"NA"},{"$f":"Properties!AO209","v":"NA"},{"$f":"IF(Properties!$Q209=0,\"\",Properties!$Q209)","v":""},{"$f":"IF(Properties!$Q210=0,\"\",Properties!$Q210)","v":""},{"$f":"IF(Properties!$Q211=0,\"\",Properties!$Q211)","v":""},{"$f":"IF(Properties!$Q212=0,\"\",Properties!$Q212)","v":""},{"$f":"IF(Properties!AP209=0,\"\",Properties!AP209)","v":"NA"},{"$f":"Properties!AQ209","v":"NA"},{"$f":"Properties!AR209","v":"NA"},{"$f":"Properties!AS209","v":"NA"},{"$f":"IF(Properties!Y209=0,\"\",Properties!Y209)","v":""},{"$f":"IF(Properties!S209=0,\"\",Properties!S209)","v":""},{"$f":"Properties!AT209","v":"NA"},{"$f":"Properties!AU209","v":"NA"},{"$f":"IF(Properties!T209=0,\"\",Properties!T209)","v":""},{"$f":"Properties!AV209","v":"NA"},{"$f":"Properties!AW209","v":"NA"},{"$f":"IF(Properties!U209=0,\"\",Properties!U209)","v":""},{"$f":"Properties!AX209","v":"NA"},{"$f":"Properties!AY209","v":"NA"},{"$f":"IF(Properties!$V209=0,\"\",Properties!$V209)","v":""},{"$f":"IF(Properties!$V210=0,\"\",Properties!$V210)","v":""},{"$f":"IF(Properties!$V211=0,\"\",Properties!$V211)","v":""},{"$f":"IF(Properties!$V212=0,\"\",Properties!$V212)","v":""},{"$f":"IF(Properties!W209=0,\"\",Properties!W209)","v":""},{"$f":"Properties!BA209","v":"NA"},{"$f":"Properties!BB209","v":"NA"},{"$f":"Properties!BC209","v":"NA"}]